##TITLE= testspec
##JCAMPDX= 5.0         $$ Bruker NMR JCAMP-DX V1.0
##DATA TYPE= NMR Spectrum
##DATA CLASS= XYDATA
##ORIGIN= uk
##OWNER= uk
##.OBSERVE FREQUENCY= 100.4
##.OBSERVE NUCLEUS= ^13C
##.ACQUISITION MODE= SIMULTANEOUS
##.AVERAGES= 32
##.DIGITISER RES= 16
##SPECTROMETER/DATA SYSTEM= JEOL GX 400
$$ Bruker specific parameters
$$ --------------------------
##$AQ_mod= 1 
##$AUNM= <au_zgsino>
##$BF1= 100.4 
##$BF2= 360.131842 
##$BF3= 100.13 
##$BF4= 500.13 
##$BYTORDA= 0 
##$CNST= (0..31)
1 1 1 1 1 1 1 1 1 1 1 1 1 1 1 1 1 1 1 1 1 1 1 1 1 1 1 1 1 1 1 1 
##$CPDPRG= <waltz16>
##$CPDPRGB= <waltz16>
##$CPDPRGT= <bb>
##$D= (0..31)
0 1 0 0 0 0 0 0 0 0 0 0 0 0 0 0 0 0 0 0 0 0 0 0 0 0 0 0 0 0 0 0 
##$DATE= 0 
##$DBL= (0..7)
120 120 120 120 120 120 120 120 
##$DBP= (0..7)
150 150 150 150 150 150 150 150 
##$DBP07= 0 
##$DBPNAM0= <>
##$DBPNAM1= <>
##$DBPNAM2= <>
##$DBPNAM3= <>
##$DBPNAM4= <>
##$DBPNAM5= <>
##$DBPNAM6= <>
##$DBPNAM7= <>
##$DBPOFFS= (0..7)
0 0 0 0 0 0 0 0 
##$DE= 60 
##$DECBNUC= <>
##$DECNUC= <1H>
##$DECSTAT= 4 
##$DIGTYP= 1 
##$DL= (0..7)
0 0 0 0 0 0 0 0 
##$DP= (0..7)
150 150 150 150 150 150 150 150 
##$DP07= 0 
##$DPNAME0= <>
##$DPNAME1= <>
##$DPNAME2= <>
##$DPNAME3= <>
##$DPNAME4= <>
##$DPNAME5= <>
##$DPNAME6= <>
##$DPNAME7= <>
##$DPOFFS= (0..7)
0 0 0 0 0 0 0 0 
##$DR= 16 
##$DS= 2 
##$DSLIST= <SSSSSSSSSSSSSSS>
##$DTYPA= 0 
##$EXP= <PS done>
##$F1LIST= <111111111111111>
##$F2LIST= <222222222222222>
##$F3LIST= <333333333333333>
##$FL1= 90 
##$FL2= 90 
##$FL3= 90 
##$FL4= 90 
##$FOV= 20 
##$FS= (0..7)
83 83 83 83 83 83 83 83 
##$FW= 13020.83 
##$GRDPROG= <>
##$HL1= 1 
##$HL2= 20 
##$HL3= 90 
##$HL4= 90 
##$HPPRGN= 0 
##$IN= (0..31)
0.001 0.001 0.001 0.001 0.001 0.001 0.001 0.001 0.001 0.001 0.001 0.001 
0.001 0.001 0.001 0.001 0.001 0.001 0.001 0.001 0.001 0.001 0.001 0.001 
0.001 0.001 0.001 0.001 0.001 0.001 0.001 0.001 
##$INP= (0..31)
0 0 0 0 0 0 0 0 0 0 0 0 0 0 0 0 0 0 0 0 0 0 0 0 0 0 0 0 0 0 0 0 
##$INSTRUM= <JEOL GX 400>
##$L= (0..31)
1 1 1 1 1 1 1 1 1 1 1 1 1 1 1 1 1 1 1 1 1 1 1 1 1 1 1 1 1 1 1 1 
##$LOCNUC= <2H>
##$NBL= 1 
##$NC= 0 
##$NS= 32 
##$NUCLEUS= <13C>
##$O1= 8601.908255 
##$O2= 0 
##$O3= 0 
##$O4= 0 
##$P= (0..31)
0 15 30 11 22 0 0 0 0 0 0 0 0 0 0 0 0 0 0 0 0 0 0 0 0 0 0 0 0 0 0 0 
##$PAPS= 2 
##$PARMODE= 0 
##$PHCOR= (0..31)
0 0 0 0 0 0 0 0 0 0 0 0 0 0 0 0 0 0 0 0 0 0 0 0 0 0 0 0 0 0 0 0 
##$PHP= 1 
##$PH_ref= 0 
##$POWMOD= 0 
##$PR= 1 
##$PRGAIN= 0 
##$PROBHD= <06>
##$PULPROG= <baxcotest.be>
##$PW= 0 
##$QNP= 1 
##$RD= 21 
##$RG= 256 
##$RO= 0 
##$ROUTWD1= (0..23)
0 0 0 0 0 0 0 0 0 0 0 0 0 0 0 0 0 0 0 0 1 1 0 0 
##$ROUTWD2= (0..23)
0 0 0 0 0 1 0 0 0 0 0 0 0 0 0 0 0 0 1 0 1 1 0 0 
##$S= (0..7)
83 1 83 83 83 83 83 83 
##$SEOUT= 0 
##$SFO1= 100.4 
##$SFO2= 360.133268 
##$SFO3= 360.133268 
##$SFO4= 500.13 
##$SOLVENT= <MeOH>
##$SP= 1 
##$SW= 20.82756 
##$SW_h= 10416.666667 
##$TD= 32768 
##$TE= 273.16 
##$TL= (0..7)
120 120 120 120 120 120 120 120 
##$TP= (0..7)
150 150 150 150 150 150 150 150 
##$TP07= 0 
##$TPNAME0= <gsc.3>
##$TPNAME1= <>
##$TPNAME2= <gsc.2>
##$TPNAME3= <>
##$TPNAME4= <gsc.1>
##$TPNAME5= <           jjj>
##$TPNAME6= <              >
##$TPNAME7= <gsc.5>
##$TPOFFS= (0..7)
0 0 0 0 0 0 0 0 
##$V9= 5 
##$VCLIST= <CCCCCCCCCCCCCCC>
##$VD= 0 
##$VDLIST= <depevd>
##$VPLIST= <PPPPPPPPPPPPPPP>
##$VTLIST= <vttest>
##$WBST= 256 
##$WBSW= 4 
##$XL= 0 
##$YL= 0 
##$YMAX_a= 0 
##$YMIN_a= 0 
##$ABSF1= 10 
##$ABSF2= 0 
##$ABSG= 3 
##$ABSL= 3 
##$ALPHA= 0 
##$AQORDER= 0 
##$ASSFAC= 0 
##$ASSFACI= 0 
##$ASSFACX= 0 
##$ASSWID= 0 
##$AUNMP= <proc_1d>
##$AZFE= 0.1 
##$AZFW= 0.1 
##$BCFW= 1 
##$BC_mod= 2 
##$BYTORDP= 0 
##$DATMOD= 1 
##$DC= 1.2345 
##$DFILT= <>
##$DTYPP= 0 
##$FCOR= 0.5 
##$FT_mod= 4 
##$GAMMA= 1 
##$GB= 0 
##$INTBC= 1 
##$INTSCL= 1 
##$ISEN= 128 
##$LB= 0.3 
##$LEV0= 0 
##$LPBIN= 0 
##$MAXI= 10000 
##$MC2= 0 
##$MEAN= 0 
##$ME_mod= 0 
##$MI= 0 
##$NCOEF= 0 
##$NC_proc= 0 
##$NLEV= 6 
##$NOISF1= 0 
##$NOISF2= 0 
##$NSP= 1 
##$NTH_PF= 0 
##$NTH_PI= 0 
##$NZP= 0 
##$OFFSET= 239.4273 
##$PC= 1 
##$PHC0= 103.0203 
##$PHC1= 38.4532 
##$PH_mod= 0 
##$PKNL= yes 
##$PPARMOD= 0 
##$PSCAL= 0 
##$PSIGN= 0 
##$REVERSE= no 
##$SF= 100.4 
##$SI= 16384 
##$SIGF1= 0 
##$SIGF2= 0 
##$SINO= 400 
##$SREGLST= <1H.MeOH>
##$SSB= 1 
##$STSI= 0 
##$STSR= 0 
##$SW_p= 24038.5 
##$SYMM= 0 
##$S_DEV= 0 
##$TDeff= 0 
##$TDoff= 0 
##$TI= <>
##$TILT= no 
##$TM1= 0 
##$TM2= 0 
##$TOPLEV= 0 
##$WDW= 1 
##$XDIM= 8192 
##$YMAX_p= 972201806 
##$YMIN_p= -27593240 
$$ End of Bruker specific parameters
$$ ---------------------------------
##XUNITS= HZ       
##YUNITS= ARBITRARY UNITS
##XFACTOR= 1.46728315937252 
##YFACTOR= 1
##FIRSTX= 24038.5 
##LASTX= 0 
##DELTAX= -1.46728315937252 
##MAXY= 972201806 
##MINY= -27593239 
##NPOINTS= 16384
##FIRSTY= 2254931 
##XYDATA=(X++(Y..Y))
16383 2254931 -5251616 -7180176 -1602188 10651583 4361512 -3649428 2136250 8070280
16375 8070280 1750538 3560418 1097795 -5577988 -237361 -1097795 -4658213 -4539532
16367 -4539532 -1987900 -5429637 -7120836 -2076910 2581303 2729653 3857119 1216476
16359 1216476 2729653 3916459 -4836234 1038455 1720868 6438422 -7595558 -9019725
16351 -9019725 -3679098 -415382 801094 -5963700 -13529588 -8099950 -3797779 -6527433
16343 -6527433 1157135 3975800 -4391182 -6705453 -7269186 3115365 -207691 29670
16335 29670 1424167 -3975800 2848334 -6557103 2818664 4094480 -8040610 2729653
16327 2729653 385711 -4747224 0 7773579 -830764 -1869219 3649428 -385711
16319 -385711 -2195591 -4035140 -1869219 682413 -504392 -4717553 4005470 -4509862
16311 -4509862 1068125 5103265 3263716 -1691198 1631858 504392 -6675783 -10087851
16303 -10087851 5251616 -6319741 860434 -5904359 296701 -3174706 -1275816
16296 -1275816 4747224 267031 -3056025 -5696668 -1483507 1424167 3323056 7921930
16288 7921930 9405437 6794464 5103265 118680 -10532903 -12075751 9613128
16281 9613128 8960385 -4361512 1809879 -4420852 -4302171 -8455992 -2759323 -8871374
16273 -8871374 -2551632 5221946 5043925 1987900 -5518647 -6468092 1839549 -6260401
16265 -6260401 -8426322 2492292 -1839549 385711 5785679 1097795 -1127465 -1394497
16257 -1394497 -5518647 -10621913 -12639483 -4925244 -12224101 -16555943 -12431792 -3293386
16249 -3293386 -1394497 1780209 3234046 2788994 4687883 9553788 -4361512 -4895574
16241 -4895574 -2610973 7269186 -3679098 -4064810 -5281286 -2314271 0 -267031
16233 -267031 -6527433 -2314271 -4806564 3886789 -2551632 -9257086 -8485662 2017570
16225 2017570 5785679 1097795 -2432952 -2432952 -89010 1809879 -2195591 2047240 -3145035
16216 -3145035 -4480192 -6705453 10117521 0 -4302171 -7981270 -8782364 -2581303
16208 -2581303 1958229 -4954915 -2521962 -6764794 -6972485 1780209 -2373612 -2076910
16200 -2076910 5132935 12431792 14746064 8277971 -207691 -3649428 -3174706 -474722
16192 -474722 -6141721 4747224 12194431 6379082 5014255 -89010 3234046 267031
16184 267031 -5756009 -9731809 -9049395 -3293386 -1631858 -2967015 -2996685 1987900
16176 1987900 1394497 -3560418 14390022 5963700 -1186806 -2878004 -207691 -3886789
16168 -3886789 -7417537 -2432952 2610973 2848334 -8307642 -3530747 4064810 3293386
16160 3293386 -1809879 -10384552 -890104 -2610973 10058180 3916459 -5251616 -6379082
16152 -6379082 -356041 178020 5904359 7506547 -6616443 -10770264 -9613128 -6290071
16144 -6290071 -6141721 -1364826 15814189 1869219 -6141721 -5548318 4302171 3590088
16136 3590088 2017570 -2017570 2788994 14864745 7921930 -2699983 2699983
16129 2699983 -4569203 7298856 5281286 860434 -1780209 -4153821 -8396652 -1809879
16121 -1809879 1987900 -4183491 -1987900 -2017570 -2195591 -7565888 -5043925 5577988
16113 5577988 3501077 2640643 -5637328 -2076910 -563732 4064810 89010 4183491
16105 4183491 -5726338 -9108736 -7180176 2106580 4747224 14686724 18395493 8366982
16097 8366982 326371 -3946129 2076910 8841704 8545003 -1008785 -860434 6379082
16089 6379082 2551632 -4450522 -2818664 -5459307 -8455992 -8990055 -13054866 -2254931
16081 -2254931 2907674 4005470 -7328527 -12016410 -5637328 4153821 -593403 -6527433
16073 -6527433 -1661528 2878004 1186806 6764794 2610973 712083 7002155 3412067
16065 3412067 -4687883 2462622 -1958229 -8040610 -8070280 1246146 5845019 3145035
16057 3145035 -2343941 9761479 4302171 9524118 7447207 2848334 3530747 12491133
16049 12491133 16229572 8188961 207691 -2729653 -8634013 -563732 -801094 6853804
16041 6853804 8396652 5073595 -2373612 -11274657 -2996685 2878004 2017570 178020
16033 178020 3026355 -801094 9583458 7536218 -89010 3056025 4361512 2521962
16025 2521962 415382 -5399967 1631858 1483507 -9702139 -830764 -682413 -9583458
16017 -9583458 -4242831 1097795 -2314271 4747224 326371 4242831 -4124150 -2640643
16009 -2640643 4005470 2640643 9998840 9909830 6646113 801094 -949444 89010
16001 89010 -4569203 -2610973 7002155 2492292 4747224 3115365 -7417537 -2937344
15993 -2937344 -8248301 -3708768 -4539532 -2878004 -8337312 -6468092 0 -830764
15985 -830764 -1513177 -949444 2076910 4272501 -1068125 -12580143 -10087851 -8723024
15977 -8723024 -1008785 -830764 -2670313 -1068125 -326371 -830764 -9049395 -8159291
15969 -8159291 -6794464 -4480192 -6201061 -9375767 -4420852 -3263716 207691 741753
15961 741753 -7625228 -3382397 -7239516 -8545003 -8248301 -8515333 -7832919 -5310956
15953 -5310956 -14241672 -9019725 1068125 1246146 1958229 2106580 -3323056 -10681254
15945 -10681254 -7269186 -1720868 -1364826 -5637328 -7061495 3619758 -6883474
15938 -6883474 -10117521 -7002155 1869219 3204376 11423007 7269186 -1869219 6557103
15930 6557103 9702139 -830764 -11749379 -11690039 -7298856 356041 -3886789 -4836234
15922 -4836234 -5785679 -3056025 -2403282 -7328527 -10176861 -12698824 -10740594 -5756009
15914 -5756009 -4450522 -6497762 -5162606 -8812034 -3886789 -4687883 -5132935 1661528
15906 1661528 9375767 -445052 3738438 5103265 7595558 8396652 -2136250 -1216476
15898 -1216476 -1335156 10206531 3204376 -4361512 -3174706 -534062 -5577988 5310956
15890 5310956 623073 -9435107 -6468092 -771423 4628543 7951600 -9168076
15883 -9168076 1068125 1097795 7447207 4480192 -9316427 -1898889 4598873 6438422
15875 6438422 -1839549 -2878004 -2699983 -6586773 -326371 6290071 5548318 -118680
15867 -118680 1602188 12491133 2996685 -2165920 -5429637 -4124150 -6171391 -2076910
15859 -2076910 3115365 5815349 13855960 -9316427 -7981270 8129621 1424167
15852 1424167 -4836234 1127465 593403 -6705453 -6052710 -8841704 -1958229 -5310956
15844 -5310956 -3886789 2610973 6735124 3501077 4213161 6646113 8485662 3056025
15836 3056025 5518647 3204376 178020 -4153821 -29670 474722 4954915 5756009
15828 5756009 10473562 623073 -2195591 3679098 -6230731 -1305486 -9998840 -4539532
15820 -4539532 -7447207 -3026355 -2967015 -3234046 -9375767 -5696668 -2403282 1157135
15812 1157135 -3738438 7180176 8070280 2136250 1987900 1275816 -4480192 -890104
15804 -890104 5221946 11333997 7654898 5192276 -8010940 -1720868 -6408752 919774
15796 919774 3738438 1186806 -2878004 2403282 -3026355 -11779049 -2788994 3649428
15788 3649428 4806564 15606498 5726338 -1394497 2996685 5726338 89010 5459307
15780 5459307 6438422 2907674 1008785 3797779 7714239 4747224 5132935 7447207
15772 7447207 9939500 13766949 17268027 3649428 6379082 1364826 -7476877 -623073
15764 -623073 2996685 8396652 -1068125 -3975800 -4539532 -8159291 -2195591 5310956
15756 5310956 12728494 2818664 2165920 3441737 2225261 3679098 2403282 -3026355
15748 -3026355 1394497 -5399967 6705453 -9286756 -8337312 237361 3501077 -7328527
15740 -7328527 6675783 -1216476 -1661528 3115365 1602188 -8426322 -2610973 385711
15732 385711 10087851 4717553 -5310956 -4035140 -3115365 2967015 7625228 1780209
15724 1780209 -1958229 -4717553 -415382 -3619758 -7061495 1127465 -3412067 830764
15716 830764 5399967 919774 -8693353 -207691 6290071 5815349 2017570 1958229 -2759323
15707 -2759323 -10206531 -5637328 -3916459 1216476 -10176861 1691198 207691
15700 207691 -3827449 949444 -2610973 -7536218 -9494448 -5251616 3441737 3204376
15692 3204376 4094480 8634013 118680 -3560418 -3412067 -8515333 -13648269 -15636169
15684 -15636169 -5696668 -801094 207691 3708768 8010940 4984585 2996685 -2699983
15676 -2699983 1246146 -1394497 4450522 4717553 830764 2432952 267031 1453837
15668 1453837 3649428 10443892 6675783 1602188 13855960 3560418 4954915
15661 4954915 1928559 3026355 -652743 -59340 712083 919774 10829604 12402122
15653 12402122 -1394497 1483507 178020 -5963700 -7773579 -7862589 -4598873 -3886789
15645 -3886789 2076910 -563732 -3056025 7328527 10770264 4361512 -3886789 -1691198
15637 -1691198 3797779 6438422 -5934030 -2937344 1305486 8426322 2581303 1869219
15629 1869219 3174706 -3679098 -949444 -5488977 -2106580 3471407 -11779049
15622 -11779049 -10681254 -5696668 -326371 -3738438 -5103265 -10443892 -11215316 -9168076
15614 -9168076 -11482348 -4598873 148350 5607658 1483507 5221946 9079065 5845019
15606 5845019 6646113 1097795 1720868 -5815349 -15250457 -8871374 -2610973 -8010940
15598 -8010940 -2492292 -3827449 -3857119 -1216476 -6794464 2314271 11897730 4658213
15590 4658213 10829604 1305486 -2106580 2314271 8188961 -11304327 -10710924 -7091165
15582 -7091165 -2047240 -5103265 -10028510 -6052710 -2699983 -2670313 -8752694 -3085695
15574 -3085695 -682413 -5192276 -89010 207691 -474722 -890104 -3975800 1008785
15566 1008785 5963700 -4005470 1928559 4628543 -919774 -1631858 -7239516 -4954915
15558 -4954915 3293386 -2047240 -1780209 -652743 5459307 2492292 6557103 -682413
15550 -682413 -7714239 -2432952 -13232886 -8901045 -2047240 3234046 -3323056 -3649428
15542 -3649428 3293386 -4628543 -5993370 -356041 -9019725 -7506547 -4509862 -1305486
15534 -1305486 -7002155 -593403 -3560418 296701 -10592243 -8723024 -1364826 7358197
15526 7358197 3738438 148350 -5934030 8307642 6497762 2462622 -7625228
15519 -7625228 -11482348 -15725179 -14241672 -12550473 -13203216 -8307642 -6468092 5607658
15511 5607658 -1275816 237361 -4094480 5192276 7714239 5043925 1602188 11630698
15503 11630698 6497762 3115365 860434 5696668 6586773 17238357 13084536 7120836
15495 7120836 -830764 5281286 10206531 1661528 -3056025 -2432952 -2907674 1513177
15487 1513177 1424167 1275816 -1157135 -4895574 -10799934 -5577988 -4302171 2759323
15479 2759323 4480192 3857119 9672468 3886789 2878004 1691198 -2284601 7150506
15471 7150506 2343941 8248301 1750538 -2076910 -1572517 -2610973 3946129 1038455
15463 1038455 -6171391 1394497 237361 890104 11215316 11482348 13974640 -3619758
15455 -3619758 -1038455 2729653 -1127465 3501077 474722 5459307 4005470 2076910
15447 2076910 -1453837 -356041 -12135091 -15606498 -9524118 -17831760 -13826289 -10414222
15439 -10414222 -5192276 -10621913 -3204376 682413 445052 -801094 -4124150 5874689
15431 5874689 9524118 3827449 -741753 -1246146 -5756009 -4895574 -8159291 -9346097
15423 -9346097 -15725179 -4391182 -4124150 -4272501 -4391182 415382 801094 356041
15415 356041 -2699983 -5607658 -2967015 623073 5785679 890104 9761479 5340627
15407 5340627 6408752 1364826 10354882 2047240 -1631858 -326371 -4450522 -1335156
15399 -1335156 -2462622 -12431792 89010 -1453837 919774 -11393337 -9553788
15392 -9553788 -5399967 -2462622 593403 1839549 -4361512 -2106580 -3174706 7002155
15384 7002155 8248301 -6675783 -7031825 2343941 7832919 17535058 -1780209
15377 -1780209 1216476 5548318 18069121 16407592 -6349412 -2047240 -1928559 -2699983
15369 -2699983 2788994 -1246146 7714239 9791149 237361 -2403282 -326371 -1839549
15361 -1839549 -4361512 -7981270 -3352726 3026355 -10058180 -4124150 2136250 5192276
15353 5192276 -4717553 -1453837 9286756 890104 -5251616 237361 3471407 29670
15345 29670 -9197746 -10562573 830764 -2878004 -11808719 -8545003 -7239516 -3263716
15337 -3263716 -7921930 -8930715 1750538 2403282 -5904359 -4569203 -3857119 -4391182
15329 -4391182 -4153821 -860434 -6230731 -6764794 -5340627 2106580 0 3501077
15321 3501077 3619758 -1661528 -2848334 2284601 -6735124 -15191116 -8337312 -7358197
15313 -7358197 -10354882 -10265871 -2254931 1097795 9079065 -3026355 -3530747 -4331841
15305 -4331841 -8307642 -3975800 -5874689 979114 -3026355 4302171 3560418 5577988
15297 5577988 3471407 -2076910 -623073 2610973 -3679098 -5103265 -6141721 -8248301
15289 -8248301 3797779 1157135 2640643 7417537 -8841704 -3056025 3085695
15282 3085695 -1750538 6557103 -2076910 207691 -3056025 -3560418 -1335156 -7773579
15274 -7773579 -9642798 -3619758 2343941 -593403 -3946129 -6764794 -3649428 2165920
15266 2165920 3886789 -1542847 -1157135 1275816 4569203 -919774 -3946129 8930715
15258 8930715 4272501 1008785 -1127465 -6260401 -1364826 5518647 1572517 4747224
15250 4747224 5221946 3056025 1839549 -6112050 -5874689 -7328527 -148350 -4925244
15242 -4925244 7654898 9346097 8960385 5192276 9019725 1483507 5132935 59340
15234 59340 -5785679 -10918615 -13054866 -9257086 -2610973 -1839549 3026355 13499918
15226 13499918 7298856 563732 6290071 5845019 5726338 2343941 3085695 6319741
15218 6319741 3975800 7447207 3412067 8307642 -949444 -11274657 118680
15211 118680 -534062 -2136250 -4598873 -7506547 -3768109 8010940 -2937344 -2047240
15203 -2047240 -9553788 3204376 6141721 4776894 -6052710 -6705453 -1958229 -445052
15195 -445052 -2017570 2165920 1928559 -6883474 -5666998 -7120836 1720868 -4331841
15187 -4331841 9227416 1809879 1394497 6735124 1275816 -3560418 9227416
15180 9227416 13114206 4361512 -7536218 -6052710 -4480192 -9583458 -296701 -3946129
15172 -3946129 -1246146 -10977955 -5340627 -5132935 -5756009 -237361 -7506547 -4035140
15164 -4035140 -5815349 -296701 6794464 -1246146 415382 29670 -2136250 -2284601
15156 -2284601 -4836234 2225261 -178020 5399967 1216476 -682413 4480192 -6082380
15148 -6082380 -3886789 -9197746 -6972485 -18751534 -11155976 -7476877 1305486 -1898889
15140 -1898889 682413 5429637 -4331841 -3590088 -3797779 -1631858 1424167 -3916459
15132 -3916459 -4153821 -5845019 -8930715 -7358197 -4539532 4865904 9909830 5459307
15124 5459307 -2937344 1335156 -7951600 -4005470 3323056 534062 -4391182 -10176861
15116 -10176861 -118680 1602188 -4598873 -2225261 771423 -7803249 -7002155 -9880159
15108 -9880159 -12995525 -17119676 6112050 1661528 682413 2047240 -148350 741753
15100 741753 3412067 2759323 -9939500 -9702139 -1928559 267031 2848334 -2492292
15092 -2492292 4687883 8871374 5874689 89010 -3323056 -5192276 -11037295 -2907674
15084 -2907674 -5518647 3708768 4628543 -7298856 2818664 7803249 -296701 593403
15076 593403 1987900 -7654898 6408752 2225261 -3085695 -4539532 -207691 771423
15068 771423 -8277971 -11423007 -5874689 -4598873 -7832919 2878004 -1750538 -13054866
15060 -13054866 -1809879 3026355 13321897 6290071 8188961 8930715 7031825
15053 7031825 1809879 9405437 5934030 7031825 2225261 8159291 2551632 -4539532
15045 -4539532 -2047240 -5132935 -593403 6646113 1335156 -6675783 -4539532 -3174706
15037 -3174706 623073 5607658 1275816 1631858 -1898889 5548318 -8841704 -7328527
15029 -7328527 -534062 5399967 6557103 10621913 8693353 6082380 830764 -10532903
15021 -10532903 -10443892 919774 504392 -8960385 -2492292 -6853804 2284601 2759323
15013 2759323 5103265 -2284601 -5281286 3649428 7565888 4509862 8040610 -7358197
15005 -7358197 -7773579 -7328527 -6290071 -5014255 -4124150 -7298856 -8099950 -4183491
14997 -4183491 3382397 1572517 -8366982 4480192 -9613128 1839549 4806564
14990 4806564 -1424167 1097795 -890104 385711 5488977 -3590088 -830764 5548318
14982 5548318 -1661528 -10740594 -11927400 -6853804 356041 -2136250 -2907674 -29670
14974 -29670 237361 3857119 5904359 1275816 919774 860434 0 -5459307 -3679098
14965 -3679098 -3797779 -326371 -8010940 -14390022 -10770264 -9464777 -4806564 -12224101
14957 -12224101 -7328527 -8515333 -8277971 -1483507 -3115365 -13232886 -4064810 -1987900
14949 -1987900 -5459307 -7536218 -2937344 -5845019 -1216476 5043925 1661528 3234046
14941 3234046 -6527433 -2967015 -2551632 -59340 -2551632 -4331841 -504392 -7269186
14933 -7269186 -8277971 296701 -593403 2017570 -3352726 -2729653 860434 -3797779
14925 -3797779 -9642798 -59340 -3234046 1780209 8366982 10176861 9316427 8248301
14917 8248301 -830764 -7150506 -4094480 1275816 -2165920 -12105421 -16318582 -18336152
14909 -18336152 -14924085 -13410907 -5756009 -8070280 979114 -7239516 -3738438 7358197
14901 7358197 5993370 6853804 7743909 -5845019 -8930715 1038455 7803249 979114
14893 979114 6853804 9138406 -6853804 1453837 -6171391 4865904 4984585 4331841
14885 4331841 -5340627 1542847 6230731 2907674 5132935 7921930 3323056 6112050
14877 6112050 -8663683 -10443892 -8159291 -4094480 -4658213 -5548318 5221946 -4213161
14869 -4213161 -11868060 -7862589 4747224 11868060 4925244 1008785 2788994 10384552
14861 10384552 5192276 2314271 -949444 -2373612 5845019 3056025 -2788994 7239516
14853 7239516 -4717553 -5607658 -1809879 -4569203 -3204376 -8099950 -8485662 -4658213
14845 -4658213 -10829604 -6112050 4806564 -4331841 1839549 -12550473 -11333997
14838 -11333997 -3738438 -8693353 -21570199 -8099950 -3946129 -10117521 -5993370
14831 -5993370 -4064810 3352726 -6557103 -2314271 6468092 1246146 5014255 3679098
14823 3679098 7239516 4450522 3679098 -5162606 -1869219 -830764 860434 -5310956
14815 -5310956 -3441737 -4836234 4569203 1157135 -979114 -2759323 2225261 -7625228
14807 -7625228 -5459307 3560418 652743 -5845019 -2848334 4598873 4954915 4094480
14799 4094480 -1750538 6764794 6052710 3412067 -1780209 3263716 -3323056 -3085695
14791 -3085695 -5577988 1572517 10829604 1008785 -12253771 -16466933 -13351567 -9049395
14783 -9049395 -8485662 -4450522 -2017570 -5310956 -5963700 -6260401 3263716 -3204376
14775 -3204376 -10414222 -6112050 -2343941 -890104 385711 -4954915 -9108736 -15191116
14767 -15191116 -17119676 -13351567 -7476877 -207691 -3056025 -1631858 2848334 -3708768
14759 -3708768 -5815349 -9909830 -8129621 474722 4984585 2907674 1869219 -1157135
14751 -1157135 -2106580 -3174706 712083 -5162606 5726338 4747224 -3530747 3590088
14743 3590088 13826289 8663683 9375767 8515333 3679098 10147191 -474722 -2432952
14735 -2432952 3026355 -7981270 3946129 5577988 4420852 8337312 -5399967
14728 -5399967 -7684568 -3886789 5934030 1869219 -8455992 -4539532 0 -890104
14720 -890104 3115365 -979114 -4480192 -12520803 -5934030 -118680 -3590088 -4153821
14712 -4153821 -4984585 -801094 -356041 -1068125 5310956 59340 -1157135 -1513177
14704 -1513177 3293386 14004310 11601028 6408752 1186806 4806564 -5251616
14697 -5251616 3619758 7358197 2165920 -5726338 -5310956 3056025 5488977 1364826
14689 1364826 11304327 10325212 4806564 -11363667 -11660368 -3797779 -59340 59340
14681 59340 3263716 -2640643 -10206531 -13143876 -6794464 -6853804 -10770264 -11660368 -10147191
14672 -10147191 -9969170 -3412067 8366982 -1542847 -2907674 -3056025 -1631858 1453837
14664 1453837 4925244 1394497 1453837 1038455 148350 -3263716 8040610 4331841
14656 4331841 1809879 6764794 2670313 7595558 -1661528 -2521962 10117521 7981270
14648 7981270 1928559 -4272501 385711 3679098 4124150 -10236201 -9553788 -14479033
14640 -14479033 -3679098 6290071 3441737 2670313 8990055 6675783 8693353 -919774
14632 -919774 2907674 6824134 12016410 8337312 6230731 4094480 -3204376 -7180176
14624 -7180176 -6319741 -1038455 -8723024 -5785679 -12520803 -2610973 -4153821 -4865904
14616 -4865904 -1750538 -4420852 -2729653 -11363667 1453837 5934030 15072436 6497762
14608 6497762 -267031 4539532 -2254931 -3412067 -12135091 5874689 178020 -5370297
14600 -5370297 -14538373 -18395493 -12609813 -6705453 -8990055 -1661528 -2907674 14597713
14592 14597713 9583458 -2254931 -7120836 -3471407 -9138406 -5488977 1631858
14585 1631858 7031825 4509862 1008785 -2343941 -9553788 -6497762 -12728494 -9494448
14577 -9494448 7714239 -3323056 -3026355 -7002155 -8040610 -9553788 -3174706 -2225261
14569 -2225261 6883474 -2136250 -15903200 -2403282 148350 178020 3471407 4865904
14561 4865904 -2996685 -534062 -3946129 -8337312 -2551632 7803249 2403282 623073
14553 623073 1572517 1661528 2937344 -712083 -2581303 -12758164 -7091165 -59340
14545 -59340 -3323056 -1869219 -5904359 -13084536 -10829604 -5963700 -8960385 -534062
14537 -534062 -356041 3560418 -1186806 -3708768 -13292227 -12965855 -89010 2165920
14529 2165920 237361 979114 -8277971 -12728494 -5548318 -6112050 -7981270 1898889
14521 1898889 979114 9227416 4925244 4776894 -2195591 -9405437 -8307642 -6023040
14513 -6023040 -2225261 2462622 3323056 6260401 890104 89010 -6319741 -1157135
14505 -1157135 1246146 -1898889 -5726338 -5577988 4420852 8604343 14568043 8545003
14497 8545003 8960385 0 -1750538 89010 -2492292 3708768 4064810 4272501
14489 4272501 2136250 -3708768 -7387867 -6349412 -9049395 1097795 -2699983 -3590088
14481 -3590088 -7269186 -8366982 -1720868 -5014255 -5103265 -1809879 -4954915 -4005470
14473 -4005470 -6290071 -4806564 -9494448 -3471407 -3946129 12313112 10799934 -4035140
14465 -4035140 -1216476 -3827449 1127465 2403282 3916459 -4776894 -7447207 -7031825
14457 -7031825 -10859274 1305486 -712083 1305486 -3204376 -2581303 682413 7002155
14449 7002155 5221946 -5310956 -2878004 741753 4925244 652743 5904359 11838389
14441 11838389 0 -3946129 -7031825 2284601 3679098 -4420852 -2492292
14434 -2492292 2492292 5548318 3679098 -801094 -178020 2610973 -5696668 5993370
14426 5993370 8218631 5370297 -1483507 -12224101 -5281286 -6438422 -2878004 -237361
14418 -237361 -6290071 -4242831 2937344 11571358 19107576 10265871 9316427 11333997
14410 11333997 2373612 -1602188 -148350 -11304327 -7862589 -1364826 -5696668
14403 -5696668 -385711 5014255 6557103 -890104 -4776894 -623073 -1869219 -6052710
14395 -6052710 -7862589 -5043925 -4124150 7832919 -148350 -3827449 2610973 -3382397
14387 -3382397 -9702139 -9197746 -12609813 -11779049 -59340 7684568 4361512 979114
14379 979114 5221946 10681254 4717553 -949444 -6141721 -3263716 -237361 -3946129
14371 -3946129 -3174706 3471407 29670 4183491 4391182 9702139 385711 -8960385
14363 -8960385 -237361 8188961 6497762 9464777 3263716 949444 -4895574 7120836
14355 7120836 9168076 11571358 6171391 1097795 296701 7180176 -207691 -4450522
14347 -4450522 -10117521 -3501077 -5815349 -741753 -3738438 -6557103 1898889 -3619758
14339 -3619758 -12787834 -19285597 -5132935 -2343941 -178020 4717553 3916459 -830764
14331 -830764 -3441737 1186806 8396652 3679098 4420852 -3293386 -11482348 -1364826
14323 -1364826 16437263 -2729653 2937344 4836234 4480192 2848334 9138406 2314271
14315 2314271 -11541688 -7091165 4480192 5459307 -178020 -7269186 9880159
14308 9880159 1483507 178020 -148350 -1335156 -8218631 -4628543 -8693353 -2729653
14300 -2729653 -5607658 -207691 4420852 -5904359 -8782364 6290071 -1127465
14293 -1127465 -445052 -2818664 712083 4865904 4420852 3115365 -11897730 -5726338
14285 -5726338 6112050 -9613128 -4153821 5251616 6913144 13826289 -3530747
14278 -3530747 1186806 -593403 237361 -2432952 -2136250 504392 5103265 -4865904
14270 -4865904 -8901045 -2788994 -4747224 -7595558 -5993370 -3975800 -2818664 1987900
14262 1987900 5696668 10206531 652743 -3649428 -563732 -5607658 -741753 2610973
14254 2610973 3412067 -4391182 -6972485 -5874689 -4509862 4628543 -504392 -6408752
14246 -6408752 7269186 4865904 6646113 10503233 3382397 4331841 -3056025 3263716
14238 3263716 -504392 -4776894 -11244986 -11126306 -7328527 5488977 5310956 -3204376
14230 -3204376 -3323056 1216476 -8574673 4776894 -2551632 -1839549 2225261 5459307
14222 5459307 5874689 326371 -563732 1809879 -6824134 -7803249 -9138406 -4242831
14214 -4242831 1572517 -2788994 -296701 5607658 -178020 4450522 -474722 -5756009
14206 -5756009 -2640643 -5577988 -4124150 -7209846 -1364826 -563732 5251616 15191116
14198 15191116 7773579 2076910 2818664 445052 296701 4865904 7150506 -5459307
14190 -5459307 -3857119 2047240 9019725 1602188 -1246146 -11927400 -2492292 3708768
14182 3708768 -1720868 -4124150 -2878004 3382397 18484503 14538373 682413
14175 682413 -5577988 4272501 -6082380 5459307 4836234 3441737 -7061495
14168 -7061495 118680 2373612 771423 2670313 5785679 4925244 -860434 8129621
14160 8129621 1928559 1869219 3797779 623073 16348252 14212001 15784519 8901045
14152 8901045 3649428 -1157135 2878004 5666998 771423 -2581303 4895574 4094480
14144 4094480 860434 -2432952 -1809879 -1424167 8574673 3590088 5815349 -3530747
14136 -3530747 -9702139 -8752694 -10503233 -9909830 -5577988 -1008785 -6112050 -534062
14128 -534062 3768109 -3530747 563732 -6141721 -4242831 -8782364 -11571358 -10829604
14120 -10829604 -2967015 -11393337 -4895574 2017570 801094 8752694 -4687883
14113 -4687883 -9850489 -712083 -2878004 -4984585 1424167 9553788 6646113 -3026355
14105 -3026355 1453837 13915300 -5429637 -8248301 -4272501 -6468092 -11452677
14098 -11452677 -4272501 -8812034 -8545003 6438422 7803249 6112050 5103265 6438422
14090 6438422 2521962 -4064810 979114 -1186806 -5221946 326371 4064810 8485662
14082 8485662 -1542847 -1394497 -3590088 -6972485 -5993370 -2047240 -3530747 -2699983
14074 -2699983 -16259242 -14360352 -5934030 -6942815 4480192 5370297 9286756 -6023040
14066 -6023040 -10058180 -8930715 -3263716 8901045 -3263716 5815349 2788994
14059 2788994 -6942815 -8693353 -2403282 -1869219 -5785679 -8337312 -6497762 -12906515
14051 -12906515 -2195591 1513177 -1691198 3619758 6230731 1809879 2788994 3263716
14043 3263716 -326371 2432952 -415382 -9731809 -7773579 -11037295 -6853804 -712083
14035 -712083 3619758 4094480 7002155 -89010 801094 -11838389 -11571358 -13588928
14027 -13588928 -5637328 -4836234 -17505388 -13084536 -3738438 -2878004 -8485662 -1127465
14019 -1127465 3916459 207691 7328527 1839549 -2610973 -356041 -296701 -2967015
14011 -2967015 11868060 3738438 -8040610 -5459307 -2551632 6349412 237361
14004 237361 -7951600 -5251616 5666998 4984585 4747224 3679098 -4035140 -741753
13996 -741753 2254931 -4242831 -1216476 4954915 4213161 3323056 7002155 15695509
13988 15695509 -267031 -6794464 3619758 -2106580 -7417537 -1869219 -890104 -623073
13980 -623073 -3352726 -2967015 -2551632 -6616443 -1483507 -3797779 178020 5103265
13972 5103265 8426322 1631858 237361 -9731809 -15250457 -15220786 -10681254 -1691198
13964 -1691198 -1335156 -712083 -4153821 -8070280 -3649428 4925244 -4242831 -11601028
13956 -11601028 -4954915 -9286756 -6290071 3115365 1780209 29670 5993370 4272501
13948 4272501 6705453 4895574 -3679098 -3204376 2195591 -8812034 1542847
13941 1542847 2640643 -2670313 -949444 7269186 7447207 296701 3382397 -415382
13933 -415382 8099950 -2343941 -5310956 -7061495 -12758164 -6201061 -771423 2551632
13925 2551632 -12550473 -4124150 -593403 -7031825 -979114 -2640643 1661528 -1631858
13917 -1631858 -178020 -10117521 -6527433 -9939500 -7951600 -1987900 10087851
13910 10087851 14894415 7862589 -6141721 -3471407 -4302171 -11185646 -4005470 -7358197
13902 -7358197 -9464777 -11185646 -5073595 -59340 2878004 5073595 385711 1720868
13894 1720868 3619758 3827449 860434 -474722 -5607658 -4480192 474722 6201061
13886 6201061 13084536 17000995 11363667 10265871 6497762 6557103 4895574 2610973
13878 2610973 -6408752 -3708768 -8901045 -10977955 -13173546 2165920 -801094 2759323
13870 2759323 5281286 -1275816 -5399967 -3352726 2640643 4569203 -3827449 -12105421
13862 -12105421 -801094 2017570 4836234 3946129 -2343941 -11155976 -2076910 -18870215
13854 -18870215 -15013095 -12431792 -1186806 6260401 -3708768 -4213161 2403282 118680
13846 118680 1780209 -2492292 2937344 -741753 5014255 -1394497 -3263716 207691
13838 207691 5934030 -1691198 -5132935 -1008785 -10532903 -7714239 -6141721 -4895574
13830 -4895574 -5488977 -6764794 -4480192 -5162606 1275816 6646113 -7061495 -10265871
13822 -10265871 -15191116 -16466933 -6260401 -3738438 4183491 89010 -1809879
13815 -1809879 -1572517 -1720868 -1275816 5221946 3560418 4183491 2047240 4836234
13807 4836234 207691 2373612 534062 5934030 11571358 3471407 -4331841 4954915
13799 4954915 2403282 -3352726 -9850489 -7209846 -5310956 -3797779 -4124150 -4717553
13791 -4717553 4925244 1839549 -4747224 -7031825 -6112050 -8930715 -5073595 -9464777
13783 -9464777 -3738438 -8990055 -4925244 -10799934 -19552628 -13114206 -3382397 5132935
13775 5132935 1809879 -11304327 -6497762 -11304327 -8574673 -6171391 2670313 17772419
13767 17772419 3975800 -741753 -3738438 -7506547 -2047240 -8752694 -6349412
13760 -6349412 4153821 -2996685 -6082380 979114 -504392 -1127465 -6972485 -2996685
13752 -2996685 -4064810 -9138406 -8337312 -9791149 -4331841 3382397 -3738438 -2729653
13744 -2729653 -1898889 -2254931 -1008785 -12906515 -1869219 4064810 3323056 1335156
13736 1335156 11363667 8693353 9494448 949444 -8930715 -6942815 1216476 -5488977
13728 -5488977 474722 -5845019 -8396652 -9316427 -6379082 -6616443 -2729653 13470248
13720 13470248 2254931 -2759323 3056025 9375767 13618598 6201061 1068125
13713 1068125 148350 4272501 2967015 -148350 3886789 -652743 -3234046 -6230731
13705 -6230731 -13054866 1513177 1008785 -4035140 -5073595 -3145035 -3293386 -3560418
13697 -3560418 -504392 8901045 7951600 16585613 12164761 12105421 5874689 1869219
13689 1869219 7447207 2403282 1572517 -1691198 1068125 -860434 -2699983 -1661528
13681 -1661528 6290071 6824134 2967015 8871374 16852645 10859274 9316427 -445052
13673 -445052 4035140 504392 237361 534062 -6408752 -3412067 -3234046 2432952
13665 2432952 3352726 385711 -6468092 3946129 4450522 -2670313 -7654898 -7832919
13657 -7832919 5696668 5340627 1453837 -7625228 -12431792 -6972485 -2314271 -6913144
13649 -6913144 -8129621 -13232886 -7892259 -5518647 -5488977 -3441737 -6023040 -5518647
13641 -5518647 -4539532 3115365 -15131776 -3916459 4391182 -356041 5963700 3174706
13633 3174706 -1275816 -3530747 -59340 5370297 13588928 13292227 8960385 4005470
13625 4005470 9939500 3560418 2047240 -4124150 -919774 -3412067 -5132935 -8277971
13617 -8277971 504392 7565888 8307642 5726338 7921930 -2670313 -1809879 5192276
13609 5192276 6853804 11185646 -8248301 -15665839 -7387867 -712083 -6646113 -9346097
13601 -9346097 -15309797 -9494448 -712083 3174706 -3679098 -8337312 -3560418 5548318
13593 5548318 5459307 2492292 -1275816 -2551632 -6468092 -3708768 -4925244 -2403282
13585 -2403282 -207691 13796619 14360352 12520803 4569203 -712083 1394497 5518647
13577 5518647 -4331841 -8841704 2759323 3204376 534062 356041 2047240 7625228
13569 7625228 11868060 9583458 3560418 -13410907 -11601028 -8010940 -11155976 -9257086
13561 -9257086 -3975800 -593403 -3975800 3115365 4302171 -949444 -13885630
13554 -13885630 -16407592 -7387867 -7387867 -9138406 -2937344 -7743909 -13588928 1542847
13546 1542847 9405437 1661528 3085695 2937344 3145035 178020 -4035140 11512018
13538 11512018 -1157135 -4747224 -6408752 4480192 4658213 14508703 4153821
13531 4153821 -5310956 1453837 -4272501 -771423 2373612 1275816 5785679 -4509862
13523 -4509862 -4806564 -6764794 1068125 -1186806 -19018566 -12817504 -2373612
13516 -2373612 -5073595 1394497 12313112 12550473 1661528 4213161 16229572
13509 16229572 5845019 3827449 534062 -6497762 -1453837 -3234046 -5014255 -11096636
13501 -11096636 -7447207 3115365 10681254 6705453 11423007 -1216476 -8396652
13494 -8396652 -2047240 -3352726 8099950 -296701 -4361512 2314271 1928559 6112050
13486 6112050 -1068125 2076910 2788994 0 -2403282 -11452677 -3204376 10651583
13478 10651583 -4658213 -18751534 237361 474722 -4539532 -4391182 10621913
13471 10621913 10651583 2462622 2432952 7387867 -4302171 -12817504 -15992210 -593403
13463 -593403 830764 16437263 1809879 6527433 -148350 8485662 -1008785 2343941
13455 2343941 207691 9702139 9820819 5370297 118680 -6438422 -949444 1542847
13447 1542847 -2610973 -1246146 -356041 -4687883 -9019725 -7832919 4717553 5281286 2878004
13438 2878004 -1127465 2225261 -712083 -474722 10888945 -1928559 4480192 14568043
13430 14568043 4539532 4361512 3323056 -3649428 -11215316 0 -2878004
13423 -2878004 -5666998 2581303 7981270 6052710 -2492292 4598873 6853804 267031
13415 267031 7803249 2284601 4331841 -3234046 2521962 7981270 -415382 2788994
13407 2788994 504392 -1869219 -8841704 -5132935 -8129621 -7506547 -6942815 -5874689
13399 -5874689 -326371 -8070280 -5281286 -8545003 -8841704 -10443892 -2284601 10681254
13391 10681254 -237361 -830764 -741753 -3768109 7150506 -12787834 -2640643
13384 -2640643 -7091165 -2432952 -3886789 1097795 -207691 -6379082 -7061495 4094480
13376 4094480 8099950 -2343941 -4628543 1839549 6646113 -9049395 -6260401
13369 -6260401 -10532903 -8455992 -207691 2165920 -1186806 -6675783 3026355 -148350
13361 -148350 -1631858 -8723024 59340 6468092 9168076 4954915 -4391182 -5696668
13353 -5696668 -5696668 -3590088 12431792 13143876 504392 267031 -3323056 -7447207 -5488977
13344 -5488977 -534062 4094480 -4954915 1038455 -326371 652743 -3026355 474722
13336 474722 -6349412 -1780209 4687883 -4836234 1097795 1275816 1691198 13944970
13328 13944970 10532903 9286756 -504392 -10503233 -5518647 -4658213 -6408752 -12758164
13320 -12758164 -14212001 -5934030 -1631858 -1542847 8782364 6527433 -1453837 -4806564
13312 -4806564 445052 593403 -2314271 -6349412 2729653 919774 -7773579 -4865904
13304 -4865904 474722 11808719 3352726 5607658 -6616443 -2432952 3323056
13297 3323056 -9791149 -11541688 -6735124 -7832919 -10117521 -3085695 -415382 1038455
13289 1038455 4450522 1246146 2729653 5281286 3708768 2343941 12164761 2017570
13281 2017570 148350 -4687883 -6052710 -15131776 -10651583 -2848334 1572517 5666998
13273 5666998 -534062 -593403 -5073595 -504392 -6735124 -4361512 9108736 10977955
13265 10977955 15992210 18721864 -712083 -7743909 -5281286 2106580 6290071
13258 6290071 1157135 -4272501 -3560418 -5815349 -89010 -415382 -4302171 2521962
13250 2521962 267031 -1780209 2106580 -3827449 -6764794 1275816 -3649428 3738438
13242 3738438 -5281286 3916459 -5310956 2195591 -4569203 -5310956 3560418 -2670313
13234 -2670313 -2521962 504392 -6141721 -1008785 6646113 5043925 -118680 -5281286
13226 -5281286 -10117521 -2788994 -4064810 -13381237 -9168076 -4242831 -10236201 623073
13218 623073 -623073 -19611969 -6735124 -5103265 5637328 4153821 3471407 623073
13210 623073 5429637 6913144 860434 3827449 1898889 4272501 4391182 -237361
13202 -237361 -7743909 -2165920 3501077 741753 1869219 5666998 4925244 -7654898
13194 -7654898 -7565888 178020 3708768 2403282 2521962 8812034 7091165 -5399967
13186 -5399967 -8782364 -8812034 -10176861 -8485662 -2610973 -1691198 -267031 -1661528
13178 -1661528 -2195591 -7506547 445052 2937344 9613128 7091165 4035140 -356041
13170 -356041 1424167 326371 -7951600 -4806564 -2610973 2729653 0 -14894415
13162 -14894415 -9672468 -7298856 3441737 4509862 6260401 -3293386 -682413
13155 -682413 5192276 5963700 -979114 89010 -10265871 -15962540 -1008785 5132935
13147 5132935 4717553 -118680 6705453 -1246146 6290071 8752694 -979114 -563732
13139 -563732 -2996685 7862589 4658213 6883474 4213161 771423 6141721 -2314271
13131 -2314271 -9702139 -11601028 -10621913 -2225261 3679098 6527433 1216476 -4213161
13123 -4213161 -1453837 -771423 -7654898 -10592243 -16911985 -5874689 3827449 3174706
13115 3174706 -3145035 2373612 -3797779 9227416 9761479 2432952 -13707609
13108 -13707609 -6853804 -3501077 10888945 3768109 -6171391 -1513177 1869219
13101 1869219 326371 -267031 207691 7091165 -1335156 -3085695 -13321897 -19137246
13093 -19137246 -16615284 -6230731 -4005470 5637328 2907674 2670313 4984585 1839549
13085 1839549 712083 -5666998 -2670313 -1216476 -296701 -2788994 -4954915 -8930715
13077 -8930715 -3560418 2432952 17535058 2729653 -1246146 2136250 11007625
13070 11007625 -534062 8841704 10325212 741753 -4539532 5370297 5310956 0
13062 0 -1097795 9880159 13529588 8485662 0 -1068125 -1157135 2254931 -385711
13053 -385711 -4213161 -4094480 -9583458 -15576828 -1157135 -5429637 -890104 5221946
13045 5221946 6082380 -1631858 3174706 4302171 -7269186 -5963700 -8307642 -7358197
13037 -7358197 4005470 5310956 2521962 5043925 2759323 3886789 -7002155
13030 -7002155 326371 -919774 -11155976 -504392 -1364826 -4509862 -860434 -1097795
13022 -1097795 2581303 -1246146 -7002155 3827449 5399967 3352726 3471407 1068125
13014 1068125 -7773579 4569203 6349412 -3886789 -8040610 7387867 6616443 4865904
13006 4865904 9998840 14152661 17060336 2314271 534062 -4213161 -7951600 -6913144
12998 -6913144 -13143876 -15992210 -7714239 -5963700 -8070280 -1068125 -2937344 -3145035
12990 -3145035 -9494448 -16971325 -17535058 -5073595 -6527433 -11126306 -13173546 -9079065
12982 -9079065 -7150506 5043925 -89010 415382 1364826 -4242831 -9524118 -7625228
12974 -7625228 -15725179 -7951600 -10562573 -17742749 -14093321 -18781204 -7565888
12967 -7565888 -3352726 2996685 7298856 16377922 2729653 4213161 5310956 -267031
12959 -267031 -1246146 -10977955 -4124150 6260401 949444 29670 801094 -3085695
12951 -3085695 2788994 -2165920 1068125 -296701 -652743 3323056 -7328527 -7328527 -6705453
12942 -6705453 -9731809 -3560418 2076910 4509862 3708768 5162606 -919774 -6942815
12934 -6942815 -8871374 -2462622 4361512 1720868 5370297 5963700 6023040 -1483507
12926 -1483507 -296701 2610973 -6853804 -3441737 -415382 1157135 -8634013 -3115365
12918 -3115365 -7773579 -11749379 -19849330 -18632854 -12520803 -10829604 -9613128 -9108736
12910 -9108736 2462622 9702139 4658213 7239516 -4628543 -16288912 -1987900
12903 -1987900 237361 -8634013 -11096636 -8396652 -4717553 -682413 -1275816 0
12895 0 2848334 6616443 8723024 4094480 178020 -5340627 -14805404 -4391182
12887 -4391182 2907674 -1097795 -15013095 -14152661 -6438422 -5488977 -4865904 -11512018
12879 -11512018 -5518647 -7298856 2403282 1394497 4747224 -6764794 -7298856 -11571358
12871 -11571358 -10592243 11541688 8129621 -534062 -5934030 -7892259 -7298856 -949444
12863 -949444 8248301 3827449 10443892 10562573 -2106580 -2017570 593403 -6853804
12855 -6853804 -12224101 -2047240 -5874689 -4361512 1186806 10710924 -4005470
12848 -4005470 -2759323 -5459307 -4895574 4213161 -2581303 -593403 2076910 -5370297
12840 -5370297 -9702139 -2314271 2759323 -3797779 4569203 5399967 5815349 3590088
12832 3590088 7921930 7269186 12906515 326371 6082380 -2699983 -6171391 -11304327
12824 -11304327 -1691198 8574673 12313112 -296701 4747224 4569203 8841704
12817 8841704 5370297 1335156 -3975800 -9138406 -3946129 -1928559 3026355 2610973
12809 2610973 1186806 -326371 3768109 771423 -2581303 296701 7743909 -1246146
12801 -1246146 -3145035 -5340627 -9553788 -1958229 148350 7981270 10829604 4005470
12793 4005470 -504392 -3708768 1691198 -207691 -2225261 -11096636 -1750538 7120836
12785 7120836 2699983 7565888 2106580 2699983 178020 -4153821 8455992 8218631
12777 8218631 682413 -3115365 -5132935 -7536218 -4361512 -11304327 -3797779 29670
12769 29670 1038455 -3501077 3501077 -3560418 -2729653 7091165 830764 -2373612
12761 -2373612 -3797779 12075751 15606498 -2521962 4658213 2878004 7951600
12754 7951600 2462622 4094480 7684568 2106580 -12105421 -7091165 -2225261 -1602188
12746 -1602188 -4272501 -14924085 -7892259 -1898889 -7743909 -6586773 -3679098 10384552
12738 10384552 12342782 -860434 -11512018 -5459307 4064810 -3590088 -9731809
12731 -9731809 -2937344 -6735124 -11304327 -6438422 3441737 4420852 -5904359 -10087851
12723 -10087851 -8129621 4153821 326371 -6379082 -10058180 -10117521 -7417537 9079065
12715 9079065 10087851 5429637 -1424167 -534062 4153821 -3590088 -7803249 -237361
12707 -237361 -1780209 -9435107 207691 -7803249 -949444 7417537 9731809 -29670
12699 -29670 -3026355 -3827449 -2610973 3501077 8307642 10384552 -3234046 8010940
12691 8010940 6735124 4064810 237361 5370297 2225261 -7595558 741753 2165920
12683 2165920 2788994 -5904359 -12698824 -5192276 949444 7654898 7536218 1809879
12675 1809879 -2699983 -7476877 -9494448 -29670 4480192 1127465 -59340 3975800
12667 3975800 3886789 296701 -1038455 -148350 -8930715 -4925244 -8723024 -7358197
12659 -7358197 1720868 6794464 -1008785 -8871374 -11541688 2967015 -3797779 1780209
12651 1780209 949444 -8218631 -267031 -9286756 -9880159 -9286756 -11423007 -13381237
12643 -13381237 -5043925 -4598873 2640643 2937344 6764794 -6675783 -7476877 -9316427
12635 -9316427 -4183491 -10236201 -2759323 -8812034 -7951600 -3530747 -7921930 -11779049
12627 -11779049 -3174706 4509862 7002155 2937344 5429637 -1720868 6586773 4480192
12619 4480192 979114 474722 3886789 3768109 -3501077 -4272501 -10028510 -11601028
12611 -11601028 -13114206 -7476877 -7981270 -6853804 -9939500 -949444 11601028
12604 11601028 9257086 1364826 4598873 -712083 -4836234 -1839549 -8604343 -10829604
12596 -10829604 -8248301 2610973 -4687883 -3886789 356041 -2106580 -5904359 -2670313
12588 -2670313 -11363667 -7684568 -3619758 3708768 741753 890104 7803249 -2017570
12580 -2017570 -5993370 -2551632 -2165920 5340627 6290071 13885630 9820819 11274657
12572 11274657 -326371 -4242831 6794464 6171391 2136250 -1691198 -4183491
12565 -4183491 -12461463 -11037295 -9494448 -1275816 6942815 -3441737 -5399967 -1780209
12557 -1780209 -1364826 -5993370 -5488977 949444 -9850489 4213161 2729653 -10265871
12549 -10265871 1602188 -890104 2878004 -6290071 -8099950 3234046 296701
12542 296701 -9168076 -4747224 -801094 -3975800 -15932870 -18929555 -5221946
12535 -5221946 -4628543 -2076910 -652743 563732 3145035 3530747 1809879 -6616443
12527 -6616443 -7773579 -6112050 -9316427 -8248301 2788994 5399967 -3708768 -14182331
12519 -14182331 -5726338 -7803249 -8129621 -11749379 860434 -1246146 -4539532 6052710
12511 6052710 2225261 652743 10117521 1038455 5518647 4094480 6853804 9553788
12503 9553788 4094480 4717553 -8604343 -1928559 3590088 13381237 7892259 12609813
12495 12609813 4747224 5756009 712083 -1958229 919774 -5221946 5132935
12488 5132935 10058180 9761479 1987900 -5014255 -2818664 385711 2373612 -979114
12480 -979114 8604343 2729653 8693353 326371 237361 5963700 1008785 2373612
12472 2373612 -6853804 -652743 -8159291 -3145035 3590088 5874689 1602188 5993370
12464 5993370 11868060 4776894 326371 6349412 -949444 59340 -2136250 -563732
12456 -563732 652743 356041 -1424167 4984585 3857119 -6319741 -2432952 -1661528
12448 -1661528 -860434 -1157135 -1839549 -89010 7476877 14924085 -9642798 -14686724
12440 -14686724 -6824134 -3886789 -1958229 -2047240 3323056 1097795 -5132935 178020
12432 178020 415382 -474722 -949444 7803249 741753 2996685 7506547 2432952
12424 2432952 979114 5162606 11541688 -3412067 -3323056 3975800 -563732 3204376
12416 3204376 6349412 3827449 12342782 385711 3560418 -5073595 -4302171 -10236201
12408 -10236201 -1038455 -3649428 5637328 5310956 2878004 -59340 5370297 415382
12400 415382 267031 4954915 7773579 178020 3768109 9286756 8545003 -5963700
12392 -5963700 -6735124 -8901045 -5904359 -623073 -59340 -1661528 6557103 1275816
12384 1275816 -3560418 4480192 2136250 -9435107 -2403282 385711 11155976
12377 11155976 -5577988 3471407 4450522 -1898889 -8901045 -2788994 -10948285 -296701
12369 -296701 6705453 12075751 3857119 2967015 1720868 -2699983 -12520803 -22519643
12361 -22519643 -14004310 -7536218 -4272501 -5963700 -10176861 2136250 -3886789
12354 -3886789 -9435107 -4776894 4598873 -3204376 4183491 4361512 -2373612 -9316427
12346 -9316427 3352726 4213161 4331841 890104 7714239 -1127465 -4361512 -4509862
12338 -4509862 -8099950 1364826 -6230731 -919774 -118680 -5014255 2343941 -890104
12330 -890104 1453837 -2254931 -1869219 -6972485 10473562 6824134 949444 -10710924
12322 -10710924 -10147191 1750538 1631858 -949444 -6082380 3382397 3827449 8545003
12314 8545003 59340 4213161 5874689 6942815 860434 504392 5399967 -4954915
12306 -4954915 -4242831 -7091165 -2106580 -1780209 -6141721 -13114206 -6794464 -8277971
12298 -8277971 -5993370 -3085695 -3085695 -9672468 -1038455 -3857119 -5904359 -6883474 -7387867
12289 -7387867 -1097795 2670313 -2314271 -6527433 -8812034 -1869219 8485662
12282 8485662 29670 7684568 6201061 15784519 12342782 6260401 -2699983 -207691
12274 -207691 -3085695 -11986740 -11957070 -9286756 1127465 -4806564 -3471407 1898889
12266 1898889 -1987900 3530747 741753 -1602188 5221946 -5399967 -6260401 9524118
12258 9524118 10888945 59340 -5518647 -326371 -4747224 -6379082 -7921930 2967015
12250 2967015 7892259 -2284601 0 652743 1602188 3857119 -2581303 4064810
12242 4064810 4005470 3827449 6112050 -10384552 -13025195 -8960385 -5488977 148350
12234 148350 -5340627 -6082380 -7951600 -2314271 -2195591 -4509862 -6260401 -5340627
12226 -5340627 -5904359 -2403282 3619758 10325212 5192276 -9079065 1839549
12219 1839549 11452677 12936185 11304327 7536218 623073 1305486 712083 12461463
12211 12461463 9138406 8366982 6379082 -1691198 1394497 4598873 6171391 7298856
12203 7298856 8901045 3263716 -1424167 6883474 9731809 3738438 6408752 -10918615
12195 -10918615 -12847174 -14657054 -919774 6853804 -741753 2640643 -3412067
12188 -3412067 -13410907 -1542847 11690039 -3026355 -13440577 -2136250 -3916459
12181 -3916459 -1928559 5340627 5607658 5815349 3679098 -29670 -5874689 7120836
12173 7120836 6646113 -2432952 1542847 -4806564 -12520803 -2788994 4124150 -296701
12165 -296701 -7536218 -15339467 -10888945 -3382397 1987900 2373612 4954915 6260401
12157 6260401 5785679 5281286 -4954915 -8099950 -2996685 -771423 3234046 -10206531
12149 -10206531 -4213161 -2254931 -11571358 -14479033 -9642798 -3056025 5696668 4836234
12141 4836234 2581303 10117521 -4035140 -2996685 -415382 -3946129 -4064810 -7298856
12133 -7298856 -4035140 -3975800 -5132935 534062 -1928559 -3975800 0 5132935
12125 5132935 4183491 4509862 12876845 -1097795 -2937344 -8426322 -4539532 4242831
12117 4242831 11660368 -7536218 -6646113 -6824134 -2818664 -5666998 8099950 5607658
12109 5607658 -3026355 -4895574 -7773579 -4865904 -11066965 -8930715 -2373612 1394497
12101 1394497 -3174706 -4865904 1542847 -4539532 -17802090 -1038455 4925244
12094 4925244 -3560418 -4480192 -6141721 -4954915 -6082380 -2551632 -9464777 -801094
12086 -801094 5518647 3382397 1898889 0 5429637 6112050 3530747 -1750538
12078 -1750538 -3916459 -3501077 -2165920 1661528 8960385 741753 6972485 3145035
12070 3145035 771423 -10325212 -5963700 -4302171 -8930715 2106580 2047240 5904359
12062 5904359 11423007 -3857119 -5874689 -6735124 -1216476 -1928559 -682413 2492292
12054 2492292 10147191 6735124 3441737 4124150 1928559 -6052710 -4598873 -1780209
12046 -1780209 13440577 -504392 -11304327 830764 1691198 -4331841 -8010940
12039 -8010940 -9583458 -7565888 -5014255 -6052710 -59340 949444 -1809879 -3560418
12031 -3560418 -1246146 -5073595 -7684568 -2878004 -1246146 -5132935 -6023040 1602188
12023 1602188 4302171 -1068125 -1780209 -11719709 1424167 -2432952 -356041 -1513177
12015 -1513177 59340 -237361 29670 -385711 -11126306 -8574673 -10621913 3352726
12007 3352726 -3412067 -6497762 -682413 -682413 1216476 1602188 -1246146 -12075751
11999 -12075751 -12876845 -4865904 445052 3946129 919774 -4391182 -5221946 -4035140
11991 -4035140 2076910 4687883 445052 1394497 -6705453 2581303 2907674 -1157135
11983 -1157135 2076910 5043925 4361512 -7565888 -5221946 6230731 2907674 -7239516
11975 -7239516 296701 830764 -237361 -5043925 -9168076 -2403282 -1483507 9138406
11967 9138406 7981270 9375767 2878004 -5726338 -5845019 -5488977 118680 9197746
11959 9197746 3471407 -4658213 -11423007 -6972485 -9227416 5993370 11393337 4539532
11951 4539532 3857119 16585613 207691 -118680 -89010 29670 593403 -4865904
11943 -4865904 -8426322 237361 13559258 -237361 1453837 2610973 2640643 -5429637
11935 -5429637 -15131776 -17090006 -12876845 -5459307 -8455992 2403282 -8574673
11928 -8574673 -15102106 -17268027 -3797779 9939500 12520803 3857119 1572517
11921 1572517 -3115365 8307642 -2462622 -771423 -2848334 -2462622 -4420852 1661528
11913 1661528 -1513177 4865904 4035140 -3768109 -5162606 1869219 -771423 -3145035
11905 -3145035 -3056025 -3738438 -5221946 -8099950 -17119676 -7091165 -9642798 -5963700
11897 -5963700 267031 -6942815 -3263716 -1513177 -1691198 -4302171 -2788994 2373612
11889 2373612 -3886789 -5399967 -2610973 -623073 -3382397 -7417537 -8485662 2373612
11881 2373612 -8337312 -1157135 2136250 -1216476 -6497762 -8812034 -16793304 1602188
11873 1602188 10265871 17268027 2996685 1275816 4450522 9553788 -1631858
11866 -1631858 -1987900 4450522 -7921930 -7951600 -15695509 -11096636 -10028510 -9286756
11858 -9286756 -5548318 -1602188 -2462622 7714239 10799934 -7002155 1305486 -4509862
11850 -4509862 -801094 -356041 -4242831 -4925244 -4569203 -29670 8663683 6764794
11842 6764794 -3649428 -8693353 -6052710 830764 4687883 -1780209 -4005470 -8841704
11834 -8841704 1869219 5845019 -1809879 -9108736 -8782364 -7476877 -5162606 -2343941
11826 -2343941 -4153821 -11037295 1127465 -2818664 296701 -3471407 -1513177 -6675783
11818 -6675783 -8604343 -4984585 -2284601 -6557103 682413 2878004 623073 8366982
11810 8366982 -3679098 -2848334 -6379082 -9168076 -2343941 -7862589 -5103265 1453837
11802 1453837 -4658213 -4806564 5666998 326371 6794464 6349412 8070280 -2195591
11794 -2195591 2403282 12936185 7209846 -2937344 -4213161 -563732 -8070280
11787 -8070280 6052710 1839549 4005470 830764 -4420852 -771423 -2699983 -860434
11779 -860434 474722 2432952 -9524118 -7120836 -9761479 2670313 207691 -4183491
11771 -4183491 -2462622 2937344 1097795 3679098 3174706 -9019725 -3471407 -4035140
11763 -4035140 771423 -1335156 148350 -8752694 -14271342 -5785679 -9791149 -4539532
11755 -4539532 682413 -1928559 -623073 5874689 11512018 1839549 -5192276 -9138406
11747 -9138406 -7595558 -1839549 -9375767 1068125 1097795 6853804 8930715 3145035
11739 3145035 -4124150 -6349412 2462622 1898889 3738438 -8545003 178020 -1631858
11731 -1631858 -5132935 -9702139 -6230731 -9880159 -2551632 5132935 3026355 5043925
11723 5043925 12016410 7743909 3323056 -2462622 2729653 4539532 1038455 -5251616
11715 -5251616 -11571358 -7536218 -8663683 -3827449 3679098 6408752 1483507 3145035
11707 3145035 5993370 4183491 -6824134 -6141721 9850489 4954915 -8099950
11700 -8099950 -14004310 -7595558 -2967015 -1216476 -4717553 -4658213 -8574673 -15161446
11692 -15161446 -11690039 -8396652 -741753 -4658213 -3115365 -1513177 -4391182 -12609813
11684 -12609813 -15102106 -11126306 -5488977 652743 -1275816 3501077 4895574 2788994
11676 2788994 7031825 -2581303 -5073595 -8812034 -2759323 -5281286 -12224101 -3916459
11668 -3916459 118680 -771423 -1394497 1572517 -8515333 -9583458 118680 -2670313
11660 -2670313 890104 4984585 6527433 682413 9464777 -5132935 -18098791
11653 -18098791 -13025195 -563732 1572517 -5251616 -3026355 2551632 4153821
11646 4153821 -5192276 3886789 12758164 11244986 -118680 -1305486 1068125 7595558
11638 7595558 4925244 -178020 -11096636 -5548318 -12491133 -5845019 -3679098 4213161
11630 4213161 1572517 -2254931 -6141721 -3886789 -1068125 -3560418 -8812034 -6023040
11622 -6023040 6616443 -3234046 4361512 7714239 2314271 1898889 4776894 0
11614 0 326371 6497762 -1661528 474722 3679098 9642798 7536218 11007625 5904359
11605 5904359 -7417537 -1008785 -10799934 -9049395 6705453 2907674 2848334 3768109
11597 3768109 1394497 4539532 -4272501 -4865904 -1572517 -4420852 -3649428 5548318
11589 5548318 7239516 5637328 -5696668 -3797779 -13054866 -8574673 -3382397 -1809879
11581 -1809879 -1542847 -1542847 -1453837 -2818664 -6438422 4836234 771423 -534062 1394497
11572 1394497 -6497762 -682413 -4806564 -10977955 3026355 2937344 5726338 6468092
11564 6468092 4806564 979114 4272501 3263716 2937344 -5103265 -1157135 8070280
11556 8070280 2195591 3738438 1631858 13321897 6824134 -830764 2878004 4806564
11548 4806564 1275816 -3293386 -8930715 6290071 -1691198 -7091165 -712083 4420852
11540 4420852 -2670313 1186806 2551632 12639483 3590088 -5073595 -148350 3323056
11532 3323056 -3441737 -3946129 -8010940 -1008785 890104 -949444 1008785 -2136250
11524 -2136250 1572517 -3145035 3026355 6735124 -1453837 -7328527 474722 5281286
11516 5281286 2284601 -10384552 -12669154 -10681254 -9435107 -6675783 -13588928 -1038455
11508 -1038455 1958229 -3827449 -3412067 1987900 9553788 5637328 -178020 -3441737
11500 -3441737 -712083 4035140 -2818664 -8070280 -7506547 -6616443 -7476877 -2640643
11492 -2640643 5874689 4183491 534062 4242831 1839549 3026355 10117521 11215316
11484 11215316 2136250 -6141721 -267031 -4242831 -1631858 4124150 -3708768 2610973
11476 2610973 1542847 -2670313 1305486 -2403282 -207691 4361512 6438422 9138406
11468 9138406 -8099950 -19552628 -8663683 -12105421 -3530747 5548318 5874689 8159291
11460 8159291 -4391182 -11660368 -8040610 -2996685 3738438 -445052 -1572517 2610973
11452 2610973 -1068125 6794464 -3323056 1720868 -1513177 -8188961 -979114 -771423
11444 -771423 -7328527 -4005470 -2195591 5043925 178020 4984585 4272501 -13648269
11436 -13648269 -4420852 -563732 -16288912 -5963700 5488977 4687883 3441737
11429 3441737 -356041 5993370 -4539532 504392 -3382397 -2106580 11304327
11422 11304327 7209846 1928559 -4865904 -3590088 4747224 10621913 -6705453
11415 -6705453 -6023040 -8248301 2699983 -979114 -2314271 -415382 1928559 -1186806
11407 -1186806 -8634013 -8010940 -4480192 -3886789 -19166916 -16555943 -9880159 -7180176
11399 -7180176 -1513177 -563732 4035140 10147191 385711 11274657 -2640643
11392 -2640643 -5488977 623073 -1335156 6942815 4124150 -1750538 -6408752 -1898889
11384 -1898889 -1809879 4569203 12016410 12194431 8841704 -5637328 -4598873 -356041
11376 -356041 1305486 2967015 -3916459 -11660368 -1305486 -682413 59340 -2343941
11368 -2343941 -6349412 3797779 3708768 445052 -5340627 -1750538 3115365 4035140
11360 4035140 4272501 6942815 -2225261 -8188961 -14805404 -12758164 -10443892 -4242831
11352 -4242831 5162606 6408752 7862589 -3501077 -949444 1364826 -3560418 2818664
11344 2818664 267031 -2788994 -534062 4094480 -2373612 1780209 -2699983 296701
11336 296701 5607658 4569203 6972485 13351567 -801094 -5251616 -13588928 -11957070
11328 -11957070 -4925244 -7328527 -6586773 -3263716 2818664 2581303 -3412067 -415382
11320 -415382 979114 5904359 682413 -5934030 -8010940 -2403282 -2106580 -5963700
11312 -5963700 830764 5103265 9909830 4539532 2581303 4005470 5696668 6230731
11304 6230731 -979114 -3204376 -1720868 -1246146 -4747224 -2432952 178020 -4242831
11296 -4242831 148350 -5251616 6319741 6705453 13351567 3738438 4242831 326371
11288 326371 -4450522 4509862 10028510 2076910 2373612 -3115365 -1216476 -3501077
11280 -3501077 1631858 3026355 -1305486 -4539532 -5162606 -9168076 -2818664 -1958229
11272 -1958229 -7298856 -15339467 -6527433 -3530747 534062 -1691198 1898889 207691
11264 207691 -2996685 -267031 9939500 5221946 6824134 7625228 3946129 3708768
11256 3708768 9672468 4984585 7298856 3530747 -8990055 -4331841 -1483507 1661528
11248 1661528 -4124150 -4302171 1246146 1898889 623073 -7298856 -9672468 -207691
11240 -207691 -4480192 -13173546 -11066965 -4628543 -474722 474722 -1809879 3619758
11232 3619758 -148350 -5963700 534062 -2492292 -7061495 -1631858 -4361512 -3738438
11224 -3738438 -4658213 -8841704 -1364826 12876845 11423007 7328527 741753 3263716
11216 3263716 3412067 2017570 -1839549 -7892259 -652743 5429637 6023040 -1127465
11208 -1127465 -10414222 -4064810 3293386 6230731 356041 2848334 6913144 -29670
11200 -29670 267031 1097795 -11719709 -12075751 -8752694 -12728494 -385711 -8159291
11192 -8159291 -14953755 -12313112 -3204376 1898889 -2492292 801094 -2136250 5340627
11184 5340627 -1246146 2106580 -2254931 2759323 1097795 12402122 -3145035
11177 -3145035 -10176861 -2076910 8218631 16793304 12639483 -415382 -11244986
11170 -11244986 -15013095 -4124150 -534062 1424167 -3234046 -8070280 -1364826
11163 -1364826 11630698 9613128 7239516 2017570 5221946 -8337312 -3441737
11156 -3441737 -1275816 6082380 1839549 -2848334 -4598873 -3560418 -3085695 -5162606
11148 -5162606 -3412067 -2759323 -3708768 -12520803 -10829604 -6171391 -2047240 -4836234
11140 -4836234 267031 8040610 4539532 -504392 -6646113 -16407592 -7536218 -9909830
11132 -9909830 -3441737 1661528 -385711 -2759323 3115365 8010940 4925244 4242831
11124 4242831 -830764 2551632 -771423 3145035 -9494448 6290071 10770264
11117 10770264 10384552 4539532 7476877 -5577988 -1928559 2878004 -29670 -5874689
11109 -5874689 -6408752 -2284601 12046080 16644954 623073 2610973 -3501077 -7654898
11101 -7654898 563732 -6408752 -6764794 -13677939 -7447207 -12283442 -2878004 -1335156
11093 -1335156 -534062 771423 13826289 5162606 3975800 3886789 1661528 -1661528
11085 -1661528 -6586773 -5666998 -5043925 1483507 3085695 207691 4094480 9108736
11077 9108736 6379082 3679098 13707609 5459307 6675783 9079065 4539532 12787834
11069 12787834 7269186 -3056025 -474722 -3234046 -3115365 -2492292 -3352726 -1691198
11061 -1691198 -3649428 -5666998 -3234046 -2551632 2788994 4598873 -4450522 -10503233
11053 -10503233 -682413 -5726338 -8188961 -5459307 -474722 -6527433 -1127465 -7714239
11045 -7714239 2729653 -4094480 -534062 534062 -801094 1928559 -8871374
11038 -8871374 -415382 3975800 -3026355 -4569203 979114 -4539532 -3679098 89010
11030 89010 8574673 7209846 -1869219 -623073 1691198 6408752 3946129 1186806
11022 1186806 -474722 -1483507 6853804 178020 4480192 3679098 -3619758 -7180176
11014 -7180176 -919774 5132935 7625228 14271342 10592243 -593403 -1246146 5577988
11006 5577988 8485662 7031825 5162606 -16704294 -17208687 -2551632 801094 5756009
10998 5756009 2017570 -59340 -1869219 -8426322 -6141721 7328527 -2225261 -59340
10990 -59340 207691 -5666998 18484503 12046080 2225261 919774 5043925 3738438
10982 3738438 -4242831 -2670313 -2581303 -4687883 -504392 3797779 2581303 2907674
10974 2907674 13529588 9672468 5192276 5577988 -6468092 -148350 -4717553 -1958229
10966 -1958229 -7714239 -4331841 2432952 9880159 4747224 -771423 6764794 15547158
10958 15547158 5785679 -3679098 89010 6260401 -3708768 -1958229 -7239516 -5874689
10950 -5874689 -6942815 6616443 -3827449 -741753 -3174706 -7595558 -11986740
10943 -11986740 -3679098 11690039 3352726 -296701 -4005470 3412067 5815349
10936 5815349 1394497 4925244 2729653 3441737 -5162606 -6260401 -2848334 -2047240
10928 -2047240 771423 890104 3501077 -4420852 -10710924 -4865904 -3649428 -14390022
10920 -14390022 -2492292 5162606 8930715 14479033 -89010 -8812034 -8812034 -9435107
10912 -9435107 59340 -10058180 -7832919 -1928559 -7180176 -2996685 -5014255 563732
10904 563732 326371 949444 -415382 -3412067 7091165 178020 118680 -6201061
10896 -6201061 -4865904 -3293386 -6616443 -2432952 -8960385 -9257086 -1068125 4183491
10888 4183491 3797779 -2788994 -7476877 -10651583 -10295542 -356041 -2017570 801094
10880 801094 1453837 -6675783 -11037295 -7625228 2907674 1750538 5548318 5162606
10872 5162606 6853804 -5192276 -1631858 3530747 9909830 3886789 2017570 8990055
10864 8990055 12698824 5577988 3085695 -1661528 -10562573 -6023040 -2521962 5815349
10856 5815349 1720868 3619758 5518647 3886789 2492292 -919774 -6764794 -8248301
10848 -8248301 -8218631 -16437263 -9049395 -6853804 -6557103 3797779 -1453837 -7595558
10840 -7595558 4391182 801094 -1928559 -1127465 326371 -1898889 -2937344 1394497
10832 1394497 -3026355 -6883474 -6438422 -3708768 830764 1542847 -59340 7595558
10824 7595558 4747224 6794464 3590088 -4776894 1780209 2878004 -4984585 -3975800
10816 -3975800 534062 -5785679 -3263716 -7536218 -16051551 -5103265 -2076910 -6171391
10808 -6171391 -7743909 -4836234 3679098 2996685 2551632 6675783 8010940 890104
10800 890104 -741753 -4598873 -1631858 3649428 -4391182 1305486 -237361 4925244
10792 4925244 13381237 3827449 -6913144 890104 -1602188 -1839549 -4658213 -10859274
10784 -10859274 1186806 3886789 5518647 1691198 -5696668 -4628543 -10888945
10777 -10888945 -11066965 -6319741 -1691198 6675783 -4153821 -5726338 -7892259 2581303
10769 2581303 148350 4094480 -2521962 1394497 3115365 3768109 2462622 4183491
10761 4183491 1483507 -5548318 -385711 -2254931 -2551632 -1008785 -4480192 -207691
10753 -207691 11126306 13470248 7981270 13440577 12372452 -6260401 -5429637 -7476877
10745 -7476877 -919774 -3204376 -1483507 3738438 2343941 8070280 12372452 -4747224
10737 -4747224 2343941 2343941 -8307642 3738438 12135091 9316427 -1839549 -6557103
10729 -6557103 1572517 -8545003 -6824134 -682413 -5281286 -1424167 -3204376 6942815
10721 6942815 12372452 3560418 1127465 -3145035 830764 -3204376 -7832919 -2521962
10713 -2521962 -5726338 -2373612 5696668 -2314271 -9761479 -5666998 -3946129 -2581303
10705 -2581303 -3946129 -8545003 -11304327 0 -4420852 -3056025 -11482348 1038455
10697 1038455 5963700 4213161 3204376 5815349 -2492292 -4480192 -9494448 7773579
10689 7773579 3619758 1809879 2254931 5310956 1097795 -890104 5518647 1068125
10681 1068125 5488977 6557103 89010 -2047240 2225261 -237361 -3115365 -9613128
10673 -9613128 -13173546 -9613128 -6349412 -1305486 -5696668 -6438422 3797779 8455992
10665 8455992 2225261 7091165 -1364826 -7832919 -3234046 -3946129 -5429637 89010
10657 89010 7743909 919774 296701 -3708768 -29670 207691 4865904 -2403282
10649 -2403282 -1602188 -11482348 1186806 10829604 7476877 -1483507 -3768109 237361
10641 237361 -6942815 6824134 11571358 7120836 29670 12372452 593403
10634 593403 -2610973 -11393337 -9049395 8871374 -4183491 -9316427 -6438422 1631858
10626 1631858 7061495 -6052710 -2314271 6705453 3412067 1394497 -2996685 -5132935
10618 -5132935 -2343941 6557103 -3797779 2076910 12164761 3768109 3797779 -2403282
10610 -2403282 3056025 2076910 3323056 -267031 10503233 -1513177 3857119 1097795
10602 1097795 7209846 9197746 -178020 -1127465 -4509862 -5904359 -6942815 207691
10594 207691 -296701 -8455992 -6141721 -237361 5666998 2640643 7120836 6883474
10586 6883474 9375767 6824134 5845019 3649428 -4658213 8782364 4480192 10948285
10578 10948285 385711 3115365 10354882 4480192 -1780209 -2225261 -11868060 -16882315
10570 -16882315 -15042766 -19700979 -11630698 2878004 9316427 5192276 -3204376
10563 -3204376 -5399967 -6171391 771423 -2521962 -207691 29670 6319741 -1127465
10555 -1127465 3530747 3560418 -1542847 -7328527 -3857119 -1424167 -5370297 -1008785
10547 -1008785 -9761479 -5756009 -2462622 4183491 -9138406 -13114206 -9197746 -1008785
10539 -1008785 0 5310956 5756009 -1898889 326371 919774 -3916459 -4628543
10531 -4628543 -7714239 -8663683 -2403282 -8604343 2670313 29670 2818664 3679098
10523 3679098 4747224 6468092 8248301 6082380 9019725 -9286756 -6408752 -9138406
10515 -9138406 -7892259 -2788994 -4420852 623073 5370297 35129457 210509714
10508 210509714 119006971 45543680 18810875 15547158 20027351 8901045 14924085
10501 14924085 19611969 6171391 9613128 4213161 7506547 2403282 -1216476
10494 -1216476 534062 -12609813 -7892259 2996685 5073595 1691198 1691198 7328527
10486 7328527 9375767 -4302171 -18959225 -15606498 -682413 7654898 4272501
10479 4272501 3916459 -3827449 652743 4539532 -7654898 -15191116 -4064810
10472 -4064810 -1869219 -7803249 -11096636 -4925244 -3857119 8960385 -5429637
10465 -5429637 -6942815 -8990055 -3412067 3886789 -1335156 -7091165 -3649428 3501077
10457 3501077 1928559 -4480192 -6646113 2314271 -445052 -2076910 -267031 -8812034
10449 -8812034 -5103265 -1513177 -3352726 -3026355 -9672468 -12135091 -4895574 -8040610
10441 -8040610 -8901045 -7565888 -12580143 -7031825 -3738438 -237361 -7684568 -5666998
10433 -5666998 5696668 4302171 4302171 8129621 8693353 -2907674 2284601 -4005470
10425 -4005470 -1483507 -5518647 -860434 6468092 -4420852 -9286756 -6675783 -712083
10417 -712083 5785679 474722 4776894 5637328 4509862 7150506 1453837 -5963700
10409 -5963700 1186806 11363667 5963700 -2699983 -14241672 -3115365 6794464
10402 6794464 -3590088 -5785679 -2878004 10354882 17416378 237361 -2788994
10395 -2788994 -1513177 4331841 8871374 10236201 7417537 -593403 2284601 -3619758
10387 -3619758 -2462622 -4480192 -2759323 -385711 4865904 4242831 4776894 1394497
10379 1394497 -5756009 3590088 1572517 -2581303 2373612 4717553 -11512018
10372 -11512018 4836234 3204376 2640643 7714239 1216476 -2551632 89010 -2729653
10364 -2729653 -5399967 385711 1809879 8693353 8782364 4836234 3768109 -2492292
10356 -2492292 -919774 -7803249 -4272501 -4361512 1127465 2818664 -3679098 -12995525
10348 -12995525 -14597713 -3827449 5577988 16615284 5014255 -8277971 -6230731
10341 -6230731 1453837 -4450522 -5696668 148350 -12402122 -6972485 -8752694 1898889
10333 1898889 -830764 -1513177 4035140 -2314271 -4569203 6942815 9672468 -445052
10325 -445052 -2878004 -89010 -4450522 4391182 -4331841 -7328527 -4450522 -5845019
10317 -5845019 -10236201 -1335156 5518647 3263716 6141721 5132935 712083 5459307
10309 5459307 3649428 3916459 -4836234 -6735124 -10028510 -2996685 5518647 6824134
10301 6824134 -3946129 -1661528 -2729653 -2403282 -14152661 -7654898 9108736
10294 9108736 3263716 -5726338 -10562573 -4242831 -8574673 -8693353 -10147191 -8455992
10286 -8455992 2848334 2818664 4420852 5993370 9613128 12431792 5370297 2848334
10278 2848334 7595558 178020 -7921930 1661528 6408752 1958229 1542847 -10325212
10270 -10325212 -13203216 -10948285 -2017570 12016410 3797779 5340627 6141721 -5221946
10262 -5221946 474722 -3471407 3234046 10562573 3768109 2878004 7091165 4658213
10254 4658213 8752694 -860434 1869219 1928559 9316427 4628543 4153821 -415382
10246 -415382 2729653 -7506547 -12580143 -12075751 -7595558 -7150506 6349412 1275816
10238 1275816 4717553 -5162606 -7091165 -7951600 -10473562 -8277971 -6913144 -1216476
10230 -1216476 -593403 1720868 -9049395 -5221946 4361512 3975800 -3263716 -3174706
10222 -3174706 4094480 623073 712083 -9969170 -16466933 -2848334 -3056025 1572517
10214 1572517 -5073595 -2225261 7447207 8485662 4984585 -7358197 -12787834 -4687883
10206 -4687883 -7625228 -19641639 -13796619 -3352726 -2996685 5845019 13944970 4124150
10198 4124150 6497762 1750538 -5014255 -2403282 -2076910 -5251616 -12372452 -14241672
10190 -14241672 -11630698 -18306482 -10681254 -6112050 -7358197 -8010940 -9880159 771423
10182 771423 -89010 -7387867 -3827449 6557103 7239516 9079065 -5103265 1572517
10174 1572517 949444 -6230731 -474722 -4005470 -4569203 -1246146 -12342782 -385711
10166 -385711 5014255 9494448 5756009 2284601 6290071 -919774 -10384552 -2165920
10158 -2165920 -9079065 -12016410 -1809879 -771423 3649428 -2017570 -2996685 -7239516
10150 -7239516 -652743 -9108736 -5429637 5785679 8218631 -2136250 1987900
10143 1987900 -7862589 -4806564 -6112050 -4628543 -3679098 -10236201 -3530747 4836234
10135 4836234 3530747 -5281286 3145035 9138406 2848334 -3471407 -6438422 -237361
10127 -237361 7061495 4954915 -3441737 -801094 296701 -5607658 -3619758 -5310956
10119 -5310956 -4361512 -3174706 -6497762 3204376 -1246146 -3382397 -356041 -1750538
10111 -1750538 -1305486 -534062 4094480 10206531 4836234 7565888 -89010 -6141721
10103 -6141721 2462622 -652743 7743909 11482348 18721864 7031825 3323056 2699983
10095 2699983 9316427 3441737 14152661 9731809 6616443 -4865904 -6290071
10088 -6290071 296701 -8248301 -9019725 6349412 8426322 12491133 9761479 2403282
10080 2403282 -4747224 4153821 5637328 4183491 4954915 -10888945 -2848334 -5459307
10072 -5459307 -3768109 7595558 7773579 13885630 10948285 4658213 2343941 -6586773
10064 -6586773 -7031825 -13292227 -2729653 -7091165 -4272501 -3857119 -5666998 1661528
10056 1661528 7654898 12135091 10740594 -5815349 -5666998 -504392 830764 -6171391
10048 -6171391 -3886789 2373612 7239516 -2373612 -9197746 -12461463 -4954915 -1008785
10040 -1008785 5251616 -3886789 -2699983 -4450522 -4984585 -2403282 -979114 -8515333
10032 -8515333 -2551632 296701 3916459 3234046 5310956 2106580 1246146 -5221946
10024 -5221946 -1394497 8693353 5577988 4895574 -2165920 -1572517 2907674 -4539532
10016 -4539532 -11274657 -5014255 -7358197 -4509862 -3234046 -5459307 -12936185 -3323056
10008 -3323056 534062 415382 -415382 -11244986 -15547158 -10443892 -2937344 -1958229
10000 -1958229 -7180176 -7684568 -3827449 -4776894 -4450522 -9731809 -2907674 1780209
9992 1780209 -6379082 1364826 -89010 6141721 2254931 -89010 -1424167 -7773579
9984 -7773579 -1157135 -6913144 -1750538 474722 3590088 6171391 10117521 -3263716
9976 -3263716 -3293386 3590088 3738438 2788994 -1216476 -12105421 -3204376 -4064810 -1157135
9967 -1157135 -7476877 -5993370 -13559258 2967015 5785679 12995525 1780209
9960 1780209 -2136250 2492292 2165920 3471407 -9702139 -7506547 -15161446 2699983
9952 2699983 830764 14597713 9464777 2195591 -3590088 4925244 -2136250 -2818664
9944 -2818664 2729653 3530747 6883474 -890104 -6764794 -4836234 8871374 -7269186
9936 -7269186 -3946129 -1602188 623073 5488977 -7921930 -13203216 -8990055 -1542847
9928 -1542847 563732 3916459 1364826 -415382 -9464777 -3174706 -9108736 -7031825
9920 -7031825 -5696668 -9880159 -12669154 -1335156 2106580 -415382 -326371 3204376
9912 3204376 -1246146 -4331841 -237361 1453837 -4064810 2136250 -8248301 -13321897
9904 -13321897 -14686724 -4776894 1928559 11779049 13262557 -148350 -2640643 6557103
9896 6557103 5577988 4183491 -1335156 415382 -1839549 -4954915 3145035 0
9888 0 -2551632 29670 -2996685 -7803249 -1216476 -4005470 1780209 -919774 -4094480
9879 -4094480 6913144 -2373612 -10888945 -9494448 5399967 10710924 5103265 4539532
9871 4539532 504392 1394497 -59340 7298856 6735124 1750538 -6171391 -8752694
9863 -8752694 1246146 -8455992 -445052 -1572517 -1691198 -12906515 5993370 5607658
9855 5607658 -9375767 -11690039 -8515333 -1305486 -890104 5934030 -29670 11037295
9847 11037295 -1275816 -3471407 -1869219 -8990055 -16852645 -5874689 8366982
9840 8366982 -801094 7595558 3916459 860434 14864745 15013095 -7120836 -8218631
9832 -8218631 4391182 8426322 2818664 -6824134 -4747224 -1335156 -4153821 -1097795
9824 -1097795 2759323 -2521962 5756009 6735124 5399967 -7091165 -1275816 474722
9816 474722 -2878004 801094 6705453 -652743 -8070280 -4717553 -12609813 -8812034
9808 -8812034 -3412067 -2937344 -652743 -1216476 -1780209 -4598873 12787834 17208687 2907674
9799 2907674 -8129621 -16496603 3026355 1572517 4450522 -534062 -1958229 8218631
9791 8218631 13529588 1809879 -2254931 -3560418 3886789 7120836 2581303 0
9783 0 2878004 -296701 -9079065 -1038455 -1928559 -3530747 7328527 9969170 -2640643
9774 -2640643 1720868 -1157135 3263716 -7714239 1038455 1809879 1958229 6764794
9766 6764794 4153821 -2818664 -4687883 -1186806 -860434 -6141721 -15131776 -10918615
9758 -10918615 -9791149 623073 6853804 11601028 -1720868 5340627 22638324
9751 22638324 12224101 89010 -12669154 -11096636 1780209 -6616443 -4836234
9744 -4836234 -3234046 5310956 -12639483 -24626224 -10918615 1305486 9672468
9737 9672468 -1542847 5251616 6408752 8812034 2788994 9227416 6349412 5666998
9729 5666998 5696668 -2225261 -741753 3234046 4509862 -178020 296701 4005470
9721 4005470 -3352726 3382397 -8070280 -4064810 1898889 1542847 1246146 -1691198
9713 -1691198 -4509862 -9019725 1335156 12728494 8930715 2254931 -3975800 1364826
9705 1364826 9286756 5132935 -10265871 -10740594 -9731809 -18009781 -5785679 2937344
9697 2937344 6646113 8604343 8960385 1394497 4124150 2195591 -860434 -1186806
9689 -1186806 -5073595 -2967015 -6201061 -10621913 -2017570 7328527 -3056025 -4391182
9681 -4391182 -11007625 -10770264 -11007625 -5963700 10147191 4331841 8901045 10532903
9673 10532903 4509862 -504392 -326371 -8545003 -3649428 3886789 -89010 0
9665 0 -3827449 -5103265 -178020 -2017570 1424167 3204376 2492292 5014255 2907674
9656 2907674 -9553788 -207691 1661528 1661528 3560418 2076910 -1869219 1750538 118680
9647 118680 -3768109 623073 -7239516 -4895574 -10621913 -16852645 -11393337 -5934030
9639 -5934030 -4865904 118680 -2047240 -5192276 -2729653 -7595558 -10265871 3530747
9631 3530747 3085695 593403 -2551632 0 6497762 -1068125 -4954915 1720868
9623 1720868 10651583 8426322 8634013 7743909 1780209 -4035140 8752694 1631858
9615 1631858 5340627 4865904 207691 -5666998 4391182 7387867 14004310 -3174706
9607 -3174706 3352726 2343941 -15903200 -12164761 -6527433 -7447207 -12164761 -13648269
9599 -13648269 -8188961 3234046 -237361 -7892259 -3679098 -8307642 -11719709 -8663683
9591 -8663683 -8604343 -16051551 -3026355 2551632 4361512 11868060 6408752 5756009
9583 5756009 13826289 13440577 -3738438 -4183491 -5904359 -10592243 -6616443 -2699983
9575 -2699983 -2907674 -11868060 -15042766 -5221946 -5607658 -1483507 1928559 8099950
9567 8099950 12046080 5429637 2225261 326371 5340627 3797779 -2343941 5073595
9559 5073595 10829604 7862589 5874689 8871374 7565888 6171391 11037295 -5162606
9551 -5162606 -13559258 -4420852 -4539532 -5310956 2640643 741753 -2610973 -3263716
9543 -3263716 -1958229 4806564 -3085695 -3174706 -3530747 -5963700 -6260401 -3085695
9535 -3085695 2017570 -5785679 -7921930 -1335156 2403282 8841704 7180176 1394497
9527 1394497 -1097795 4064810 -682413 -7476877 -2373612 2254931 -2967015 -5340627
9519 -5340627 -2521962 -7773579 -3412067 -14390022 -12995525 -2937344 8188961
9512 8188961 771423 7031825 8040610 6735124 -1898889 -29670 -1305486 2403282
9504 2403282 6913144 3501077 8693353 5399967 13173546 10948285 4331841 -5192276
9496 -5192276 -12580143 -7002155 -2017570 -13677939 -1809879 415382 1572517 5666998
9488 5666998 7476877 6824134 7625228 -2254931 4420852 -1394497 -10384552 -385711
9480 -385711 -6408752 -8515333 -8663683 1839549 13737279 3085695 -8960385
9473 -8960385 -1542847 2076910 1987900 267031 3471407 2818664 -1869219 4302171
9465 4302171 2492292 1127465 -7447207 1839549 -890104 11838389 11126306 -1869219
9457 -1869219 -3916459 -979114 1572517 1068125 -890104 -326371 -118680 -14390022
9449 -14390022 -9642798 -6883474 -10236201 -9939500 -13796619 -9702139 -2314271 -6379082
9441 -6379082 5845019 17000995 10888945 9405437 10621913 -3560418 -1186806
9434 -1186806 4806564 -4064810 -5429637 11986740 4509862 -2492292 771423 -3916459
9426 -3916459 -12669154 -1008785 10058180 19789990 35307478 34862426 57708441
9419 57708441 195704309 972201806 638946680 181907689 82601697 54207364
9413 54207364 44060172 26999836 20472403 17920770 7031825 11986740 7120836
9406 7120836 20324052 15725179 237361 2521962 1958229 9850489 10562573 12936185
9398 12936185 3263716 -148350 3293386 -296701 3857119 13588928 18009781 26732805
9390 26732805 36761315 77973154 199650439 940069033 681879387 193271357
9384 193271357 90731318 55957902 30708605 17238357 15339467 652743 -919774
9377 -919774 3412067 4628543 7743909 9850489 8159291 5103265 8248301 1542847
9369 1542847 -3412067 8723024 10087851 13262557 6527433 296701 8129621 5577988
9361 5577988 415382 118680 -4747224 623073 1958229 -6052710 -2640643 -1928559
9353 -1928559 -7476877 -12580143 -11096636 -10977955 -3501077 1809879 1424167 3352726
9345 3352726 -207691 -1305486 6082380 -5637328 -563732 4539532 4480192 -1958229
9337 -1958229 -2403282 2373612 1572517 -4183491 4865904 1097795 8812034 14004310
9329 14004310 10621913 178020 3560418 -1186806 -4391182 -9464777 -5488977 -8574673
9321 -8574673 4984585 919774 -4895574 -267031 -3026355 -7002155 -207691 -5726338
9313 -5726338 3145035 6586773 8723024 2225261 2848334 5934030 1127465 2848334
9305 2848334 -2967015 -712083 7595558 6408752 3797779 -1542847 2403282 -3412067
9297 -3412067 -10236201 207691 5073595 -623073 -1394497 -7298856 -6052710 -12669154
9289 -12669154 -7298856 1246146 -3649428 -8248301 3441737 -2373612 6705453 8426322
9281 8426322 1186806 89010 6438422 1453837 1424167 -7120836 -3916459 4895574
9273 4895574 7150506 5666998 830764 -1068125 -415382 -3560418 1780209 -6379082
9265 -6379082 -7150506 29670 1958229 -4925244 -17030666 -19908670 -13143876 -5370297
9257 -5370297 -7506547 6468092 10414222 3115365 6349412 -1809879 -9138406 -1839549
9249 -1839549 -4598873 -9108736 -1097795 7892259 5192276 1335156 4836234 3768109
9241 3768109 5904359 4598873 9613128 11838389 3857119 14775734 17060336 34595394
9233 34595394 69398480 307946487 542340672 143662866 52486495 29165757
9227 29165757 12016410 10147191 -6527433 11304327 4687883 2848334 4954915
9220 4954915 5132935 5162606 6171391 1987900 -4005470 6408752 6735124 801094
9212 801094 59340 -207691 -2996685 9494448 1720868 2521962 4628543 4747224 5518647
9203 5518647 5429637 -8337312 -1602188 1453837 623073 4984585 -3441737 -356041
9195 -356041 5518647 2492292 -504392 -1750538 -1394497 949444 -2699983 3263716
9187 3263716 2878004 385711 -771423 5429637 4687883 4747224 4509862 2551632 -1186806
9178 -1186806 5251616 11957070 5073595 -2848334 -2996685 296701 -2225261 445052
9170 445052 1038455 -1186806 -6497762 -11838389 59340 -1869219 -1987900 267031
9162 267031 -3797779 1305486 59340 -3293386 -2195591 -8782364 -10710924 3649428
9154 3649428 18158131 -356041 -9138406 -7684568 -15636169 -4272501 1631858
9147 1631858 2254931 1631858 -5637328 -4717553 -9286756 -6853804 -14805404 830764
9139 830764 4450522 2996685 3056025 9820819 -1809879 2967015 -2373612 1157135
9131 1157135 -534062 4064810 -9791149 -6942815 207691 -7061495 -623073 11185646
9123 11185646 5904359 -2699983 10503233 -118680 3174706 -7387867 1068125
9116 1068125 623073 -6824134 -7002155 -3946129 1364826 -2907674 2937344 -4925244
9108 -4925244 -3797779 -6112050 -7476877 -2314271 -534062 -2937344 -10087851 -12253771
9100 -12253771 -16437263 -2610973 -6260401 -7150506 -9286756 -2432952 2076910 4124150
9092 4124150 -415382 -11838389 6023040 1928559 8070280 10265871 -3323056
9085 -3323056 3056025 -3174706 5577988 4984585 5607658 10206531 10770264 3204376
9077 3204376 13855960 7625228 7862589 3234046 1364826 2106580 -4480192 860434
9069 860434 -7803249 -6260401 1631858 2254931 10681254 11215316 2937344 7476877
9061 7476877 1602188 -5014255 -8040610 3115365 -1691198 -2907674 11452677
9054 11452677 -59340 1364826 2225261 -5637328 -5934030 -919774 -1394497 7269186
9046 7269186 8752694 712083 -9553788 -13618598 -1839549 949444 -1572517 3946129
9038 3946129 5845019 -771423 -860434 7447207 12669154 4865904 1186806 5577988
9030 5577988 6171391 8129621 11897730 7625228 5132935 -148350 -9138406 2165920
9022 2165920 14835075 5281286 -7803249 -860434 3501077 -207691 1335156 -2996685
9014 -2996685 -7832919 5221946 267031 3323056 3619758 296701 801094 -4183491
9006 -4183491 6646113 7862589 4806564 6112050 4391182 1720868 0 -4153821
8998 -4153821 -4183491 -6942815 -8218631 -1780209 3115365 5162606 -7714239 -5014255
8990 -5014255 3975800 -593403 356041 5726338 10503233 9019725 7387867 2136250
8982 2136250 682413 1869219 -2937344 -10740594 -7892259 1364826 7091165 -4450522
8974 -4450522 -11897730 -4776894 385711 7803249 2729653 -563732 -3975800 -6705453
8966 -6705453 6141721 11007625 5637328 -2106580 2521962 -3975800 -2373612 178020
8958 178020 2848334 2432952 4272501 -1483507 4598873 7239516 5845019 -1483507
8950 -1483507 1246146 -1068125 3916459 296701 -1216476 -4183491 -4391182 -1750538
8942 -1750538 5221946 919774 445052 1602188 1424167 8901045 -3501077 296701
8934 296701 7061495 5459307 5934030 1453837 -1127465 7328527 -2136250 8099950
8926 8099950 -5221946 -1424167 3619758 7803249 2729653 -2670313 7743909
8919 7743909 3560418 -2788994 -563732 2403282 5340627 6379082 1483507 -3263716
8911 -3263716 4895574 6527433 5874689 -2314271 -9108736 -2403282 1424167 -3234046
8903 -3234046 -11749379 1246146 4331841 2759323 6557103 7506547 8515333 10918615
8895 10918615 -12194431 -178020 237361 4272501 -1008785 2432952 9909830 10532903
8887 10532903 593403 -1542847 -3590088 -712083 -9346097 -3560418 4094480 -5607658
8879 -5607658 -1127465 -1720868 4124150 -712083 -5162606 -6171391 -4213161 -11601028
8871 -11601028 -5014255 -8990055 -12758164 -1631858 -2403282 860434 -1305486 -4302171
8863 -4302171 3382397 -3085695 -5399967 -5607658 -4361512 -2403282 1958229 -2521962
8855 -2521962 8129621 534062 3234046 -534062 -3056025 -3768109 -1869219 -4213161
8847 -4213161 5845019 5281286 -6438422 -4064810 -3679098 -4598873 -6616443 -2937344
8839 -2937344 -2373612 -3708768 -6171391 3412067 -890104 3145035 5518647 3679098
8831 3679098 9257086 8129621 -6052710 4153821 10532903 17831760 4925244
8824 4925244 -10176861 267031 1157135 -860434 -5726338 -6290071 -7565888 771423
8816 771423 -3501077 -3827449 -9108736 5014255 8485662 15013095 5162606 -1869219
8808 -1869219 8782364 504392 6764794 -1631858 -4420852 -5726338 1424167 5132935
8800 5132935 -2610973 2551632 -6230731 -3323056 5251616 860434 3768109 -4124150
8792 -4124150 -5815349 -1780209 -1928559 -10206531 -4331841 -830764 -4242831 -8960385
8784 -8960385 -7506547 -2284601 6853804 -8248301 -1809879 2581303 -1809879 -1780209
8776 -1780209 5043925 8574673 7358197 -5696668 -5874689 -89010 207691 -2729653
8768 -2729653 -2106580 -1869219 652743 5874689 9583458 5310956 -3026355 -979114
8760 -979114 -5132935 -2343941 1364826 -3352726 -4124150 -12580143 -8663683 -12758164
8752 -12758164 -5192276 -11096636 -9079065 -5370297 -9642798 -4776894 -4984585 -3026355
8744 -3026355 4569203 6794464 3886789 -712083 3263716 -1424167 -2403282 -8099950
8736 -8099950 -6972485 3857119 -3501077 -3145035 7536218 6913144 2729653 -13321897
8728 -13321897 -9257086 -771423 2996685 -682413 2284601 -3026355 -563732 -2581303
8720 -2581303 -2907674 712083 -979114 -23350408 -16793304 -9375767 385711 -7447207
8712 -7447207 -8930715 -3085695 -10384552 -7714239 -8752694 -2937344 3886789 -1513177
8704 -1513177 -4806564 830764 -504392 13826289 5429637 5785679 -6112050 -14479033
8696 -14479033 -890104 -5666998 -2521962 -1424167 -6497762 3441737 801094 -4836234
8688 -4836234 -1839549 -2373612 -2373612 1038455 7862589 1513177 -7506547 -8693353 -11393337
8679 -11393337 -3026355 6290071 -7239516 -11601028 -6319741 2610973 3797779 6735124
8671 6735124 59340 -1008785 -8634013 9761479 9939500 5548318 4598873 7031825
8663 7031825 9108736 4480192 4480192 237361 -2343941 -1869219 -7120836 -6646113 -1305486
8654 -1305486 3560418 118680 2165920 -5696668 -16466933 -7358197 -12847174 -10443892
8646 -10443892 3590088 1127465 -504392 3056025 -3857119 -13084536 -9731809 -16377922
8638 -16377922 3174706 -1275816 -207691 1068125 4865904 -4954915 -4836234 -474722
8630 -474722 5993370 4747224 -89010 -3768109 237361 -3263716 -1691198 -13351567
8622 -13351567 -9761479 7209846 13766949 9850489 -5726338 -13351567 -10473562
8615 -10473562 -12936185 -12194431 -10265871 2047240 10206531 6052710 -5162606
8608 -5162606 10740594 1038455 7654898 712083 -11541688 -12491133 -1928559
8601 -1928559 3234046 10354882 9079065 -563732 -1987900 -2788994 -6438422 -6735124
8593 -6735124 -3738438 7417537 -59340 1008785 9820819 -178020 4272501 8545003
8585 8545003 6972485 3382397 -682413 979114 -5518647 1987900 3471407 -4331841
8577 -4331841 -10206531 -13499918 -6616443 10117521 445052 6438422 3323056 -593403
8569 -593403 -1127465 -6646113 -12787834 -12164761 3797779 6853804 9197746 1987900
8561 1987900 -6052710 -5845019 -2403282 -2284601 7892259 267031 415382 6705453
8553 6705453 6646113 -504392 1335156 2047240 -8396652 -8545003 -5488977 -3827449
8545 -3827449 -3263716 3679098 2907674 -4895574 -3679098 -9524118 -7476877 -10829604
8537 -10829604 -2729653 -5607658 -9731809 -5251616 474722 -3738438 -267031 -4569203
8529 -4569203 -5607658 623073 3797779 -4153821 -1958229 -2076910 -5993370 178020
8521 178020 5815349 1572517 -1720868 2403282 1809879 1661528 2284601 -3382397
8513 -3382397 5251616 -2967015 -13232886 -11037295 -3827449 12669154 2848334 0
8505 0 -1305486 -3975800 -652743 -11096636 -5103265 -7120836 -8782364 -10710924 -3115365
8496 -3115365 -89010 -2047240 2165920 -356041 -6082380 3323056 -712083 -4272501
8488 -4272501 -1335156 3026355 1127465 -2818664 -7951600 -7120836 -9494448 -29670
8480 -29670 3857119 -6586773 -10710924 -1809879 6141721 3174706 593403 860434
8472 860434 118680 -3471407 2136250 9375767 5310956 -1335156 4064810 5192276
8464 5192276 -3056025 -4598873 3115365 1305486 415382 -6408752 1216476 -1631858
8456 -1631858 -4954915 5963700 -5934030 -5251616 -504392 6112050 8604343 3234046
8448 3234046 2699983 5785679 -3768109 -4806564 -8752694 1661528 -4687883 -7328527
8440 -7328527 2195591 2848334 6557103 1186806 -2047240 -3382397 9286756 5785679
8432 5785679 -1068125 4628543 -1394497 2788994 1809879 -1246146 -10799934 -9049395
8424 -9049395 -1305486 -148350 7328527 4836234 -623073 -1097795 -16377922 -8634013
8416 -8634013 6527433 10206531 -148350 5014255 7684568 10562573 7120836 7239516
8408 7239516 6913144 3471407 4242831 4094480 2818664 -4124150 -148350 -3946129
8400 -3946129 2492292 10028510 2403282 -2195591 -2967015 -7002155 3797779 3708768
8392 3708768 -1898889 -445052 -2788994 7506547 10384552 -830764 -385711 2136250
8384 2136250 -1928559 207691 -2907674 -1216476 2670313 4509862 6379082 -2551632
8376 -2551632 9969170 -3975800 -4331841 -5310956 7061495 4094480 13796619 10621913
8368 10621913 12965855 2343941 4302171 5756009 -5488977 -10206531 -8455992
8361 -8455992 771423 -296701 -16644954 -11749379 -21065806 2225261 -474722 -12936185
8353 -12936185 -11185646 -3738438 860434 -9672468 -5073595 1839549 -1542847 -3145035
8345 -3145035 12669154 10443892 4331841 1097795 4717553 2017570 11957070 6438422
8337 6438422 -178020 1305486 12283442 8752694 3323056 1839549 7743909 -3352726
8329 -3352726 -7625228 -10681254 -14746064 -12431792 -10977955 -7565888 4064810 -741753
8321 -741753 8010940 356041 -2878004 -10058180 -9583458 4420852 -6112050 59340
8313 59340 3471407 3026355 4480192 7536218 -1780209 -356041 504392 534062 2818664
8304 2818664 7714239 5103265 6972485 3916459 -5429637 -178020 8277971 6675783
8296 6675783 -385711 8545003 2284601 4984585 12164761 7506547 3026355 -860434
8288 -860434 5429637 4509862 -3827449 -5340627 534062 4124150 -3412067 1038455
8280 1038455 5874689 7120836 -1987900 -10503233 -8990055 -2136250 9316427 860434
8272 860434 -4954915 1513177 -296701 -1631858 2521962 2759323 9731809 6290071
8264 6290071 7892259 -5874689 -15487818 -6319741 -7209846 -4391182 1572517 385711
8256 385711 2551632 2373612 1424167 -1572517 -8841704 -8960385 3174706 2462622 -2136250
8247 -2136250 1572517 -4895574 1661528 3886789 5399967 -5221946 1691198 -1275816
8239 -1275816 -1127465 -2521962 -5103265 -5815349 4480192 1038455 5756009 -1483507
8231 -1483507 -2759323 4836234 4331841 -534062 59340 7921930 3293386 -1631858
8223 -1631858 -3441737 -4450522 -2967015 3234046 3886789 8545003 7209846 -237361
8215 -237361 4628543 -3382397 8010940 1305486 -2818664 2581303 3204376 3679098
8207 3679098 -7298856 -4925244 207691 8070280 15161446 -326371 -1750538 -2165920
8199 -2165920 -1453837 3115365 -534062 -10977955 -6972485 -1008785 1246146 5073595
8191 5073595 -623073 -4213161 356041 -1305486 -9761479 -949444 1809879 -7921930
8183 -7921930 445052 741753 267031 -7654898 -13677939 -1602188 3056025 3323056
8175 3323056 -1097795 -12580143 -13292227 -11155976 89010 -2640643 -5577988 10948285
8167 10948285 1038455 -7150506 -5221946 -3234046 -8010940 -15725179 -7269186 -4509862
8159 -4509862 5577988 -5281286 -9375767 -16377922 -7714239 -1572517 -2521962 771423
8151 771423 2254931 3916459 5192276 11363667 -1750538 -3916459 2996685 -5488977
8143 -5488977 -860434 -5162606 -623073 563732 -1186806 3412067 4776894 7684568
8135 7684568 8307642 1246146 5785679 415382 -8752694 -7684568 -3590088 -9108736
8127 -9108736 -7209846 -6230731 -1483507 -6824134 -7625228 2996685 178020 6023040
8119 6023040 801094 -3204376 4509862 18039451 12728494 13440577 7031825 -6290071
8111 -6290071 -1750538 5666998 1097795 -1513177 -178020 3886789 148350 -623073
8103 -623073 6379082 5756009 1513177 -1780209 -5577988 -1691198 4124150 -9316427
8095 -9316427 -8485662 4717553 3412067 -5192276 -3085695 -8426322 -5518647 -1661528
8087 -1661528 -2937344 2136250 3768109 -4895574 -2521962 -2136250 -7328527 -949444
8079 -949444 4124150 7832919 1809879 1513177 5785679 2462622 -3145035 -16882315
8071 -16882315 474722 6675783 2759323 2551632 5162606 -10117521 -2254931 -4925244
8063 -4925244 4361512 3115365 -3649428 8337312 -1335156 10562573 15072436 9850489
8055 9850489 6586773 5785679 8040610 8455992 6794464 3174706 9642798 4717553
8047 4717553 -5429637 -5874689 -9791149 712083 -2492292 -3916459 4925244 -504392
8039 -504392 8099950 16199901 12580143 10117521 -415382 1572517 3471407 4153821
8031 4153821 14390022 8782364 6052710 -7684568 -3471407 -2284601 -2076910 7387867
8023 7387867 6675783 -1364826 -3263716 1602188 5221946 6171391 7269186 3560418
8015 3560418 -8752694 -4302171 -12164761 -8426322 -4331841 7981270 6794464 7743909
8007 7743909 682413 2878004 3738438 4035140 -4391182 -1038455 -3145035 5934030
7999 5934030 -3293386 -2551632 -5132935 -12906515 -7773579 3471407 -1542847 -8218631
7991 -8218631 -7506547 -148350 652743 -8307642 -504392 4183491 -4005470 -12936185
7983 -12936185 -593403 -6023040 -4865904 -1809879 -8188961 -6824134 -4539532 5399967
7975 5399967 -7892259 -10028510 -6942815 -6616443 -6942815 -7061495 -10948285 4480192
7967 4480192 6319741 3708768 1157135 860434 7743909 3975800 5192276 -2907674
7959 -2907674 2403282 2967015 -9316427 -1424167 -3382397 2403282 -8841704 -1127465
7951 -1127465 -4658213 -11482348 -9820819 -5963700 -5726338 -1987900 4094480 2314271
7943 2314271 -2759323 -7921930 -7417537 -3619758 -534062 -3975800 -2996685 -741753
7935 -741753 -3738438 -207691 326371 -8574673 -12906515 -6260401 -1186806 -2996685
7927 -2996685 -3768109 -3056025 4717553 9553788 4776894 -1424167 -5281286 -4925244
7919 -4925244 4687883 -89010 8901045 3768109 -148350 -89010 -2462622 10770264
7911 10770264 14746064 12639483 3560418 -7654898 -5014255 -5934030 -8485662 -8040610
7903 -8040610 -13885630 -10087851 -15873530 -20947125 -9791149 -2136250 3560418 -5548318
7895 -5548318 2788994 -6764794 -2136250 14449363 8693353 -3619758 5221946 -2699983
7887 -2699983 3530747 -9346097 -5993370 -1750538 -3708768 9108736 13766949 2136250
7879 2136250 1038455 7417537 3056025 -504392 1038455 -10087851 -16793304 -15814189
7871 -15814189 -9731809 -4658213 -1364826 1424167 5548318 2907674 -356041 -7684568
7863 -7684568 -12609813 -12906515 -1453837 -1364826 3412067 -5399967 -8307642 -17861430
7855 -17861430 -4954915 3145035 -5488977 -8812034 1898889 -7565888 -12995525
7848 -12995525 -2581303 -2047240 -8723024 -10028510 -10977955 -10087851 -1542847 -5429637
7840 -5429637 -7476877 2047240 -5577988 -1869219 -4539532 -9553788 -7921930 -1008785
7832 -1008785 -415382 -89010 -207691 2254931 237361 -6112050 -1394497 -4331841
7824 -4331841 504392 2195591 -10028510 -9197746 -2670313 7714239 1809879 2314271
7816 2314271 10829604 2403282 -7269186 1335156 3708768 9939500 7387867 3619758
7808 3619758 4895574 7328527 -3827449 -4539532 -8366982 -3946129 -1869219 296701
7800 296701 3174706 2314271 4183491 8871374 -1216476 -7981270 -7358197 11541688
7792 11541688 6586773 5666998 11185646 11066965 8574673 1602188 -6052710 -919774
7784 -919774 -2017570 2937344 6735124 -2492292 -6764794 -4480192 13796619 13054866
7776 13054866 4420852 2581303 3768109 4420852 -860434 -1602188 -4954915 1038455
7768 1038455 -89010 3441737 2284601 2878004 5756009 10859274 -4865904 -6052710
7760 -6052710 -11066965 -10058180 -10117521 -4895574 -771423 -3056025 -4361512 -3056025
7752 -3056025 2610973 -3797779 -7417537 -1750538 -11066965 504392 -3886789 -11512018
7744 -11512018 -3056025 -326371 7447207 5132935 -830764 2432952 -2521962 -4539532
7736 -4539532 -2996685 1750538 -1424167 -2225261 563732 -7595558 -6497762 -4183491
7728 -4183491 -12817504 -1216476 5429637 3234046 5518647 3649428 979114 -29670
7720 -29670 -7358197 1898889 1335156 1216476 -2492292 -5666998 -8426322 7358197
7712 7358197 949444 -10443892 -3293386 -2878004 -7951600 -10473562 -207691 5429637
7704 5429637 1602188 -2759323 2670313 7832919 593403 2492292 -2670313 -4094480
7696 -4094480 -593403 5340627 5785679 8693353 3263716 3115365 623073 -6468092
7688 -6468092 -267031 59340 -8693353 -12372452 -1364826 -1157135 -3886789 -2403282
7680 -2403282 -4005470 -2848334 6052710 -2996685 8545003 3263716 207691 2640643
7672 2640643 6379082 -1424167 -771423 -8663683 -9820819 -12550473 -15992210 -10977955
7664 -10977955 -7328527 -7832919 -8930715 -5043925 -7536218 -12283442 -5607658 -4094480
7656 -4094480 2937344 -8396652 -2343941 -5459307 -5192276 2403282 -6349412 -7981270
7648 -7981270 2937344 949444 -19048236 -11304327 -10265871 -6705453 3204376 1839549
7640 1839549 -12372452 -6082380 -3085695 -5696668 2195591 -4687883 -9850489 -593403
7632 -593403 -89010 4628543 2848334 -5340627 -534062 -1602188 4153821 8277971
7624 8277971 -830764 -8930715 -1008785 -6557103 -1008785 -5429637 -1394497 1216476
7616 1216476 -10770264 -3471407 7061495 -3975800 -5815349 1453837 2521962
7609 2521962 6527433 -5518647 -18158131 -7209846 -2136250 -2937344 -2492292 -2788994
7601 -2788994 -5073595 -563732 -2343941 -445052 -6260401 -2581303 2610973 6082380
7593 6082380 12075751 3827449 -1127465 4895574 1424167 -563732 -2937344 -11007625
7585 -11007625 -10473562 -2996685 -2818664 2640643 4035140 -5637328 -6023040 -8099950
7577 -8099950 -7417537 -2136250 -2670313 534062 -356041 -7120836 -8901045 -5904359
7569 -5904359 -1750538 -5132935 8040610 10710924 5874689 -11719709 -13292227 1720868
7561 1720868 -1483507 -5310956 -6853804 -3590088 3412067 -2254931 -4806564 -8723024
7553 -8723024 -12016410 -2610973 -9257086 -9316427 -4687883 -6735124 -5132935 -7506547
7545 -7506547 4242831 2788994 -979114 118680 -2225261 2254931 8396652 8841704
7537 8841704 8396652 10918615 13885630 6082380 11868060 9108736 1068125 -2254931
7529 -2254931 -890104 -7447207 -5340627 -6616443 4450522 3352726 -8248301
7522 -8248301 -7921930 -6824134 -1186806 -3590088 -14212001 -5904359 1453837 5014255
7514 5014255 7862589 13470248 14271342 7061495 -741753 -2225261 -2284601 3115365
7506 3115365 11482348 59340 -2937344 3649428 -2996685 -11660368 -3056025 -5014255
7498 -5014255 -10562573 -1364826 3293386 3056025 4539532 4331841 -4183491 -7476877
7490 -7476877 -118680 7061495 89010 -6646113 -1720868 2373612 -5666998 -4153821
7482 -4153821 -2195591 -14508703 -1542847 1068125 -415382 -3738438 -10710924 -7417537
7474 -7417537 4361512 -5815349 3026355 -3708768 -3708768 9049395 4124150 2521962
7466 2521962 2640643 -6082380 3946129 3768109 -7417537 -4687883 -15280127 -14390022
7458 -14390022 -118680 3738438 -8752694 -7091165 563732 -919774 830764
7451 830764 563732 4509862 -4984585 -2759323 -6023040 -6646113 -3708768 2462622
7443 2462622 1483507 -89010 563732 593403 6824134 -5429637 -8366982 860434
7435 860434 5548318 -10503233 2284601 -4242831 2610973 -3382397 -14597713
7428 -14597713 -860434 -415382 -3323056 -6972485 -89010 -8396652 -11185646 -5904359
7420 -5904359 1958229 -2047240 2907674 -4687883 -5221946 -1335156 -415382 -4865904
7412 -4865904 4598873 3679098 -2759323 2284601 2225261 5429637 1750538 6735124
7404 6735124 -7654898 -8812034 -593403 -712083 -10147191 -6023040 -6438422 -14360352
7396 -14360352 -7654898 -16199901 -3797779 -2017570 -207691 -6883474 -5192276 -5132935
7388 -5132935 -6408752 -1097795 -5785679 -4420852 -4064810 -3352726 -5607658 -949444
7380 -949444 -682413 -1364826 -8040610 2462622 5934030 267031 -8812034 -3886789
7372 -3886789 -1691198 -1008785 -3916459 7565888 2076910 4153821 -563732 296701
7364 296701 -6171391 296701 -2818664 -6438422 -771423 3115365 1127465 2818664
7356 2818664 1780209 8129621 -3768109 -9257086 -2343941 -890104 -6497762 771423
7348 771423 1335156 296701 -7773579 -8188961 682413 5637328 -10176861 -1216476
7340 -1216476 1928559 -1305486 -118680 -3145035 -9553788 -3649428 -7091165 -801094
7332 -801094 3204376 -890104 5993370 10799934 5637328 12016410 14627383 6141721
7324 6141721 5815349 3560418 -2521962 1483507 12669154 15903200 19522958 8515333
7316 8515333 -2699983 -593403 5399967 8218631 8070280 5904359 2818664 -2165920
7308 -2165920 178020 2195591 -6349412 -8455992 3501077 -1691198 2907674 8248301
7300 8248301 8515333 -1186806 -7803249 -10028510 -3679098 -4806564 -2699983 -5103265
7292 -5103265 -19137246 -23202057 -6942815 -5785679 -2759323 -3382397 -17683409
7285 -17683409 -13855960 -6557103 -1424167 -3441737 2878004 9672468 11630698 4480192
7277 4480192 89010 6853804 8782364 -2610973 3471407 5073595 5132935 -623073
7269 -623073 1987900 12313112 -1364826 -7892259 -12550473 -3530747 4480192 1987900
7261 1987900 -237361 4658213 -148350 7061495 10710924 2759323 59340 5399967
7253 5399967 -385711 -8752694 -15013095 -8663683 -7298856 -6230731 -385711 2284601
7245 2284601 8070280 -7031825 -1305486 -9939500 -1157135 -2610973 385711 4005470
7237 4005470 4391182 12698824 5726338 415382 4569203 4391182 2996685 -1364826
7229 -1364826 -534062 -3797779 -13114206 -13351567 -2967015 -4005470 -3026355 7180176
7221 7180176 -5488977 1068125 3085695 2343941 -267031 -1305486 -8099950 -8099950 -11007625
7212 -11007625 -11719709 -4153821 -2759323 -5756009 -12313112 207691 -9850489
7205 -9850489 -9998840 -20739434 -16437263 -2432952 -12728494 -17416378 -9494448 1839549
7197 1839549 1394497 -890104 -4124150 -5637328 3115365 12550473 296701 -11897730
7189 -11897730 -682413 -1542847 -593403 -2403282 -4480192 4272501 6883474 -919774
7181 -919774 -5132935 -4628543 -7803249 4658213 5370297 12135091 5577988 6201061
7173 6201061 1958229 -7150506 -1869219 -623073 3797779 2581303 -3056025 -6853804
7165 -6853804 29670 6319741 11482348 17713079 8960385 -1364826 -6082380 -4035140
7157 -4035140 -1216476 118680 7536218 16555943 14033980 296701 -10473562
7150 -10473562 -8545003 -1127465 -2759323 -3115365 1216476 -6824134 -3619758 5073595
7142 5073595 -326371 -4925244 2403282 385711 9939500 4450522 1572517 7150506
7134 7150506 4865904 8455992 -2047240 -593403 6586773 4569203 5488977 3056025
7126 3056025 -8248301 -2610973 -3679098 -9969170 -2788994 -1216476 1246146 -5607658
7118 -5607658 -10325212 -534062 -3441737 5518647 -4628543 -8337312 2996685
7111 2996685 -3768109 -6824134 -7506547 -1750538 -4984585 -10087851 -3412067 7803249
7103 7803249 1720868 2254931 4895574 3768109 -2610973 -2462622 504392 8129621
7095 8129621 19522958 2521962 -2937344 2343941 -3975800 -3026355 -3293386 -9969170
7087 -9969170 -12491133 8574673 10621913 11037295 2551632 -6497762 919774 2314271
7079 2314271 -2165920 -6497762 -4628543 5934030 -118680 -7862589 -7625228 -4391182
7071 -4391182 -2284601 -4005470 -5340627 -12105421 -5251616 -9642798 -5251616 -8841704
7063 -8841704 -4776894 -3590088 4480192 3679098 -267031 4717553 6794464 8693353
7055 8693353 14568043 712083 -7239516 -3768109 -6319741 -2907674 -8841704 -5577988
7047 -5577988 -1987900 -10176861 5459307 -2136250 -4865904 -7239516 -771423 860434
7039 860434 7981270 4954915 2195591 -6853804 -9405437 -5310956 2788994 -9405437
7031 -9405437 2403282 -1394497 -8188961 -1424167 -2462622 89010 4213161 2670313
7023 2670313 -3975800 -5310956 -949444 9613128 7625228 -4035140 -7031825 -5637328
7015 -5637328 -3471407 -11897730 -16051551 -3679098 -4005470 -6171391 1275816 1424167
7007 1424167 -12075751 -10295542 -5103265 -3827449 1898889 8723024 -118680 -3382397
6999 -3382397 -474722 712083 -3560418 4598873 7298856 -3501077 2462622 4569203
6991 4569203 -11660368 -5993370 -5577988 -2492292 -237361 -2996685 -8010940 -949444
6983 -949444 59340 2729653 415382 -1246146 5192276 2967015 -148350 -5251616
6975 -5251616 1305486 3412067 4272501 -3708768 -4064810 10295542 -2788994 -5785679
6967 -5785679 -3234046 -7031825 -11779049 -623073 5014255 3352726 1246146 2699983
6959 2699983 -148350 -4302171 741753 3026355 5548318 3204376 2373612 7061495
6951 7061495 -2076910 -3115365 -10354882 -9850489 -8871374 -11541688 -13559258 -19789990
6943 -19789990 -13915300 979114 -11482348 -11452677 2759323 1958229 -89010 3204376
6935 3204376 4895574 178020 -7239516 -4865904 -7298856 3174706 7892259 -830764
6927 -830764 -4569203 -5370297 -7625228 -5637328 -10770264 -1631858 11838389 13796619
6919 13796619 -59340 -1720868 -2343941 -3679098 -5577988 3382397 -267031 3916459
6911 3916459 3590088 4242831 6646113 8604343 3412067 4509862 1305486 -3085695
6903 -3085695 -13915300 -6201061 -3174706 -4213161 -5043925 1186806 -5459307 -8663683
6895 -8663683 5014255 3501077 5666998 4064810 -1157135 -4420852 -3679098 771423
6887 771423 1305486 -4747224 -7654898 -7506547 -2610973 -7298856 -5132935 -6023040 3857119
6878 3857119 3649428 5815349 1513177 -1394497 -7417537 -10236201 -3412067 -7269186
6870 -7269186 -682413 -6290071 -4302171 -6082380 -14716394 -4450522 -534062 -7002155
6862 -7002155 -415382 -3619758 2729653 5637328 4420852 3975800 12698824 1305486
6854 1305486 -682413 -2106580 -4094480 -2076910 -6260401 -3530747 2640643 3085695
6846 3085695 -7002155 -8841704 -1453837 1483507 -10829604 534062 2581303
6839 2581303 -2373612 5696668 7951600 -1097795 5310956 3857119 -979114 5132935
6831 5132935 2788994 1750538 979114 207691 -1542847 -2848334 -356041 237361
6823 237361 6379082 11868060 23291067 9227416 4687883 13143876 3085695
6816 3085695 -2462622 1869219 -5459307 -1987900 -1691198 -6349412 59340 -237361
6808 -237361 -1513177 -7832919 2462622 -3056025 6379082 -3412067 -8812034 -5607658
6800 -5607658 -4806564 -296701 1958229 7743909 148350 -148350 -1364826 -3382397
6792 -3382397 1602188 8901045 4895574 -1008785 -4806564 -6586773 3975800 2581303
6784 2581303 -5192276 -4628543 -6260401 -9731809 -7180176 -5162606 -7654898 -3145035
6776 -3145035 -1068125 1483507 -8248301 -2106580 -1602188 -3797779 5221946 445052
6768 445052 -326371 -326371 -7387867 2432952 2403282 3441737 1542847 3768109 4895574
6759 4895574 3263716 -712083 4035140 3886789 1750538 -830764 5607658 -8218631
6751 -8218631 3649428 10028510 8545003 237361 -2729653 -9346097 -4509862 -59340
6743 -59340 -2967015 -5577988 -7328527 6972485 11779049 5014255 8990055 7150506
6735 7150506 860434 -504392 267031 1898889 6764794 4569203 -3085695 1809879
6727 1809879 6527433 5043925 1542847 -7358197 -6290071 -8841704 -3857119 -1335156
6719 -1335156 -1809879 -7091165 -9405437 59340 3619758 -2284601 1780209 -1335156
6711 -1335156 2403282 6942815 -3768109 -10236201 -5785679 -3946129 -3619758 -3115365
6703 -3115365 -7180176 -8574673 -979114 10918615 6023040 -2848334 -4124150 4569203
6695 4569203 3827449 3234046 -3174706 -10176861 -2165920 -59340 5221946 8366982
6687 8366982 10443892 8366982 2254931 2314271 -4213161 -5993370 -1275816 593403
6679 593403 -7476877 1364826 8010940 6052710 -4806564 919774 5459307 3441737
6671 3441737 5281286 -6201061 2907674 -1780209 -4064810 1691198 6201061 12787834
6663 12787834 17920770 3619758 3293386 10384552 -1038455 -3323056 1483507 3590088
6655 3590088 8574673 5993370 7981270 1691198 1839549 2581303 7981270 13707609
6647 13707609 14330682 6942815 -593403 -1928559 -6616443 -5607658 -2670313 9257086
6639 9257086 5251616 979114 -860434 -15072436 -9435107 -5103265 -9731809 -6586773
6631 -6586773 -10147191 -8010940 -1928559 -1186806 2729653 2136250 -4687883 -2610973
6623 -2610973 5251616 8040610 -7180176 -5666998 1602188 3471407 1809879 3530747
6615 3530747 -1631858 -5548318 -3649428 11215316 5399967 2729653 4509862 -2017570
6607 -2017570 1216476 1157135 712083 8871374 -4687883 -1513177 -7892259 -8485662
6599 -8485662 -2076910 -1750538 -2521962 -9553788 -10562573 -5251616 -4391182 -979114
6591 -979114 326371 1483507 1839549 2788994 -1453837 -1928559 -949444 3026355 -29670
6582 -29670 3382397 -4153821 -1216476 -1424167 -12728494 -4420852 -890104 -9820819
6574 -9820819 -11215316 -8663683 9286756 4124150 5043925 2136250 -7565888 -8248301
6566 -8248301 -5370297 5934030 267031 -1572517 -2017570 2729653 2878004 118680
6558 118680 4569203 -9346097 -8901045 -14449363 -16733964 -5548318 1928559 -7002155
6550 -7002155 -1186806 14508703 3471407 -2581303 -5815349 -11957070 -1631858
6543 -1631858 -29670 -11126306 -11957070 -3649428 -9346097 -8396652 -3857119 -29670
6535 -29670 -2996685 -860434 3234046 -16496603 -6883474 -2076910 -2165920 -1394497 -4420852
6526 -4420852 -1780209 -1157135 -237361 -356041 8129621 -2878004 2967015 8129621
6518 8129621 4302171 -3916459 -7358197 -7417537 -11808719 -12105421 -1631858 -1661528 -1602188
6509 -1602188 1246146 2017570 -12965855 -10710924 8396652 7506547 7832919 -12847174
6501 -12847174 -5370297 -4776894 -4183491 -12758164 4717553 7654898 1691198 -3352726 10028510
6492 10028510 3590088 -5726338 -16140561 -6705453 -267031 -7002155 -5696668 -860434
6484 -860434 4302171 8426322 -2047240 4420852 1898889 -356041 -5607658 474722
6476 474722 1305486 2106580 -3204376 3946129 4539532 -3649428 6438422 13203216
6468 13203216 4776894 -1839549 1958229 1008785 4064810 9761479 10147191 5904359
6460 5904359 15754849 19344937 3975800 -89010 1869219 4598873 10948285 8129621
6452 8129621 -4984585 6349412 712083 -6735124 -4153821 -5251616 -7091165 -3649428
6444 -3649428 -6824134 4213161 -5221946 -7239516 6230731 1038455 -4925244 -7625228
6436 -7625228 -4806564 -4272501 1958229 7803249 -1809879 -267031 4035140 -1453837
6428 -1453837 -2640643 1008785 2521962 5637328 -10829604 -2551632 -1038455 -296701
6420 -296701 -1068125 1750538 2343941 -7506547 -2581303 -4450522 6735124 -89010
6412 -89010 -682413 2996685 -2165920 -2373612 1453837 -5666998 -10710924 1869219
6404 1869219 -3560418 -6379082 -4064810 -3501077 -919774 -10117521 1394497 4242831
6396 4242831 -2581303 -4658213 0 -5399967 -15013095 -13203216 -4302171 2373612
6388 2373612 29670 -3382397 -29670 -801094 -6171391 -4183491 4183491 1720868
6380 1720868 -7565888 -4658213 -5310956 -2076910 -9494448 -1305486 4480192 296701
6372 296701 -5014255 -7595558 2492292 -6824134 1186806 -4242831 -9405437 -830764
6364 -830764 2818664 -741753 3619758 59340 -1602188 -1305486 -3738438 -2996685
6356 -2996685 3827449 -3708768 -4984585 -12936185 -3293386 -3412067 919774 -9405437
6348 -9405437 -14746064 -3590088 563732 5429637 5014255 4153821 474722 -1246146
6340 -1246146 -29670 267031 7091165 5726338 1335156 8634013 11007625 3679098
6332 3679098 10265871 5459307 -7120836 -9049395 6675783 415382 3886789 -5785679
6324 -5785679 7862589 10592243 5904359 3412067 3471407 -4687883 4717553 4925244
6316 4925244 1631858 593403 10354882 -7358197 -5548318 -1631858 -2907674 -326371
6308 -326371 3263716 2610973 9850489 267031 5963700 -1424167 -9909830 -15487818
6300 -15487818 -16051551 -16822975 -16051551 -2017570 -9049395 -8485662 -3204376 -89010
6292 -89010 -2017570 -2136250 -7298856 -9583458 -5340627 -356041 -1097795 -2314271
6284 -2314271 -2254931 -563732 4391182 7714239 8723024 -6438422 -6527433 -1572517
6276 -1572517 6675783 -4391182 -3174706 -3560418 7951600 -919774 4005470 -682413
6268 -682413 4005470 -3056025 -652743 1720868 1246146 593403 -3857119 -8960385
6260 -8960385 -5340627 -5459307 -4865904 -5577988 1839549 -2996685 -2492292 4272501
6252 4272501 -6972485 -1928559 3768109 11749379 4094480 -3145035 5607658 3234046
6244 3234046 1186806 -5518647 -9079065 -2967015 -1809879 1038455 -979114 -2017570
6236 -2017570 1483507 3590088 4865904 7773579 5577988 2581303 1424167 -2047240
6228 -2047240 -14033980 -4153821 -2195591 2254931 -741753 4124150 -2136250 -1424167
6220 -1424167 -19997681 -15814189 -2225261 1750538 652743 7625228 1513177 2462622
6212 2462622 -1157135 5577988 1631858 -2165920 -6052710 1068125 4153821 -8099950
6204 -8099950 -148350 -4242831 2699983 5518647 7209846 6408752 2788994 9375767
6196 9375767 -89010 -2788994 7120836 11749379 2670313 -1513177 -8129621 -7743909
6188 -7743909 -8426322 -4450522 -2996685 -2403282 -7239516 -15547158 -11423007 -10592243
6180 -10592243 5103265 -3886789 3560418 5459307 326371 -7269186 -2432952 2670313
6172 2670313 2967015 -3145035 3174706 13559258 -4984585 -8752694 5103265
6165 5103265 385711 -6023040 2076910 2996685 -4806564 -1572517 -2581303 5073595
6157 5073595 -3382397 3056025 890104 593403 -1691198 -6527433 -4331841 6735124
6149 6735124 -2640643 3679098 -5548318 -3174706 4094480 2373612 4242831 -1335156
6141 -1335156 -10562573 -15369137 -6141721 -4598873 2225261 -6942815 6824134 -3916459
6133 -3916459 -9079065 0 -2047240 534062 1008785 -5103265 -16081221 -4331841
6125 -4331841 7981270 -4272501 1958229 -148350 712083 -237361 6468092 5904359
6117 5904359 7773579 11897730 -652743 -9227416 -2937344 -415382 -1513177 -4895574
6109 -4895574 -11482348 -10503233 -8930715 -2225261 -1661528 89010 8366982 -2521962
6101 -2521962 -4895574 -2254931 12135091 2314271 -6705453 -6201061 3026355 5251616
6093 5251616 8010940 14508703 3708768 -2878004 -3145035 -7269186 -7654898 -10354882
6085 -10354882 -6853804 -3916459 -5785679 -267031 1602188 6201061 1038455 -1572517
6077 -1572517 3085695 -3768109 -1572517 -1394497 -8396652 -8070280 2373612 -2136250
6069 -2136250 -1186806 5666998 5103265 -4153821 563732 -178020 -3323056 -10354882
6061 -10354882 -8871374 -12520803 -12224101 -5073595 652743 -2136250 -3441737 -4480192
6053 -4480192 -2878004 -6171391 -8871374 -10592243 -5904359 -682413 2284601 -3797779
6045 -3797779 -9257086 5874689 6201061 2314271 5429637 -1958229 -10592243 -8307642
6037 -8307642 -7625228 -6586773 2788994 -6171391 -6319741 -13381237 -19611969 -10621913
6029 -10621913 -6290071 -9286756 2848334 -178020 -8277971 -1038455 -5874689 6171391
6021 6171391 2136250 -7832919 -6646113 -8040610 -7803249 29670 16852645 11215316
6013 11215316 6853804 9731809 8871374 -2284601 -385711 -3382397 -6468092 -5310956
6005 -5310956 -2284601 -3263716 -5370297 -4539532 -2373612 -9108736 -7002155 3115365
5997 3115365 979114 1038455 -2788994 4124150 -5310956 -18069121 -12787834 -9820819
5989 -9820819 -7951600 1839549 -3085695 -6112050 -15725179 -14805404 -2699983 -1631858
5981 -1631858 -356041 534062 -1127465 -6230731 -6379082 -4984585 -7773579 -1809879
5973 -1809879 -5459307 3975800 -1542847 -6586773 1305486 -7625228 -6260401 -13648269
5965 -13648269 -8930715 -12580143 -10592243 -11007625 -9108736 -4895574 -3768109 -7684568
5957 -7684568 -8307642 -4124150 4569203 1068125 3352726 -2017570 1216476 8159291
5949 8159291 -8218631 -2343941 712083 -2818664 -5785679 -7654898 2017570 -7269186
5941 -7269186 -1483507 -9791149 -4776894 -9138406 -12609813 -9316427 -9524118 -6616443
5933 -6616443 -3026355 -4450522 -4183491 10918615 -563732 11274657 68923758
5926 68923758 218431644 373606529 190660384 88980779 47501910 28245982
5920 28245982 28602024 20798775 15072436 13054866 18187801 13648269 7476877 5904359
5912 5904359 -1157135 -860434 -741753 8366982 8812034 13054866 24359193 83847843
5904 83847843 293289433 350463812 172561592 93460972 49578820 29551469
5898 29551469 28750375 21006466 20709764 12520803 7654898 9464777 10384552 1898889
5890 1898889 -6349412 9138406 8871374 6438422 11868060 12461463 32993206 106515838
5882 106515838 333522156 302932231 141229914 77854473 41686560 26495443
5876 26495443 22935025 17683409 13648269 12313112 8545003 18573513 11185646 10087851
5868 10087851 5281286 13351567 1631858 2699983 4480192 -5666998 -4480192
5861 -4480192 4124150 -2432952 6260401 -29670 10354882 3946129 6260401 7328527
5853 7328527 9583458 -6141721 3501077 9257086 10147191 2373612 1246146 10236201
5845 10236201 -2699983 2403282 -4005470 1364826 -1750538 -563732 -1246146 1216476
5837 1216476 -5192276 -7892259 5132935 6735124 -1513177 -2284601 -4331841 3174706
5829 3174706 830764 1987900 5785679 8871374 2492292 8248301 -267031 -4539532
5821 -4539532 296701 4687883 13944970 12313112 -3619758 -2551632 1364826 5637328
5813 5637328 -1631858 -682413 7921930 2106580 3946129 4954915 830764 -59340
5805 -59340 5696668 2284601 -3590088 474722 11601028 -741753 -5548318 -9791149
5797 -9791149 -13321897 -1068125 4925244 10414222 1157135 1898889 5934030 682413
5789 682413 -979114 3679098 -2136250 -7031825 -4242831 2017570 2937344 -1275816
5781 -1275816 237361 -919774 326371 3975800 2076910 -4687883 2492292 5429637
5773 5429637 -10473562 -1987900 29670 6735124 534062 -3174706 -1898889 2165920
5765 2165920 8960385 -5785679 2492292 3946129 1720868 4836234 9019725 13618598
5757 13618598 1513177 -3738438 3234046 -2462622 1809879 -5488977 -13499918 -13766949
5749 -13766949 -6319741 682413 -2432952 -4064810 -4925244 -2581303 -29670 1869219
5741 1869219 3857119 3056025 1542847 -2195591 10325212 1364826 -3501077 -4183491
5733 -4183491 -3886789 -682413 -29670 14390022 4509862 6468092 -504392 -4717553
5725 -4717553 -3145035 4569203 -89010 4836234 1157135 9702139 -1335156 -4331841
5717 -4331841 -2907674 -2818664 -3827449 -10918615 -3797779 10117521 1513177 4569203
5709 4569203 1275816 -5103265 -1631858 1068125 -712083 -2136250 1275816 -3501077
5701 -3501077 -8841704 207691 1631858 6853804 4836234 -3145035 5518647 -1661528
5693 -1661528 11244986 -6379082 -8396652 -14449363 -6349412 -6141721 -3946129 -12283442
5685 -12283442 -4420852 2521962 8129621 11096636 8485662 1305486 1631858 -563732
5677 -563732 6557103 2848334 4480192 2818664 5043925 771423 1691198 4717553
5669 4717553 13084536 13173546 8040610 -949444 3946129 6023040 10236201 12965855
5661 12965855 7714239 7506547 2581303 -3323056 -3530747 -5726338 -13114206 2136250
5653 2136250 3619758 3026355 89010 1453837 -8099950 4183491 3174706 -3263716
5645 -3263716 445052 -6319741 -7536218 -10562573 -8812034 -3768109 -29670 -8485662
5637 -8485662 3115365 13529588 4035140 -1394497 3768109 8693353 9375767 -6557103
5629 -6557103 2106580 -1216476 5429637 -593403 -9969170 -3857119 6527433 -1394497
5621 -1394497 -6824134 -15754849 -8070280 860434 5934030 4806564 -3293386 -2373612
5613 -2373612 -1394497 -2551632 -89010 -5192276 -7091165 -1127465 -6468092 -5251616
5605 -5251616 4569203 -3026355 -2581303 5726338 -6972485 -2788994 1157135 7031825
5597 7031825 -385711 -1898889 5756009 771423 -2432952 -59340 -1869219 -1127465
5589 -1127465 -801094 11096636 11244986 3619758 1305486 7417537 2788994 6646113
5581 6646113 -1958229 -5845019 830764 -2017570 -4391182 -890104 11868060 8396652
5573 8396652 4776894 1453837 -534062 -3590088 -5221946 1898889 4450522 2017570
5565 2017570 3975800 -5162606 178020 -3768109 -949444 -9049395 -11215316 -4717553
5557 -4717553 -801094 6408752 6794464 5221946 -10770264 -6260401 -4539532 -7536218
5549 -7536218 -949444 4331841 8040610 4539532 -830764 -7239516 -5726338 -89010
5541 -89010 6438422 1958229 5637328 6497762 -2551632 -1958229 -3174706 4628543
5533 4628543 -712083 4450522 11986740 6557103 -4183491 2699983 3530747 860434
5525 860434 9939500 -3857119 -14093321 -14033980 -4361512 -7684568 -3263716 6705453
5517 6705453 17090006 10236201 10621913 12520803 3560418 -4658213 -8871374 -7981270
5509 -7981270 -3886789 -830764 4035140 -2195591 -267031 3857119 5103265 10770264
5501 10770264 9642798 2492292 8960385 12847174 3590088 -2017570 -1068125 2165920
5493 2165920 -1008785 4213161 -2907674 -6646113 -15932870 -8277971 -89010 1869219
5485 1869219 7862589 7803249 8455992 3471407 -6913144 -2462622 -1275816 -296701
5477 -296701 6408752 89010 563732 13321897 7180176 1750538 4361512 -8366982
5469 -8366982 -3234046 2818664 2373612 385711 -2106580 -1068125 -1720868 2432952
5461 2432952 3382397 3323056 -3234046 13321897 14953755 8693353 3857119 -8218631
5453 -8218631 -7565888 -1394497 -1839549 -1780209 1542847 3827449 1097795 -9405437
5445 -9405437 -7031825 -4420852 -2610973 2076910 2729653 -3619758 3886789 385711
5437 385711 -237361 4836234 2729653 -8159291 6082380 11215316 -2403282 -15814189
5429 -15814189 -6913144 -5251616 -979114 1068125 7981270 -4153821 1038455 -1661528
5421 -1661528 -326371 4242831 949444 2759323 6586773 4925244 -59340 6705453
5413 6705453 1394497 1572517 -1809879 -8159291 -5103265 -1008785 -2759323 -8307642
5405 -8307642 -4687883 -5726338 -13292227 -4747224 1127465 -563732 -13737279 -11096636
5397 -11096636 -3619758 4272501 -2788994 -10592243 -8337312 -9553788 -148350 741753
5389 741753 3857119 5162606 -207691 -801094 -4806564 2907674 11037295 -11719709
5381 -11719709 -3708768 29670 -1898889 5934030 5459307 -7921930 -2047240 -4925244
5373 -4925244 -1572517 -11897730 -8812034 -860434 -1720868 -8426322 -10058180 -15131776
5365 -15131776 -10770264 -19968010 -15695509 -7417537 -5637328 -178020 -682413 -2462622
5357 -2462622 -979114 2017570 3323056 4183491 -5607658 -13351567 -8188961 -2670313
5349 -2670313 3768109 3056025 3768109 7476877 13410907 5399967 1928559 -4064810
5341 -4064810 7358197 1750538 2284601 -4331841 -7862589 -11779049 -741753 8634013
5333 8634013 4539532 712083 11274657 2521962 -2314271 -6942815 -2076910 -356041
5325 -356041 1008785 9553788 6379082 1186806 3293386 4747224 7417537 6764794
5317 6764794 4480192 4242831 7239516 4183491 3738438 -652743 -4717553 11126306
5309 11126306 -4836234 -1246146 -12609813 -10473562 -4747224 -237361 1513177
5302 1513177 2254931 1839549 -1335156 -3323056 -5696668 -3738438 9138406 12491133
5294 12491133 5251616 1424167 -237361 3263716 5073595 15102106 -6527433
5287 -6527433 4361512 4747224 -771423 1513177 6616443 2314271 -1068125 -11749379
5279 -11749379 -9257086 -10948285 -5934030 -7921930 -11244986 -6497762 -2195591 -10087851
5271 -10087851 4064810 10532903 -593403 -5310956 8337312 -504392 -5103265
5264 -5103265 -1631858 -771423 -1275816 2996685 5192276 1335156 6972485 -2670313
5256 -2670313 -8337312 7506547 8218631 9791149 2551632 -1513177 -8871374 -9969170
5248 -9969170 -9702139 -5429637 6141721 9553788 4064810 4094480 207691 3352726
5240 3352726 -4925244 -3560418 2759323 7387867 2076910 -3471407 -4450522 -3619758
5232 -3619758 -7091165 -8188961 -3886789 3174706 -3560418 1720868 1424167 10236201
5224 10236201 4242831 771423 4124150 -8693353 -1394497 5815349 4984585 1097795
5216 1097795 2818664 -890104 890104 -12253771 -11333997 -4747224 3115365 7002155
5208 7002155 3145035 -741753 -2759323 4064810 -5162606 -10206531 -6052710 -1542847
5200 -1542847 -1038455 -7565888 -6705453 593403 7150506 3174706 7654898 11274657
5192 11274657 7298856 5310956 5548318 9435107 -4153821 -4747224 -6171391 -7358197
5184 -7358197 -5488977 1394497 -6112050 -6972485 -9346097 -7773579 -3975800 -1483507
5176 -1483507 -9049395 -5192276 7803249 2521962 -9197746 -6557103 -9998840 5815349
5168 5815349 -2699983 3916459 3797779 -5310956 3352726 1335156 8901045 3382397
5160 3382397 5666998 -652743 -4480192 -4776894 2047240 1186806 -2106580 -3827449
5152 -3827449 -949444 -712083 -2017570 -3145035 1157135 623073 -2907674 -4925244
5144 -4925244 -1127465 -10384552 -5815349 -1127465 1987900 -7031825 -5696668 3857119
5136 3857119 6972485 1809879 -1127465 -4658213 -3412067 4361512 2373612 -2699983
5128 -2699983 -2878004 -2462622 -7447207 -118680 -7892259 -8129621 -15013095 -4005470
5120 -4005470 8188961 -830764 -4806564 326371 -2136250 -8693353 -10028510 -14835075
5112 -14835075 -10532903 -2225261 -267031 -830764 -2581303 -8485662 5014255 3797779
5104 3797779 652743 -2373612 -4213161 8752694 4539532 15606498 4064810
5097 4064810 5637328 4569203 -8218631 -801094 -4005470 -2284601 -2017570 2670313
5089 2670313 -8841704 -8723024 771423 -4272501 -4687883 -237361 59340 -1097795
5081 -1097795 356041 4509862 -2136250 -9019725 -8782364 -2492292 -2254931 -4776894
5073 -4776894 919774 979114 7269186 5696668 6023040 6230731 2017570 1424167 -4005470
5064 -4005470 -5993370 -4984585 -4094480 1275816 7031825 -2314271 -9880159 -3204376
5056 -3204376 89010 -9909830 -623073 7832919 -2254931 4124150 6438422 -979114
5048 -979114 504392 -3886789 -1542847 -5488977 -1483507 3145035 415382 4302171
5040 4302171 20175702 11185646 6379082 -5637328 -445052 -1364826 -178020 1661528
5032 1661528 1809879 3679098 -1987900 -1216476 -118680 -4776894 -6883474 -2106580
5024 -2106580 2788994 4776894 4836234 -178020 4213161 6319741 7743909 2759323
5016 2759323 1127465 919774 -6497762 -860434 -5637328 -10503233 -2670313 1691198
5008 1691198 1483507 -3085695 -8485662 -3293386 1424167 1364826 -4035140 -445052
5000 -445052 5756009 4450522 -8188961 -5488977 -2907674 -385711 5904359 1394497
4992 1394497 3204376 -5429637 -563732 8812034 -949444 2788994 5637328 -13766949
4984 -13766949 -6972485 -1127465 1898889 13292227 9583458 -5726338 6230731
4977 6230731 -5548318 -2076910 1542847 -5043925 -4480192 -5281286 1958229 1661528
4969 1661528 -7506547 1691198 2284601 7120836 -652743 -4717553 -4213161 -3530747
4961 -3530747 -4450522 -3886789 -19077906 -1513177 6705453 -9405437 -5221946 -3056025
4953 -3056025 -1186806 -3115365 -8159291 -6646113 -7625228 623073 -7061495 -1987900
4945 -1987900 3115365 13292227 -1869219 -3590088 326371 6023040 -4776894
4938 -4776894 -15932870 -15309797 -15013095 -12016410 -5162606 -5666998 -8693353 -3382397
4930 -3382397 4954915 11601028 3708768 11779049 1839549 4420852 4094480 11957070
4922 11957070 1750538 5043925 6112050 10710924 4954915 -2343941 -6527433 -7328527
4914 -7328527 7714239 11096636 5310956 6735124 3857119 4984585 2017570 -7951600
4906 -7951600 -12609813 -4658213 2818664 3352726 3886789 -59340 9049395 3975800
4898 3975800 14063651 10117521 4895574 7684568 8812034 -4302171 -15250457
4891 -15250457 -14390022 -2759323 3857119 59340 3560418 1602188 -2640643 -4776894
4883 -4776894 -7981270 -3975800 -949444 -2907674 -504392 237361 6705453 7209846
4875 7209846 5281286 1305486 8010940 -2432952 2314271 -1602188 -5756009 -9435107
4867 -9435107 1335156 1750538 -801094 5132935 6972485 -1394497 -2699983 -4272501
4859 -4272501 1008785 5132935 3056025 -1631858 -6260401 -8099950 89010 10651583
4851 10651583 2581303 4717553 2017570 -385711 -4213161 2699983 5666998 7269186
4843 7269186 7387867 1691198 3323056 -5607658 -5756009 1750538 -12372452 -18603184
4835 -18603184 -10740594 -1898889 -4450522 -15428478 -9613128 -3263716 -1335156 6497762
4827 6497762 3471407 -3975800 -6675783 6972485 8485662 -1869219 -2373612 1008785
4819 1008785 830764 -5251616 5103265 14360352 10799934 2551632 7773579 15725179
4811 15725179 -1275816 -6675783 -1216476 -13143876 207691 5666998 -3115365
4804 -3115365 9761479 6201061 -1809879 10443892 534062 3382397 -2551632 6319741
4796 6319741 5014255 -2106580 -9642798 1631858 2640643 -8515333 1216476 5459307
4788 5459307 -4658213 -5904359 -4361512 -8634013 1602188 1038455 -4124150 -9613128
4780 -9613128 -9257086 -7209846 -5963700 -89010 6794464 11244986 10532903 9850489
4772 9850489 9079065 1513177 5132935 1869219 2254931 -4895574 -4895574 534062 -5815349
4763 -5815349 -2788994 1513177 6764794 6201061 -3323056 -6290071 7862589 8574673
4755 8574673 20057021 19315267 6646113 7328527 13766949 9939500 12016410 4717553
4747 4717553 1987900 5637328 9761479 6230731 9464777 6764794 4242831 207691
4739 207691 -6141721 -4272501 -5845019 -682413 6497762 3649428 -385711 -89010
4731 -89010 8574673 4658213 -3056025 -8752694 -2462622 -8782364 860434 5666998
4723 5666998 -1216476 1483507 -593403 -5043925 -29670 2047240 2492292 1958229
4715 1958229 5310956 10592243 10206531 8188961 6794464 10948285 1839549 -3738438
4707 -3738438 1216476 -1750538 -9939500 7832919 1898889 1513177 2937344 10147191
4699 10147191 -326371 -1839549 -7358197 -415382 -1216476 -2165920 741753 -6972485
4691 -6972485 -1750538 9316427 3382397 4509862 89010 -59340 5726338 13499918
4683 13499918 4480192 2165920 -2106580 -3679098 -15309797 -15784519 -3115365
4676 -3115365 741753 356041 5043925 8693353 9049395 3797779 -29670 -9197746
4668 -9197746 -7417537 -2195591 -6764794 -474722 623073 -563732 118680 -13262557
4660 -13262557 -3056025 1839549 -8248301 -13707609 -5904359 -296701 2670313
4653 2670313 -2254931 7239516 -4391182 1305486 3174706 -1483507 -10740594 -2284601
4645 -2284601 -1661528 3649428 10236201 6557103 7091165 12728494 4865904 6824134
4637 6824134 8574673 5666998 1839549 118680 -4391182 -7180176 1394497 -2581303
4629 -2581303 -5993370 -6853804 -6705453 -1958229 949444 -7002155 593403 3026355
4621 3026355 -3085695 -4064810 1424167 -9257086 -2996685 -2106580 8159291 -8752694
4613 -8752694 -4658213 -3590088 -682413 1038455 -801094 -3204376 -7358197 -9079065
4605 -9079065 -2907674 -385711 -3085695 -13292227 -8663683 -5162606 -5637328 -7862589
4597 -7862589 -10147191 -7832919 4747224 7328527 6972485 712083 -8307642 -1987900
4589 -1987900 14182331 17772419 8515333 -1809879 -3412067 -5221946 445052 7981270
4581 7981270 5577988 830764 1572517 2937344 2967015 1928559 296701 -3530747
4573 -3530747 -6201061 -7565888 -4005470 -5963700 3975800 9702139 9969170 -2640643
4565 -2640643 830764 -5488977 -14924085 -9998840 -6052710 -4064810 -12550473 -19700979
4557 -19700979 -16318582 5488977 1068125 -2403282 -3946129 2314271 -1097795 -4361512
4549 -4361512 3501077 -3026355 -5904359 3590088 89010 -4658213 5221946 10384552
4541 10384552 -1186806 2343941 2670313 1928559 -5756009 -4450522 801094 -6171391
4533 -6171391 1453837 1394497 -6616443 237361 -2551632 -3056025 9998840 6675783
4525 6675783 4776894 -5577988 -3115365 -9316427 -1542847 -9227416 -8099950 -10948285
4517 -10948285 -5281286 3382397 1661528 4242831 -4035140 -2462622 -1809879 -5043925
4509 -5043925 -3174706 1068125 3560418 -3738438 -6230731 2343941 -1572517 2996685
4501 2996685 -8248301 -5221946 -7120836 -1513177 -7773579 9613128 -771423
4494 -771423 -623073 -1335156 2254931 5103265 5904359 2788994 1928559 -237361 5548318
4485 5548318 5666998 2610973 4865904 1068125 4628543 4658213 -11749379 -26732805
4477 -26732805 -18781204 -12342782 801094 -3619758 -12876845 -9524118 890104
4470 890104 7565888 1424167 9524118 7892259 -267031 12906515 7595558 -2996685
4462 -2996685 -2254931 919774 -6349412 4391182 -1364826 -4776894 -1127465 2729653
4454 2729653 2967015 4213161 415382 385711 326371 -3234046 -11601028 3293386
4446 3293386 6586773 -2759323 -4539532 5043925 4806564 4776894 -3085695 -4213161
4438 -4213161 -7358197 -4569203 4005470 6557103 -6082380 -4272501 7239516
4431 7239516 5192276 -1008785 3293386 -2699983 -2521962 -7714239 -9138406 -2581303
4423 -2581303 5963700 -326371 11779049 7002155 2047240 8604343 8366982 -1186806
4415 -1186806 -7625228 -12164761 -1958229 -7565888 -1809879 -5726338 -1097795 7921930
4407 7921930 7447207 10770264 14953755 1839549 -385711 -2314271 2670313 -3827449
4399 -3827449 -652743 3115365 -6942815 -3560418 8307642 11838389 2670313 4598873
4391 4598873 3263716 -4806564 -1513177 2937344 -5429637 -6942815 -5251616 -9079065
4383 -9079065 -2165920 -5340627 -5399967 7565888 2165920 -5251616 -8515333 2136250
4375 2136250 4806564 8901045 9405437 3026355 7358197 860434 9019725 11541688
4367 11541688 -2017570 3441737 1157135 12016410 11363667 -3797779 2937344
4360 2937344 7002155 9761479 2136250 -3115365 -445052 5221946 7417537 1869219
4352 1869219 1068125 6319741 1038455 -1513177 4391182 -4213161 -5607658 -6646113
4344 -6646113 -6468092 1928559 -3916459 2373612 4509862 1008785 7921930 4539532
4336 4539532 6853804 -1631858 7892259 6349412 4035140 949444 8218631 4628543
4328 4628543 830764 -6468092 -8129621 -2788994 2878004 8129621 3827449 6052710
4320 6052710 3412067 5548318 1394497 -4213161 -7150506 -4865904 -6824134 -6408752
4312 -6408752 -2996685 2017570 -3886789 6735124 -2195591 -3708768 -801094 8455992
4304 8455992 5310956 -1186806 6497762 979114 -8337312 3530747 3056025 -6319741
4296 -6319741 -5488977 5132935 9820819 -445052 -207691 -3026355 -2462622 385711
4288 385711 593403 3026355 6349412 12936185 -3145035 -6023040 -5518647 -3768109
4280 -3768109 830764 -2432952 -1483507 -4450522 -10087851 267031 -2848334 3382397
4272 3382397 4094480 3916459 -830764 -7328527 -4747224 -13470248 -2343941 1898889
4264 1898889 8545003 10977955 -1038455 -13054866 -13766949 -11927400 -415382
4257 -415382 5103265 7921930 6438422 -356041 178020 -7654898 -3323056 -326371
4249 -326371 -11986740 -5043925 -3323056 3649428 -326371 -7209846 -296701 -5103265
4241 -5103265 -1691198 -6171391 3590088 -534062 3530747 1424167 949444 3471407
4233 3471407 860434 1987900 -2610973 -445052 -11393337 -1038455 -4984585 -9019725
4225 -9019725 -2967015 4717553 9642798 7150506 4569203 -4895574 -4569203 2551632
4217 2551632 2610973 -148350 1898889 8337312 10948285 8574673 3323056 -5785679
4209 -5785679 -8129621 -1809879 4213161 -2165920 -13143876 -5132935 -10562573 -7239516
4201 -7239516 -9286756 -8812034 -5132935 -830764 -712083 -2670313 -4954915 5785679
4193 5785679 3234046 8574673 2225261 5073595 -59340 -14627383 -7476877 5192276
4185 5192276 2254931 3590088 -949444 -2343941 4954915 979114 6794464 6527433
4177 6527433 7002155 8277971 9613128 5963700 -4687883 3382397 -2581303 1809879
4169 1809879 -1809879 -445052 2076910 3946129 -3560418 7150506 -7476877
4162 -7476877 -2284601 -4628543 -1542847 -7476877 -15339467 -17238357 -11482348 -4865904
4154 -4865904 -3916459 -5963700 741753 -3916459 -15131776 -15458148 -2225261 1631858
4146 1631858 -8604343 -7862589 -6349412 267031 1483507 3382397 -1839549 -6527433
4138 -6527433 -178020 -1750538 2788994 7803249 -5993370 -5518647 4391182 -2937344
4130 -2937344 -5904359 -5845019 6913144 6824134 13707609 6052710 8960385 4064810
4122 4064810 9108736 7773579 13499918 10325212 2610973 -1691198 830764 -5132935
4114 -5132935 5281286 5756009 1453837 -1691198 -4509862 -7447207 -10028510 -3857119
4106 -3857119 1424167 3590088 -1780209 -593403 -652743 5370297 1246146 -6112050
4098 -6112050 -8159291 -7595558 -1453837 207691 -11808719 -8990055 -9672468 -10681254
4090 -10681254 -5666998 -12046080 -6735124 1898889 -3619758 1958229 4213161 9909830
4082 9909830 -16941655 -9583458 -296701 -3530747 -5340627 6023040 -5103265
4075 -5103265 -5963700 -5429637 -8693353 -21421848 -13025195 -6883474 -3234046 -6824134
4067 -6824134 -8129621 -6616443 6646113 6379082 623073 9939500 7565888 3441737
4059 3441737 -4865904 -7209846 -979114 -15932870 -89010 -4984585 -8960385 -9227416
4051 -9227416 -12520803 -13559258 -4064810 1661528 -7328527 -10888945 -9316427 -10414222
4043 -10414222 1572517 9791149 -2996685 -10325212 -7091165 -2225261 -4480192
4036 -4480192 -9049395 -10443892 -12639483 4776894 -237361 -3471407 -1275816 -3382397
4028 -3382397 -2670313 7180176 1127465 3352726 2462622 178020 -5043925 5993370
4020 5993370 474722 3590088 -178020 4183491 5340627 2462622 -1898889 415382
4012 415382 178020 -5577988 -1068125 3857119 -148350 -3560418 -8070280 -8129621 4035140
4003 4035140 -3382397 -5251616 -3115365 -7209846 -7892259 -4658213 -1186806 -11897730
3995 -11897730 -3382397 3174706 -623073 2759323 474722 -4658213 -1305486 -4005470
3987 -4005470 -7803249 -1631858 -3115365 -1186806 4628543 -8426322 -4569203 -712083
3979 -712083 2195591 2907674 5192276 2047240 7654898 2076910 1097795 4628543
3971 4628543 -207691 -3293386 -949444 5340627 2047240 -3560418 -6586773 -8426322
3963 -8426322 -11571358 -5607658 -2670313 -4539532 -8159291 7595558 2106580 830764
3955 830764 -1720868 -1987900 1424167 -1157135 6735124 6586773 5281286 -4865904
3947 -4865904 3352726 1157135 7506547 10265871 2462622 16110891 13826289 8485662
3939 8485662 -5696668 -3797779 -9791149 -979114 4064810 -3619758 -6735124 -9197746
3931 -9197746 -2670313 11719709 771423 -2165920 2343941 -89010 -979114 623073
3923 623073 -6082380 -4717553 -2225261 178020 6349412 6675783 -3293386 2878004
3915 2878004 -2314271 -5637328 -2373612 -1958229 -2195591 -326371 -3352726 -9138406
3907 -9138406 -8841704 -1661528 5429637 6675783 1780209 8366982 10562573 3886789
3899 3886789 3145035 6883474 4509862 2017570 -7447207 -5548318 -6319741 -5310956
3891 -5310956 -11244986 -3649428 1068125 -12075751 4450522 4450522 6853804 12105421
3883 12105421 13470248 2403282 -2373612 4242831 -1572517 -2907674 1513177 1097795
3875 1097795 -1483507 -949444 7921930 2165920 -1720868 -10236201 -11690039 -4687883
3867 -4687883 -4539532 5310956 267031 -534062 415382 5340627 296701 5162606
3859 5162606 3204376 -5340627 -11393337 -5310956 -1335156 -4658213 0 -3590088
3851 -3590088 -2462622 -3263716 3145035 1246146 -3916459 7180176 3649428 1839549
3843 1839549 2225261 -1987900 -4183491 -2640643 -9998840 -5459307 3768109 8782364
3835 8782364 6438422 -5577988 -2165920 1839549 7091165 9731809 -6082380
3828 -6082380 6290071 5785679 4954915 -2521962 -3619758 -7832919 1424167 1038455
3820 1038455 -6230731 1839549 10977955 8129621 919774 -8871374 -2670313 1483507
3812 1483507 3886789 1483507 1809879 -148350 -2937344 741753 5132935 3708768
3804 3708768 5192276 -2729653 -2551632 -3412067 563732 3234046 2640643 178020
3796 178020 -5993370 2729653 -7180176 -1127465 -415382 5310956 -2343941 -1216476
3788 -1216476 6112050 1928559 4450522 2581303 -1809879 267031 -296701 -118680
3780 -118680 8010940 10651583 -237361 15339467 14746064 652743 -3026355 -2996685
3772 -2996685 4420852 5874689 -1068125 -415382 -2907674 -4153821 -5162606 -14122991
3764 -14122991 -3204376 -1602188 1987900 5340627 3441737 3174706 -13262557
3757 -13262557 -17119676 -7951600 -59340 4687883 2521962 1186806 652743 -1631858
3749 -1631858 7654898 385711 -7803249 -3797779 771423 -4717553 -7862589 1097795
3741 1097795 5518647 9346097 3560418 -3946129 -4242831 2878004 9257086 2017570
3733 2017570 -1038455 -5518647 -1869219 -3263716 -1453837 1097795 8040610 -6646113
3725 -6646113 -1839549 801094 8455992 -5251616 -2314271 890104 3323056 1987900
3717 1987900 -3174706 10621913 4687883 -1958229 -1364826 29670 -4925244 296701
3709 296701 -7269186 -1869219 1305486 -2106580 -1661528 3382397 -5726338 -415382
3701 -415382 1483507 -2492292 -4687883 -12372452 -8901045 -5281286 4539532 6497762
3693 6497762 -3204376 -8485662 -15013095 -13470248 -16110891 -9197746 2818664 -2907674
3685 -2907674 -7803249 10058180 -979114 -1809879 -5874689 -4272501 -7565888 -7269186
3677 -7269186 -4242831 -1246146 -5132935 -4391182 -563732 -15428478 -14033980 -9850489
3669 -9850489 -15131776 -20472403 -10147191 -7476877 -3412067 830764 10740594 12817504
3661 12817504 13618598 6171391 13559258 10295542 4569203 1127465 2314271 5726338
3653 5726338 -4361512 -4272501 4925244 -3323056 0 2254931 4094480 5043925
3645 5043925 1869219 6735124 -5459307 860434 7091165 2759323 1275816 4213161
3637 4213161 10236201 2165920 3708768 -949444 -8307642 -4035140 -3708768 1186806
3629 1186806 3649428 89010 4806564 6319741 11037295 -1424167 -4331841 -4153821
3621 -4153821 4925244 2729653 -2403282 -1157135 11393337 8693353 4005470 -3857119
3613 -3857119 -1305486 11957070 6913144 7476877 6557103 -7091165 -7536218 -12817504
3605 -12817504 -11482348 -8782364 -3441737 -1631858 1869219 890104 6112050 12075751
3597 12075751 4272501 -5014255 -11749379 -2699983 -4836234 4064810 -1275816 -4925244
3589 -4925244 -1898889 -3441737 385711 -1928559 -5577988 -3204376 -2907674 4035140
3581 4035140 5043925 5666998 -7180176 -6942815 -5993370 1602188 6408752 -1453837
3573 -1453837 -1186806 -4450522 2106580 7209846 -4984585 -13855960 -4153821 -10651583
3565 -10651583 -9939500 1809879 5904359 -1483507 -326371 5370297 5548318 2136250
3557 2136250 2403282 12372452 7743909 -1542847 1008785 6349412 7565888 5696668
3549 5696668 593403 771423 4776894 -2551632 -534062 -5993370 -3026355 -1453837
3541 -1453837 -1869219 -8396652 -4272501 -21837230 -15695509 -15458148 118680 6052710
3533 6052710 5459307 7625228 3412067 1661528 -6171391 -3501077 3204376 -9227416
3525 -9227416 -15962540 -6883474 6883474 -563732 -7743909 -8871374 6586773
3518 6586773 -2492292 -10028510 -8159291 267031 -2937344 8070280 13203216 9642798
3510 9642798 -1542847 5607658 16288912 6764794 -6527433 -504392 -3738438
3503 -3738438 -7536218 356041 -2818664 -2759323 -9464777 -13321897 -6824134 -5310956
3495 -5310956 -8545003 4776894 1097795 3590088 1691198 4183491 -3501077 1127465
3487 1127465 623073 3768109 -1068125 -16051551 -9702139 -6290071 -2581303 1275816
3479 1275816 -3145035 6853804 11096636 5429637 -5815349 -2195591 356041 3619758
3471 3619758 -2373612 -10859274 -2314271 5845019 -1780209 1157135 -4717553 -9019725
3463 -9019725 3916459 5963700 8218631 15280127 11274657 11363667 12669154 3293386
3455 3293386 -118680 59340 3056025 -1216476 -5548318 445052 2492292 9286756
3447 9286756 4035140 7951600 5993370 1216476 1453837 15932870 4331841 -5637328
3439 -5637328 -6557103 8545003 1275816 -1008785 -356041 6497762 8040610 -1335156
3431 -1335156 7565888 -10770264 -2462622 385711 -3768109 -3560418 -919774 6705453
3423 6705453 10265871 8040610 919774 3530747 1750538 3382397 -4569203 -9375767
3415 -9375767 -7417537 3026355 -3797779 -6082380 4806564 652743 -4598873 -4153821
3407 -4153821 -6201061 5429637 8307642 3263716 -860434 3263716 12520803 1928559
3399 1928559 2076910 -1780209 3501077 6586773 3234046 -6052710 -7981270 5518647
3391 5518647 10977955 15161446 10206531 6497762 3026355 -1898889 2581303 6942815
3383 6942815 3293386 -6082380 -504392 -5934030 2848334 -6527433 29670 7892259
3375 7892259 -3560418 -415382 -9880159 -8337312 -949444 -4183491 -9346097 385711
3367 385711 7862589 -3797779 -3619758 -1364826 6023040 -8634013 -5310956 1008785
3359 1008785 -7803249 3619758 -3886789 -4213161 -2967015 -3560418 4183491 6023040
3351 6023040 -3323056 -2937344 178020 4361512 10354882 4213161 -10473562 -1068125
3343 -1068125 -6942815 -59340 1928559 4480192 1572517 534062 -7684568 -3916459
3335 -3916459 8248301 -712083 4806564 2254931 267031 1780209 148350 -6705453
3327 -6705453 -8752694 4806564 3827449 7714239 9197746 1691198 385711 -2818664
3319 -2818664 -11838389 -8782364 -1898889 4331841 1246146 -8515333 -3590088 -1127465
3311 -1127465 -8752694 -8574673 -2047240 6349412 -7714239 -11749379 -6913144 -5132935
3303 -5132935 -2017570 -4153821 -11660368 445052 2403282 7180176 -6913144
3296 -6913144 -8752694 -919774 2492292 7387867 -237361 2759323 7714239 5785679
3288 5785679 12936185 17208687 5251616 -4598873 -741753 -7773579 -16110891 296701
3280 296701 5756009 7506547 1780209 801094 -8337312 1631858 -118680 1631858
3272 1631858 5963700 5459307 9672468 -1661528 -712083 -385711 -2610973 -474722
3264 -474722 11066965 5488977 -6853804 -5103265 4124150 13054866 -652743
3257 -652743 -4331841 1335156 -3382397 -9019725 -7536218 890104 7239516 -4124150
3249 -4124150 -7803249 -3768109 -1572517 -267031 2106580 -4331841 -296701 -504392
3241 -504392 3174706 8129621 6052710 2076910 -771423 -1275816 -4776894 -5014255
3233 -5014255 -7239516 -7862589 89010 0 -1513177 -2076910 -5073595 -2403282
3225 -2403282 -5845019 2284601 11482348 5073595 3115365 -4183491 1572517 -2551632
3217 -2551632 -4391182 -1958229 -6379082 652743 -10265871 -10621913 8901045 7269186
3209 7269186 5429637 4094480 -474722 -6646113 -2640643 -2996685 -267031 -2254931
3201 -2254931 4183491 -3471407 -1869219 -3352726 2848334 -1216476 -8307642 -9672468
3193 -9672468 -10354882 -8634013 -4539532 1394497 8693353 4183491 -4569203 -7832919
3185 -7832919 6230731 4865904 6230731 12906515 7803249 8545003 -652743 -118680
3177 -118680 9257086 2729653 534062 563732 3886789 -2818664 -8782364 6319741
3169 6319741 -4569203 -3382397 -6735124 1008785 7892259 7684568 5845019 -1542847
3161 -1542847 -1750538 5281286 1097795 5696668 -5251616 -8218631 1572517 -6171391
3153 -6171391 -1364826 3323056 6646113 9494448 2996685 -4331841 -5934030 -5132935
3145 -5132935 -7743909 -4480192 3857119 4391182 -3649428 -7417537 -8723024 -4391182
3137 -4391182 1127465 -5993370 3056025 4302171 4984585 1127465 5459307 3471407
3129 3471407 -890104 -1157135 2432952 771423 -682413 326371 1720868 -1958229
3121 -1958229 -4242831 -3293386 -14538373 -8515333 -8604343 4776894 148350 -6853804
3113 -6853804 -2284601 4658213 -8723024 2996685 9316427 1513177 5785679 8337312
3105 8337312 5103265 15339467 8723024 6468092 5993370 9227416 6290071 59340
3097 59340 1513177 3797779 -949444 -6794464 237361 11096636 4539532 -8901045
3089 -8901045 -4480192 237361 10710924 -326371 -6201061 -15517488 3115365
3082 3115365 -1869219 3471407 -2373612 -1335156 1839549 4450522 -741753 7684568
3074 7684568 3946129 -4124150 -5340627 1008785 4391182 3026355 -296701 -4865904
3066 -4865904 3471407 1038455 1572517 -1008785 -5221946 -5340627 -15339467 -6646113
3058 -6646113 3293386 4420852 -6260401 -4865904 -8930715 -178020 -3649428 -4628543
3050 -4628543 4450522 3857119 -5162606 -3530747 -3263716 -4124150 -2462622 3382397
3042 3382397 415382 -4687883 -474722 -385711 1335156 -4569203 -3026355 -4509862
3034 -4509862 -3263716 -9583458 -12313112 -8277971 -5934030 -4658213 -6705453 -2165920
3026 -2165920 -593403 -10681254 -7536218 -1424167 5607658 207691 -4094480 -1335156
3018 -1335156 8159291 -979114 4539532 3441737 -4420852 -9702139 -8218631 -1958229
3010 -1958229 3708768 3323056 -5696668 -6586773 1305486 1987900 2136250 -1008785
3002 -1008785 -563732 -10236201 -29670 -2967015 3708768 -5221946 979114 7002155
2994 7002155 -1216476 -6201061 -3501077 -3026355 -1097795 -16585613 -9524118 -3946129
2986 -3946129 -5696668 4687883 12669154 8426322 1335156 -534062 -8663683 1780209
2978 1780209 -10592243 652743 -3649428 -4450522 -6824134 -1542847 -9197746 1216476
2970 1216476 10532903 10414222 -1186806 2343941 6468092 -5073595 -1750538 2907674
2962 2907674 -8010940 -4895574 2373612 -1186806 -1157135 -2225261 -2670313 -3471407
2954 -3471407 -13588928 -16259242 -13915300 -4420852 1780209 5192276 12402122 6201061
2946 6201061 -7654898 -8188961 -356041 -6942815 2106580 -4539532 3234046 3560418
2938 3560418 1572517 -1987900 -5192276 -10206531 -534062 5103265 -5696668 -5815349
2930 -5815349 1542847 -1750538 -860434 18098791 9613128 8010940 3530747 5696668
2922 5696668 5577988 -2076910 -29670 -6408752 1483507 1631858 1780209 -1958229 -1572517
2913 -1572517 -7387867 3145035 6290071 1127465 8545003 4954915 3174706 -6349412
2905 -6349412 -563732 2670313 1453837 -6942815 -5488977 -3471407 148350 178020
2897 178020 -1275816 2759323 2848334 -148350 4124150 2017570 1038455 4242831
2889 4242831 -2699983 -4836234 -2462622 -8040610 -178020 -7328527 -2640643 -8604343
2881 -8604343 -6913144 -3174706 -2878004 -2907674 3145035 -3797779 1720868 3530747
2873 3530747 1839549 -1275816 1928559 -1424167 -4331841 -1216476 356041 -682413
2865 -682413 -712083 11838389 10770264 1216476 -10859274 -14953755 -8723024 385711
2857 385711 8515333 6824134 -890104 2225261 9613128 8663683 5934030 -11808719
2849 -11808719 -5014255 979114 4569203 -474722 -5251616 -5251616 -6527433 -8693353 -6112050
2840 -6112050 -3174706 -8218631 -4984585 -5815349 385711 1780209 12075751 6764794
2832 6764794 -1572517 3471407 -919774 1246146 3471407 10621913 -1780209 5963700
2824 5963700 4272501 712083 2106580 682413 -1275816 -9553788 -5637328 -6675783
2816 -6675783 682413 14360352 12758164 -593403 3768109 -59340 -8426322 -6201061
2808 -6201061 -10532903 -14301012 -8930715 -534062 2729653 -118680 -4925244 -5281286
2800 -5281286 2314271 -534062 1305486 -12253771 -4806564 -1394497 593403 1691198
2792 1691198 3946129 3649428 12283442 4776894 741753 7803249 9880159 -1661528
2784 -1661528 -2462622 2136250 17446048 13440577 10087851 -207691 -10473562
2777 -10473562 -1542847 -2818664 -801094 -3293386 -5399967 1453837 -4806564 -5666998
2769 -5666998 4183491 3263716 -6171391 -1720868 890104 2462622 2017570 -1720868
2761 -1720868 -1364826 -7803249 -7743909 -860434 178020 563732 -6853804 4628543
2753 4628543 -741753 2878004 -2878004 -6586773 3085695 3115365 3412067 -4064810
2745 -4064810 -8070280 -3115365 -207691 -593403 -1809879 -5874689 5221946 -3056025
2737 -3056025 -9850489 -6319741 -1958229 3797779 1394497 -534062 -5073595 -6557103
2729 -6557103 -6646113 -2521962 -7061495 -5518647 -8070280 -3234046 2462622 -2492292
2721 -2492292 -7803249 -13826289 -5696668 -2462622 -1008785 12164761 6171391 -3619758
2713 -3619758 -6824134 -6023040 3204376 8485662 2759323 -3560418 -7476877 7031825
2705 7031825 13529588 3590088 -771423 -5281286 -8990055 -4836234 9613128 8455992
2697 8455992 12580143 1661528 -3797779 11037295 3293386 2878004 -2610973 -2047240
2689 -2047240 6616443 4005470 -8070280 3738438 -9791149 -10532903 -5014255 1572517
2681 1572517 4925244 296701 -148350 -7476877 -3323056 3530747 919774 -8099950
2673 -8099950 -9227416 -15873530 -3827449 -5607658 7328527 7625228 8960385 5488977
2665 5488977 4539532 -1661528 4687883 3738438 -178020 -4450522 -771423 3382397
2657 3382397 4509862 10592243 4005470 -7981270 979114 -3441737 -5845019 890104
2649 890104 2967015 1453837 -3501077 -3797779 -7773579 -12906515 -2670313 -1127465
2641 -1127465 -1780209 356041 4302171 6764794 3085695 5043925 -4569203 8396652
2633 8396652 5459307 5221946 712083 1809879 1631858 11007625 3056025 -4925244
2625 -4925244 979114 385711 -4005470 -3590088 2373612 9969170 6586773 6052710
2617 6052710 -1750538 -1483507 415382 5192276 4925244 5934030 7358197 8604343
2609 8604343 13618598 49252449 257566572 497301384 138055208 59726012 34595394
2602 34595394 17683409 296701 13766949 26554784 12758164 11808719 12669154
2595 12669154 20235042 25575669 17446048 7625228 15013095 1305486 2314271 3056025
2587 3056025 830764 -2788994 3768109 1127465 -2907674 2373612 -5488977 2225261
2579 2225261 8099950 3768109 -5696668 1602188 3441737 5370297 5518647 7358197
2571 7358197 -1364826 5459307 3797779 6557103 2284601 3975800 11749379 2670313
2563 2670313 1305486 -1335156 3501077 3708768 9257086 11512018 13826289 3085695
2555 3085695 8574673 12550473 4391182 -2106580 -5399967 623073 1631858 -8782364
2547 -8782364 -4836234 -3797779 10532903 4242831 2373612 1602188 59340 -4302171
2539 -4302171 8634013 4747224 5963700 6616443 -1424167 3946129 3115365 7031825
2531 7031825 10681254 7387867 -5577988 -9316427 -12995525 -15814189 -29670
2524 -29670 2165920 -8307642 -12847174 -8901045 -7862589 -5815349 -563732 -5429637
2516 -5429637 -4747224 652743 -1720868 623073 13737279 8070280 -3382397 6052710
2508 6052710 2759323 -1661528 -5726338 -2788994 7714239 296701 2788994 7328527
2500 7328527 4124150 10325212 -1572517 2106580 -1720868 12016410 11927400 -2225261
2492 -2225261 -563732 -5370297 -6052710 -5874689 2581303 -5310956 -3560418 3530747
2484 3530747 3115365 -1157135 -712083 -4420852 801094 -3174706 5162606 -474722
2476 -474722 3174706 -2699983 -8455992 1661528 1364826 -5607658 -1898889 -6735124
2468 -6735124 -207691 4153821 3827449 -1186806 1987900 -6319741 -15428478 -6557103
2460 -6557103 2076910 -6260401 5132935 -3174706 979114 -16140561 -3263716
2453 -3263716 -890104 -6349412 -4925244 -11274657 -2640643 89010 890104 -29670
2445 -29670 -3916459 -7120836 -3619758 -237361 -267031 7061495 6023040 -4094480
2437 -4094480 -1542847 -6379082 -11541688 -8841704 -7743909 -6230731 3352726 -178020
2429 -178020 682413 1068125 1157135 -3234046 -4480192 -3352726 -8663683 -3560418 -5993370
2420 -5993370 -8693353 -9138406 1720868 3412067 -2699983 -1542847 11037295 17297697
2412 17297697 17297697 7150506 -593403 -1809879 9672468 593403 -4598873 -2937344
2404 -2937344 4984585 0 -385711 2551632 -474722 -10058180 -2195591 6883474
2396 6883474 7773579 7298856 3115365 -3293386 4539532 1780209 7239516 5488977
2388 5488977 -1602188 1008785 -890104 -8070280 -10087851 1898889 -3174706 -534062
2380 -534062 -1008785 -2759323 4776894 4153821 -5963700 -1513177 2729653 8663683
2372 8663683 3708768 6675783 13796619 5696668 -4242831 -2373612 -118680 -4420852
2364 -4420852 6824134 -3471407 -7565888 -2878004 -13737279 -11927400 -5281286
2357 -5281286 -5014255 -6586773 -445052 -771423 7209846 2314271 5874689 -919774
2349 -919774 -5815349 1809879 -3382397 2492292 5221946 8426322 1364826 -890104
2341 -890104 7061495 3352726 -1453837 1869219 0 6349412 5666998 3056025
2333 3056025 -8159291 -1483507 -4984585 -5014255 -16318582 -11927400 -2818664 -4984585
2325 -4984585 -11244986 -2017570 2165920 4509862 14360352 4480192 10058180 6230731
2317 6230731 12431792 2225261 -6913144 -2403282 5548318 4954915 6349412 -2076910
2309 -2076910 -3026355 -4331841 -13855960 -5577988 -1809879 -1424167 8455992 13826289
2301 13826289 2106580 6942815 -356041 -5548318 -2136250 -5310956 -801094 -4420852
2293 -4420852 -4450522 -7091165 5815349 979114 -1839549 -1038455 10503233 5340627
2285 5340627 6735124 2878004 -5103265 2047240 -8723024 -11927400 -3204376 -2670313
2277 -2670313 148350 6913144 2967015 -563732 1068125 -1691198 -326371 13114206
2269 13114206 12283442 7921930 1305486 14004310 -2195591 -6675783 -474722 801094
2261 801094 4658213 771423 -5785679 -10325212 -11690039 -13974640 -7714239 741753
2253 741753 -4925244 -6646113 -6616443 -148350 -563732 -4213161 -3085695 4005470
2245 4005470 7892259 1750538 237361 -4064810 6735124 4895574 7061495 8812034
2237 8812034 9702139 12995525 11986740 5192276 4598873 4569203 -10325212 -6794464
2229 -6794464 -8277971 207691 3085695 7832919 9672468 9553788 29670 -9346097
2221 -9346097 -4628543 -13766949 -8010940 -6527433 -3026355 4925244 -1453837 -5043925
2213 -5043925 -1394497 -4687883 3886789 -2076910 -3234046 2076910 -1809879 -3738438
2205 -3738438 -4331841 -4687883 -3145035 -5340627 3768109 9998840 9435107 -1305486
2197 -1305486 2907674 -4658213 -5874689 -11571358 -326371 2640643 563732 -3708768
2189 -3708768 -5310956 -14004310 -7684568 -11927400 -4420852 2521962 -919774 8337312
2181 8337312 2699983 326371 -12313112 -6942815 5993370 -3412067 830764 10918615
2173 10918615 8515333 6349412 -1750538 -5756009 -5132935 890104 -2254931 7269186
2165 7269186 13796619 9494448 15903200 9642798 -5488977 -8426322 -1513177 7150506
2157 7150506 11155976 13440577 1424167 -5251616 -3916459 -385711 -6972485 -6171391
2149 -6171391 -4331841 -10799934 -5192276 -1364826 -890104 -2788994 5281286 2403282
2141 2403282 5666998 -445052 -4242831 -14301012 -27593239 -19493288 -12965855 -6557103
2133 -6557103 -10147191 -3471407 9672468 6408752 -7654898 -6527433 1335156 1127465
2125 1127465 -4035140 -4450522 -7447207 -9197746 -19226257 -3649428 -4687883 -4747224
2117 -4747224 -2729653 -504392 504392 4153821 2017570 3708768 9286756 919774
2109 919774 13499918 2521962 3738438 2225261 3323056 8663683 979114 -9909830
2101 -9909830 890104 6497762 11541688 5132935 -2907674 2047240 4628543 -2492292
2093 -2492292 -10710924 -3174706 -5399967 -3115365 -1987900 -1364826 -504392 -979114
2085 -979114 682413 6290071 7239516 12313112 10206531 -4094480 -6764794 2907674
2077 2907674 -8218631 -3293386 -4124150 -2818664 -1364826 3204376 4450522 860434
2069 860434 6883474 2937344 -4450522 3471407 7862589 10443892 5666998 -2670313
2061 -2670313 -2195591 -118680 -7061495 -1542847 5874689 3323056 -1720868 -59340
2053 -59340 3145035 -2581303 -3857119 -1424167 -4806564 -3590088 -207691 -1127465
2045 -1127465 4480192 -2610973 -178020 6230731 2521962 -10621913 1364826
2038 1364826 3827449 -830764 -5399967 8426322 6171391 -1127465 10918615
2031 10918615 11749379 -979114 2254931 10503233 -3234046 -2492292 -207691 -1483507
2023 -1483507 -59340 -11601028 -14360352 -10562573 -10977955 -6853804 652743 -1186806
2015 -1186806 -1631858 -6082380 1928559 13321897 3916459 -4598873 -13470248 -4628543
2007 -4628543 -682413 -8871374 623073 5815349 3827449 2759323 -5874689 -1542847
1999 -1542847 6408752 7150506 -2225261 -3975800 -13499918 -5934030 4361512 3204376
1991 3204376 -2759323 -4925244 -10740594 -10888945 -9909830 -801094 -5666998 -1038455
1983 -1038455 -5488977 6735124 11838389 8693353 2521962 -118680 -29670 -1839549
1975 -1839549 2136250 -3768109 -12164761 -1928559 -445052 -4717553 -5577988 -15191116
1967 -15191116 -12224101 -8010940 -2343941 -415382 8188961 -11244986 1809879
1960 1809879 7684568 13025195 10799934 1869219 -4094480 -11541688 -1305486 -3441737
1952 -3441737 -4717553 -10236201 -10532903 -13440577 -2699983 -11749379 -4984585 -801094
1944 -801094 -445052 9791149 6527433 -5399967 -1780209 -2759323 -1987900 -3174706
1936 -3174706 -4420852 771423 -5073595 -2017570 3293386 16110891 11185646 4391182
1928 4391182 -6260401 -7476877 -8455992 -474722 29670 1483507 -4687883 4183491
1920 4183491 7862589 1898889 -8515333 -6557103 1453837 -652743 2195591 10859274
1912 10859274 4183491 -6052710 -13470248 -2284601 9435107 4895574 12431792
1905 12431792 17861430 12253771 5726338 4747224 2610973 -5429637 -11274657 -1928559
1897 -1928559 -3857119 -5340627 -3649428 890104 -4776894 -7476877 -5014255 -445052
1889 -445052 11838389 9079065 9019725 3738438 -8337312 -22638324 -12787834 -3857119
1881 -3857119 -8218631 5577988 7476877 3263716 -4954915 445052 -5488977 -267031
1873 -267031 -1839549 -3797779 -7298856 -10859274 -3975800 -10117521 1483507 3738438
1865 3738438 7951600 7091165 5815349 11482348 -1068125 -7209846 -5934030 -4124150
1857 -4124150 2492292 6230731 3797779 12164761 12402122 -1928559 -8040610 -6883474
1849 -6883474 -14122991 -10710924 -3916459 59340 -8723024 -10503233 -5518647 1631858
1841 1631858 -4272501 -7476877 -7773579 -5429637 -3382397 -2343941 -7002155 -3916459
1833 -3916459 -10325212 -4776894 6230731 5429637 1809879 -1958229 -3204376 -6616443
1825 -6616443 -6735124 -6557103 -7625228 -8871374 178020 3412067 6141721 3708768
1817 3708768 5696668 1068125 6052710 7862589 4480192 3085695 -10888945 -8812034
1809 -8812034 5162606 5548318 -1631858 -12402122 -13351567 -2314271 1513177 7298856
1801 7298856 4509862 10384552 2967015 9049395 -5607658 2284601 -7981270
1794 -7981270 9642798 10710924 -5577988 -296701 4806564 12164761 10295542 6201061
1786 6201061 1958229 3293386 7269186 16259242 17891100 12817504 12135091 7921930
1778 7921930 3174706 -9019725 -7061495 -2343941 -6112050 -12609813 -5577988 -237361
1770 -237361 1869219 -1216476 -2907674 -6349412 -10147191 -2937344 -356041 -949444
1762 -949444 -9672468 -5904359 -7387867 -5340627 -11066965 -3886789 1038455 -3204376
1754 -3204376 -919774 -3263716 1928559 1631858 -3204376 -4005470 -7209846 -4124150
1746 -4124150 -7358197 -15398807 -5993370 -10147191 5192276 2759323 -4005470 -1127465
1738 -1127465 -4064810 741753 -563732 8841704 -801094 -6705453 1898889 118680
1730 118680 -10621913 1513177 5815349 -3412067 -1364826 14864745 10473562 -5637328
1722 -5637328 -9227416 -5904359 3026355 -771423 -6586773 -267031 -3827449 -12283442
1714 -12283442 -3412067 2462622 -3649428 -5815349 -1335156 -4569203 6023040
1707 6023040 9197746 1483507 -3768109 5251616 6052710 9672468 11482348 33972321
1699 33972321 79456661 373013126 462527968 122330028 59844692 27860270
1693 27860270 9494448 8515333 11986740 9197746 -1186806 -7002155 -3886789 9049395
1685 9049395 13114206 11244986 5192276 445052 10977955 10443892 4806564 6646113
1677 6646113 3412067 2343941 2937344 -9494448 -3263716 4895574 3797779 949444
1669 949444 3649428 -237361 1691198 12461463 7892259 -2729653 -1453837 1631858
1661 1631858 8545003 -1661528 -6527433 -9672468 -9435107 -2195591 -7536218 3768109
1653 3768109 5192276 1246146 -1038455 -712083 -3056025 -14212001 -4687883 5281286
1645 5281286 3886789 3738438 534062 1869219 -6230731 -1305486 1631858 4183491
1637 4183491 -11452677 -8841704 -267031 -8930715 -3174706 -919774 -9286756 -3382397
1629 -3382397 -4302171 -7684568 -4302171 -9850489 -1839549 7328527 4806564 -3352726
1621 -3352726 -148350 2610973 -5874689 -6408752 385711 -3115365 237361 7091165
1613 7091165 -296701 1008785 7120836 -5963700 -4954915 9049395 4984585 178020
1605 178020 -504392 1720868 -5963700 -4658213 -534062 -3975800 -7209846 -8604343
1597 -8604343 296701 -2818664 -1453837 -11719709 -8574673 -9672468 -6527433 -1068125
1589 -1068125 -3530747 -4836234 237361 -4598873 12046080 4539532 5014255 -593403
1581 -593403 -3293386 3293386 2136250 1720868 -6201061 -8099950 682413 1898889
1573 1898889 -5310956 -8307642 2076910 4658213 -2670313 -1335156 -979114 4213161
1565 4213161 1809879 445052 11066965 13677939 9049395 -3174706 -8010940 -1394497
1557 -1394497 2610973 -3471407 1958229 326371 1513177 1958229 3174706 356041
1549 356041 -7862589 -3234046 1008785 2551632 -7269186 -2462622 -919774 8426322
1541 8426322 7506547 8901045 1216476 -2788994 5073595 -4806564 -2195591 -4865904
1533 -4865904 -2492292 -8545003 -2967015 1691198 534062 1661528 1038455 2254931
1525 2254931 10117521 474722 -11808719 -11185646 -12372452 -4658213 -682413 -534062
1517 -534062 -3293386 -5904359 -7832919 -11215316 -6112050 3412067 -5043925 -3293386
1509 -3293386 2373612 -4569203 -1750538 -5726338 -4836234 1631858 10562573 9761479
1501 9761479 -652743 -6972485 3679098 7536218 -3590088 1513177 10948285
1494 10948285 -9969170 -8634013 -2699983 9761479 4628543 -4331841 -7862589
1487 -7862589 -10384552 -10888945 -8663683 2373612 -296701 -6082380 -5073595 -2996685
1479 -2996685 -7654898 2403282 -89010 296701 -801094 -5014255 -3590088 5488977
1471 5488977 4183491 652743 -6764794 -7061495 -7002155 -1216476 -8455992 -2788994
1463 -2788994 -7387867 563732 -6112050 -8188961 2225261 -2729653 2581303 2047240
1455 2047240 -1602188 7684568 16466933 3590088 2670313 -3234046 -2551632 -3708768
1447 -3708768 -6023040 -7684568 -5459307 860434 5756009 -771423 8040610 3827449
1439 3827449 -1453837 -2076910 -1898889 -979114 4391182 2314271 4035140 -3115365
1431 -3115365 -504392 -9464777 -12491133 -7387867 -445052 1335156 8604343 3649428
1423 3649428 4598873 919774 -5577988 4242831 9731809 29670 2492292 8485662
1415 8485662 -2521962 -4153821 -1068125 -2284601 2432952 -7981270 -11719709 -6082380
1407 -6082380 -2195591 -6260401 1394497 2195591 -1542847 5934030 6824134 13321897
1399 13321897 7387867 7832919 6349412 -1661528 -9049395 -8218631 -7714239 -3352726
1391 -3352726 -118680 -11244986 -8159291 4124150 4509862 5103265 5340627 9286756
1383 9286756 19255927 4569203 -2640643 -5251616 -7417537 -4925244 -6349412 -14597713
1375 -14597713 -4183491 -741753 -7358197 -7209846 -5993370 -6735124 -5399967 -2432952
1367 -2432952 3441737 6705453 1869219 -8218631 -4153821 -385711 -326371 474722
1359 474722 -4954915 -9435107 -8782364 -12016410 -3946129 -5607658 2610973 -1216476
1351 -1216476 -2106580 3412067 3204376 -1453837 3619758 1750538 712083 -4598873
1343 -4598873 -4836234 534062 2818664 -2878004 -6141721 -771423 -4747224 1928559
1335 1928559 -9613128 -6023040 -4213161 -1542847 4717553 -919774 267031 -474722
1327 -474722 6438422 -3797779 -11007625 -11066965 -10176861 -7209846 -10918615 -7803249
1319 -7803249 -1216476 6646113 -4509862 -3174706 -7447207 -1275816 -326371 -2907674
1311 -2907674 4450522 8960385 5726338 5756009 -6230731 -1483507 -8782364 -4094480
1303 -4094480 -1869219 -207691 -623073 1542847 -9820819 -7387867 -10651583 -19433948
1295 -19433948 -4628543 3708768 8366982 4213161 1602188 -1542847 3056025 -2640643
1287 -2640643 -8277971 -7595558 -3708768 6853804 13232886 14182331 5340627 -2996685
$$ [...]
0 A513177          $$ checkpoint
##END=
