##TITLE= test32
##JCAMPDX= 5.0         $$ Bruker NMR JCAMP-DX V1.0
##DATA TYPE= NMR Spectrum
##DATA CLASS= XYDATA
##ORIGIN= uk
##OWNER= uk
##.OBSERVE FREQUENCY= 100.4
##.OBSERVE NUCLEUS= ^13C
##.ACQUISITION MODE= SIMULTANEOUS
##.AVERAGES= 32
##.DIGITISER RES= 16
##SPECTROMETER/DATA SYSTEM= JEOL GX 400
$$ Bruker specific parameters
$$ --------------------------
##$AQ_mod= 1 
##$AUNM= <au_zgsino>
##$BF1= 100.4 
##$BF2= 360.131842 
##$BF3= 100.13 
##$BF4= 500.13 
##$BYTORDA= 0 
##$CNST= (0..31)
1 1 1 1 1 1 1 1 1 1 1 1 1 1 1 1 1 1 1 1 1 1 1 1 1 1 1 1 1 1 1 1 
##$CPDPRG= <waltz16>
##$CPDPRGB= <waltz16>
##$CPDPRGT= <bb>
##$D= (0..31)
0 1 0 0 0 0 0 0 0 0 0 0 0 0 0 0 0 0 0 0 0 0 0 0 0 0 0 0 0 0 0 0 
##$DATE= 0 
##$DBL= (0..7)
120 120 120 120 120 120 120 120 
##$DBP= (0..7)
150 150 150 150 150 150 150 150 
##$DBP07= 0 
##$DBPNAM0= <>
##$DBPNAM1= <>
##$DBPNAM2= <>
##$DBPNAM3= <>
##$DBPNAM4= <>
##$DBPNAM5= <>
##$DBPNAM6= <>
##$DBPNAM7= <>
##$DBPOFFS= (0..7)
0 0 0 0 0 0 0 0 
##$DE= 60 
##$DECBNUC= <>
##$DECNUC= <1H>
##$DECSTAT= 4 
##$DIGTYP= 1 
##$DL= (0..7)
0 0 0 0 0 0 0 0 
##$DP= (0..7)
150 150 150 150 150 150 150 150 
##$DP07= 0 
##$DPNAME0= <>
##$DPNAME1= <>
##$DPNAME2= <>
##$DPNAME3= <>
##$DPNAME4= <>
##$DPNAME5= <>
##$DPNAME6= <>
##$DPNAME7= <>
##$DPOFFS= (0..7)
0 0 0 0 0 0 0 0 
##$DR= 16 
##$DS= 2 
##$DSLIST= <SSSSSSSSSSSSSSS>
##$DTYPA= 0 
##$EXP= <PS done>
##$F1LIST= <111111111111111>
##$F2LIST= <222222222222222>
##$F3LIST= <333333333333333>
##$FL1= 90 
##$FL2= 90 
##$FL3= 90 
##$FL4= 90 
##$FOV= 20 
##$FS= (0..7)
83 83 83 83 83 83 83 83 
##$FW= 13020.83 
##$GRDPROG= <>
##$HL1= 1 
##$HL2= 20 
##$HL3= 90 
##$HL4= 90 
##$HPPRGN= 0 
##$IN= (0..31)
0.001 0.001 0.001 0.001 0.001 0.001 0.001 0.001 0.001 0.001 0.001 0.001 
0.001 0.001 0.001 0.001 0.001 0.001 0.001 0.001 0.001 0.001 0.001 0.001 
0.001 0.001 0.001 0.001 0.001 0.001 0.001 0.001 
##$INP= (0..31)
0 0 0 0 0 0 0 0 0 0 0 0 0 0 0 0 0 0 0 0 0 0 0 0 0 0 0 0 0 0 0 0 
##$INSTRUM= <JEOL GX 400>
##$L= (0..31)
1 1 1 1 1 1 1 1 1 1 1 1 1 1 1 1 1 1 1 1 1 1 1 1 1 1 1 1 1 1 1 1 
##$LOCNUC= <2H>
##$NBL= 1 
##$NC= 0 
##$NS= 32 
##$NUCLEUS= <13C>
##$O1= 8601.908255 
##$O2= 0 
##$O3= 0 
##$O4= 0 
##$P= (0..31)
0 15 30 11 22 0 0 0 0 0 0 0 0 0 0 0 0 0 0 0 0 0 0 0 0 0 0 0 0 0 0 0 
##$PAPS= 2 
##$PARMODE= 0 
##$PHCOR= (0..31)
0 0 0 0 0 0 0 0 0 0 0 0 0 0 0 0 0 0 0 0 0 0 0 0 0 0 0 0 0 0 0 0 
##$PHP= 1 
##$PH_ref= 0 
##$POWMOD= 0 
##$PR= 1 
##$PRGAIN= 0 
##$PROBHD= <06>
##$PULPROG= <baxcotest.be>
##$PW= 0 
##$QNP= 1 
##$RD= 21 
##$RG= 256 
##$RO= 0 
##$ROUTWD1= (0..23)
0 0 0 0 0 0 0 0 0 0 0 0 0 0 0 0 0 0 0 0 1 1 0 0 
##$ROUTWD2= (0..23)
0 0 0 0 0 1 0 0 0 0 0 0 0 0 0 0 0 0 1 0 1 1 0 0 
##$S= (0..7)
83 1 83 83 83 83 83 83 
##$SEOUT= 0 
##$SFO1= 100.4 
##$SFO2= 360.133268 
##$SFO3= 360.133268 
##$SFO4= 500.13 
##$SOLVENT= <MeOH>
##$SP= 1 
##$SW= 20.82756 
##$SW_h= 10416.666667 
##$TD= 32768 
##$TE= 273.16 
##$TL= (0..7)
120 120 120 120 120 120 120 120 
##$TP= (0..7)
150 150 150 150 150 150 150 150 
##$TP07= 0 
##$TPNAME0= <gsc.3>
##$TPNAME1= <>
##$TPNAME2= <gsc.2>
##$TPNAME3= <>
##$TPNAME4= <gsc.1>
##$TPNAME5= <           jjj>
##$TPNAME6= <              >
##$TPNAME7= <gsc.5>
##$TPOFFS= (0..7)
0 0 0 0 0 0 0 0 
##$V9= 5 
##$VCLIST= <CCCCCCCCCCCCCCC>
##$VD= 0 
##$VDLIST= <depevd>
##$VPLIST= <PPPPPPPPPPPPPPP>
##$VTLIST= <vttest>
##$WBST= 256 
##$WBSW= 4 
##$XL= 0 
##$YL= 0 
##$YMAX_a= 0 
##$YMIN_a= 0 
##$ABSF1= 10 
##$ABSF2= 0 
##$ABSG= 3 
##$ABSL= 3 
##$ALPHA= 0 
##$AQORDER= 0 
##$ASSFAC= 0 
##$ASSFACI= 0 
##$ASSFACX= 0 
##$ASSWID= 0 
##$AUNMP= <proc_1d>
##$AZFE= 0.1 
##$AZFW= 0.1 
##$BCFW= 1 
##$BC_mod= 2 
##$BYTORDP= 0 
##$DATMOD= 1 
##$DC= 1.2345 
##$DFILT= <>
##$DTYPP= 0 
##$FCOR= 0.5 
##$FT_mod= 4 
##$GAMMA= 1 
##$GB= 0 
##$INTBC= 1 
##$INTSCL= 1 
##$ISEN= 128 
##$LB= 0.3 
##$LEV0= 0 
##$LPBIN= 0 
##$MAXI= 10000 
##$MC2= 0 
##$MEAN= 0 
##$ME_mod= 0 
##$MI= 0 
##$NCOEF= 0 
##$NC_proc= 0 
##$NLEV= 6 
##$NOISF1= 0 
##$NOISF2= 0 
##$NSP= 1 
##$NTH_PF= 0 
##$NTH_PI= 0 
##$NZP= 0 
##$OFFSET= 239.4273 
##$PC= 1 
##$PHC0= 103.0203 
##$PHC1= 38.4532 
##$PH_mod= 0 
##$PKNL= yes 
##$PPARMOD= 0 
##$PSCAL= 0 
##$PSIGN= 0 
##$REVERSE= no 
##$SF= 100.4 
##$SI= 16384 
##$SIGF1= 0 
##$SIGF2= 0 
##$SINO= 400 
##$SREGLST= <1H.MeOH>
##$SSB= 1 
##$STSI= 0 
##$STSR= 0 
##$SW_p= 24038.5 
##$SYMM= 0 
##$S_DEV= 0 
##$TDeff= 0 
##$TDoff= 0 
##$TI= <>
##$TILT= no 
##$TM1= 0 
##$TM2= 0 
##$TOPLEV= 0 
##$WDW= 1 
##$XDIM= 8192 
##$YMAX_p= 972201806 
##$YMIN_p= -27593530 
$$ End of Bruker specific parameters
$$ ---------------------------------
##XUNITS= HZ       
##YUNITS= ARBITRARY UNITS
##XFACTOR= 1.46728315937252 
##YFACTOR= 1
##FIRSTX= 24038.5 
##LASTX= 0 
##DELTAX= -1.46728315937252 
##MAXY= 972201806 
##MINY= -27593530 
##NPOINTS= 16384
##FIRSTY= 2259260 
##XYDATA=(X++(Y..Y))
$$ [...]
14014 b610754c56826c08504b981564A1869036C729656h053966e469194b561310F356500
14004 B38974g962366e253530E660396D975428D744800C685064d031634g49870B253896
13994 d244846a221258D941276D222092C319532F999144A5700760b75280f779802C620464
13984 b121010g409590a859440i02278f09656c361214b980260b555346f626350a487068
13974 c802188A77176E116662H437986A618368B38162i731852a5243162a5227464a0678940
13964 a686720a333988g03824d161096h063424c653186D925898d249936a1595770d963410
13954 i280508f275426C115340A791564D0652F002796D270134F715666D892328c680678
13944 c191518B206618h799038A547466B633046b664318i36820G280682G448076C06820
$$ y = [-2610754, -356826, -308504, -2981564, 11869036, 3729656, -8053966, -5469194, -2561310, 6356500, 238974, -7962366, -5253530, 5660396, 4975428, 4744800, 3685064, -4031634, -749870, 2253896, -4244846, -1221258, 4941276, 4222092, 3319532, 6999144, 15700760, -275280, -6779802, 3620464, -2121010, -7409590, -1859440, -902278, -609656, -3361214, -2980260, -2555346, -6626350, -1487068, -3802188, 177176, 5116662, 8437986, 1618368, 238162, -9731852, -15243162, -15227464, -10678940, -1686720, -1333988, -703824, -4161096, -8063424, -3653186, 4925898, -4249936, -11595770, -4963410, -9280508, -6275426, 3115340, 1791564, 40652, 6002796, 4270134, 6715666, 4892328, -3680678, -3191518, 2206618, -8799038, 1547466, 2633046, -2664318, -936820, 7280682, 7448076, 306820]
13934 C374098d07298H102134b338406e314724g073060a2754168f191220g57778B541998
13924 a2559678d131852e79496g034484i66022b648520A673352a628020a79812a0117766
13914 f527384i951556g939656a982132A0074364A4897752G854668f150118c479384d297012
13904 a1185316d003056g351716i474922a1182140e076492f5366B881242E062028C76150
13894 A708274C631762C839008H57266d71380e606374d477430D82192F207476A3070820
13884 A6996082A1377328A0260412F489790F554216D888974B625370f420380c720604h896136
13874 a0985476a3175250B174640h15122B770120E272378a266216e403008c347500B638234
13864 D568210c817232a2107732g88360B006054D848958C960462b348678a1153178b067066
$$ y = [3374098, -407298, 8102134, -2338406, -5314724, -7073060, -12754168, -6191220, -757778, 2541998, -12559678, -4131852, -579496, -7034484, -966022, -2648520, 1673352, -1628020, -179812, -10117766, -6527384, -9951556, -7939656, -1982132, 10074364, 14897752, 7854668, -6150118, -3479384, -4297012, -11185316, -4003056, -7351716, -9474922, -11182140, -5076492, -65366, 2881242, 5062028, 376150, 1708274, 3631762, 3839008, 857266, -471380, -5606374, -4477430, 482192, 6207476, 13070820, 16996082, 11377328, 10260412, 6489790, 6554216, 4888974, 2625370, -6420380, -3720604, -8896136, -10985476, -13175250, 2174640, -815122, 2770120, 5272378, -1266216, -5403008, -3347500, 2638234, 4568210, -3817232, -12107732, -788360, 2006054, 4848958, 3960462, -2348678, -11153178, -2067066]
13854 a8873872a5020324a2434362a183446F248536c699424d218966B389678A25914A769460
13844 b478248B943326g54932E019776a402992c250972B14196E922378a676816e128150
13834 i96834a0538816g702276f155632d910036e478810f756796d493026e170646A267984
13824 F647982g075962a0270450a5199458a6460490f267900c748664D180608H9480a814648
13814 a567692a722494a287050E217452C564372D189176B042642D832762B04488B359918
13804 E42428E939490A1559194C486040d339766D951104B412656c364462i844246g215266
13794 e301044c783946d138256d724508D913550A843706d748394g023268f107312h944124
13784 e068994i451464c745458i002258d918220a0797688a9543820a3103510c388604E138908
$$ y = [-18873872, -15020324, -12434362, -1183446, 6248536, -3699424, -4218966, 2389678, 125914, 1769460, -2478248, 2943326, -754932, 5019776, -1402992, -3250972, 214196, 5922378, -1676816, -5128150, -996834, -10538816, -7702276, -6155632, -4910036, -5478810, -6756796, -4493026, -5170646, 1267984, 6647982, -7075962, -10270450, -15199458, -16460490, -6267900, -3748664, 4180608, 89480, -1814648, -1567692, -1722494, -1287050, 5217452, 3564372, 4189176, 2042642, 4832762, 204488, 2359918, 542428, 5939490, 11559194, 3486040, -4339766, 4951104, 2412656, -3364462, -9844246, -7215266, -5301044, -3783946, -4138256, -4724508, 4913550, 1843706, -4748394, -7023268, -6107312, -8944124, -5068994, -9451464, -3745458, -9002258, -4918220, -10797688, -19543820, -13103510, -3388604, 5138908]
13774 A817432a1318406f512414a1305804h571394f170132B659290A7767688C973462g32802
13764 c725308g514628b057804h743932f349786D148708b995820f072380I75666e15862
13754 a121642f984302b997308d076496i135508h345718i801358d335686C395326c736566
13744 b742698a889490b267078a006392a2901202a870550D079058C324372A340034A1377666
13734 H701670I502486I52278h939512f944986A202186e502976D60944e830908h385488
13724 i323816f377982f629134b728622A3483830B243594b769850C069118I382416A3621632
13714 F200914A072232A53386D282546B971902a48924C878658f67400c242378f240524
13704 a3051656A507940A022066d046808e077966c150324c294068c569350e03214H888292
$$ y = [1817432, -11318406, -6512414, -11305804, -8571394, -6170132, 2659290, 17767688, 3973462, -732802, -3725308, -7514628, -2057804, -8743932, -6349786, 4148708, -2995820, -6072380, 975666, -515862, -1121642, -6984302, -2997308, -4076496, -9135508, -8345718, -9801358, -4335686, 3395326, -3736566, -2742698, -1889490, -2267078, -1006392, -12901202, -1870550, 4079058, 3324372, 1340034, 11377666, 8701670, 9502486, 952278, -8939512, -6944986, 1202186, -5502976, 460944, -5830908, -8385488, -9323816, -6377982, -6629134, -2728622, 13483830, 2243594, -2769850, 3069118, 9382416, 13621632, 6200914, 1072232, 153386, 4282546, 2971902, -148924, 3878658, -667400, -3242378, -6240524, -13051656, 1507940, 1022066, -4046808, -5077966, -3150324, -3294068, -3569350, -503214, 8888292]
13694 G936994A6595114A2175474A2099252E877194A867408G438522B410350A575758a701320
13684 A079396h63178b704558a658264F300012F823820B978800H884508A6861954A0873758
13674 I303238d41852D047024D95244B39038E45012f422718c412810c244254B439724C355400
13663 C97594f481886C942168D448186b670466g669502g830186E695634E338012A458286
13653 g631924a2433484f984882b316978f927120h121998a3223224g896574e527180e475710
13643 c441988f028012e533336d552376C106264a5141696c902840D404862c57482E953778
13633 C172672a279592c529060e8968E376552A3598448A3278418H960242D002134I937172
13623 C550064B058500d136260i26964c399388e118664h286616D97774G580666H308728
$$ y = [7936994, 16595114, 12175474, 12099252, 5877194, 1867408, 7438522, 2410350, 1575758, -1701320, 1079396, -863178, -2704558, -1658264, 6300012, 6823820, 2978800, 8884508, 16861954, 10873758, 9303238, -441852, 4047024, 495244, 239038, 545012, -6422718, -3412810, -3244254, 2439724, 3355400, 397594, -6481886, 3942168, 4448186, -2670466, -7669502, -7830186, 5695634, 5338012, 1458286, -7631924, -12433484, -6984882, -2316978, -6927120, -8121998, -13223224, -7896574, -5527180, -5475710, -3441988, -6028012, -5533336, -4552376, 3106264, -15141696, -3902840, 4404862, -357482, 5953778, 3172672, -1279592, -3529060, -58968, 5376552, 13598448, 13278418, 8960242, 4002134, 9937172, 3550064, 2058500, -4136260, -926964, -3399388, -5118664, -8286616, 497774, 7580666, 8308728]
13613 E713136G911868b683986a821670E190662F842672A1183530h240694a5674600g382430
13603 g10008f657752i356750a5310062i497978g23938C163582c676606h324584c560120
13593 E538712E452506B501854a285404b544170f479338c702534d913138b411142a94916
13583 A3789654A4352656A2509314D581380g01746A395584E507100d346320h836150B750178
13573 C215814E22598C48980B037772G612200A1872978I573112C552998a3411042a1589450
13563 h024070a1170220i258370c988030f03930c990034C120160D302856i57874a3876596
13553 a6404324g393472g397334i139824b949486g742806a3600292A534874I411810A675520
13543 C090246B932986C152700A74536d022598A1502808a160692d749222f399270D471168
$$ y = [5713136, 7911868, -2683986, -1821670, 5190662, 6842672, 11183530, -8240694, -15674600, -7382430, -710008, -6657752, -9356750, -15310062, -9497978, -723938, 3163582, -3676606, -8324584, -3560120, 5538712, 5452506, 2501854, -1285404, -2544170, -6479338, -3702534, -4913138, -2411142, -194916, 13789654, 14352656, 12509314, 4581380, -701746, 1395584, 5507100, -4346320, -8836150, 2750178, 3215814, 522598, 348980, 2037772, 7612200, 11872978, 9573112, 3552998, -13411042, -11589450, -8024070, -11170220, -9258370, -3988030, -603930, -3990034, 3120160, 4302856, -957874, -13876596, -16404324, -7393472, -7397334, -9139824, -2949486, -7742806, -13600292, 1534874, 9411810, 1675520, 3090246, 2932986, 3152700, 174536, -4022598, 11502808, -1160692, -4749222, -6399270, 4471168]
13533 D668924A4494998D163268e298200A444066d275026g61266B365640A278352E777398
13523 d524632d796210f774506A055820a188132a9032910a2820754b383802e073986A387692
13513 A2317852A2547160A657232D210552A6244064E859658C824582E25920f491854a442002
13503 c244822e026184a1082380g443514C117364A0671314F710252A1437830a203834h384346
13493 b036720c342886H094058b96976d358478B308840A921334F116474a056366B081616
13483 B790802a798b408422a1467360c193778A0660298d652776a8738564B27642D71004
13473 d532856d398046A0626002A0642588B457982B443136G381812d312332a2831386
13464 a5995900e81000H40504A6424392A804198F519704a35224H495456a011870B339778
$$ y = [4668924, 14494998, 4163268, -5298200, 1444066, -4275026, -761266, 2365640, 1278352, 5777398, -4524632, -4796210, -6774506, 1055820, -1188132, -19032910, -12820754, -2383802, -5073986, 1387692, 12317852, 12547160, 1657232, 4210552, 16244064, 5859658, 3824582, 525920, -6491854, -1442002, -3244822, -5026184, -11082380, -7443514, 3117364, 10671314, 6710252, 11437830, -1203834, -8384346, -2036720, -3342886, 8094058, -296976, -4358478, 2308840, 1921334, 6116474, -1056366, 2081616, 2790802, -1798, -2408422, -11467360, -3193778, 10660298, -4652776, -18738564, 227642, 471004, -4532856, -4398046, 10626002, 10642588, 2457982, 2443136, 7381812, -4312332, -12831386, -15995900, -581000, 840504, 16424392, 1804198, 6519704, -135224, 8495456, -1011870, 2339778]
13454 B15552I712932I831426E368322A05628f434496i61934A535484b600846a250386c52448
13443 d691762i031924g840000D707704E295246B872974a116612B213002g23958d76120
13433 A0874352a922720D470130A4575512D525970D359596C320088c653900a1227620F278
13423 b892250e656146B589858G974814F041078b500418D600508F853216B58502G813326
13413 B282236D318884c238860B509048G970494d29878B796120D95282a875860h854074
13403 e138292h132348g500610f949142e867100c30968h076472e267608h531862h837304
13393 a0443728b288026A0666908b35214h28206g39820c757954G161976a2798068b646076
13383 g103198b432328c880554A102332b22308f367278g065064D093512H105146b347924
$$ y = [215552, 9712932, 9831426, 5368322, 105628, -6434496, -961934, 1535484, -2600846, -1250386, -352448, -4691762, -9031924, -7840000, 4707704, 5295246, 2872974, -1116612, 2213002, -723958, -476120, 10874352, -1922720, 4470130, 14575512, 4525970, 4359596, 3320088, -3653900, -11227620, 6278, -2892250, -5656146, 2589858, 7974814, 6041078, -2500418, 4600508, 6853216, 258502, 7813326, 2282236, 4318884, -3238860, 2509048, 7970494, -429878, 2796120, 495282, -1875860, -8854074, -5138292, -8132348, -7500610, -6949142, -5867100, -330968, -8076472, -5267608, -8531862, -8837304, -10443728, -2288026, 10666908, -235214, -828206, -739820, -3757954, 7161976, -12798068, -2646076, -7103198, -2432328, -3880554, 1102332, -222308, -6367278, -7065064, 4093512, 8105146, -2347924]
13373 d620118A842346F651254i055198f274158a0540568h448496b02982B178776a194460
13363 f669590C011954a58008a644880h735058F2194F466988I159290D950114d392258
13353 e687598e685054c581300A2446136A3131346E10096B67664c320476g452026e494674
13343 e33512D083800d942204A045680c38748F49594c027486D73422f350392a780870D701354
13332 d832414A098826A281260A685012A3952170A0538626I275014d89748a0495120e511038
13322 d655138f404528a2765874a4198794e934112a642474a556318H769396F520374a458268
13312 d812796D30582E88412b306700f348970B737754I31042g764612d868602D75740
13302 A1806188C344818E600206f619296b432854C311950i801924a1549648f736568g845410
$$ y = [-4620118, 1842346, 6651254, -9055198, -6274158, -10540568, -8448496, -202982, 2178776, -1194460, -6669590, 3011954, -158008, -1644880, -8735058, 62194, 6466988, 9159290, 4950114, -4392258, -5687598, -5685054, -3581300, 12446136, 13131346, 510096, 267664, -3320476, -7452026, -5494674, -533512, 4083800, -4942204, 1045680, -338748, 649594, -3027486, 473422, -6350392, -1780870, 4701354, -4832414, 1098826, 1281260, 1685012, 13952170, 10538626, 9275014, -489748, -10495120, -5511038, -4655138, -6404528, -12765874, -14198794, -5934112, -1642474, -1556318, 8769396, 6520374, -1458268, -4812796, 430582, 588412, -2306700, -6348970, 2737754, 931042, -7764612, -4868602, 475740, 11806188, 3344818, 5600206, -6619296, -2432854, 3311950, -9801924, -11549648, -6736568, -7845410]
13292 a0120828c094314d21232A042490D452010A234252B721992E270982C699480B343684
13282 A2152352B005702A47884d694076f038136a5143648a0650592b843714A581788E663412
13272 e45082e79924e074844e03512f738774d347486I100976A0963278A6006010A8719362
13262 g12332g756816e289810B110132F279574A168254d264512c566286e804294i0948d25646
13251 d312352B517002B62518a793516B119208c823528f762420A265946c637478C751886
13241 e277668C911918e303820B192996d573704e322814C573272b661092b535076D94198
13231 f151062a014712F642422E043544a25766e282346a0106046b795388d055396a3380826
13221 i179144d255902a0222274F27074f35150a9598924f739326e093366E629976D165554
$$ y = [-10120828, -3094314, -421232, 1042490, 4452010, 1234252, 2721992, 5270982, 3699480, 2343684, 12152352, 2005702, 147884, -4694076, -6038136, -15143648, -10650592, -2843714, 1581788, 5663412, -545082, -579924, -5074844, -503512, -6738774, -4347486, 9100976, 10963278, 16006010, 18719362, -712332, -7756816, -5289810, 2110132, 6279574, 1168254, -4264512, -3566286, -5804294, -90948, -425646, -4312352, 2517002, 262518, -1793516, 2119208, -3823528, -6762420, 1265946, -3637478, 3751886, -5277668, 3911918, -5303820, 2192996, -4573704, -5322814, 3573272, -2661092, -2535076, 494198, -6151062, -1014712, 6642422, 5043544, -125766, -5282346, -10106046, -2795388, -4055396, -13380826, -9179144, -4255902, -10222274, 627074, -635150, -19598924, -6739326, -5093366, 5629976, 4165554]
13211 C459306F16454E425406F912728H54576C817404A901820D273658D381446b48020
13201 g743740b176602C504284G29206A854736E659010D923780g662276g579352A89084
13191 C711644B413754B536702H818592G084992e401678h786620h805770a0163984h482596
13181 b622606a683602b71538a656384b185828g518532D33346B947312I626654G079536
13171 D047740c57412A417940C26038g940266d809210b620590B729426D000a4880764i685664
13160 g308202C447504D498488F267714c279812f69588E194984E963842i92016I8078
13150 a0257946a5957466a018564E145100D725814a19876F703464a255814F290202H740222
13140 i66440e67510b995406G867896D667932F886578D217034G66434F154622b324684
$$ y = [3459306, 616454, 5425406, 6912728, 854576, 3817404, 1901820, 4273658, 4381446, -248020, -7743740, -2176602, 3504284, 729206, 1854736, 5659010, 4923780, -7662276, -7579352, 189084, 3711644, 2413754, 2536702, 8818592, 7084992, -5401678, -8786620, -8805770, -10163984, -8482596, -2622606, -1683602, -271538, -1656384, -2185828, -7518532, 433346, 2947312, 9626654, 7079536, 4047740, -357412, 1417940, 326038, -7940266, -4809210, -2620590, 2729426, 4000, -14880764, -9685664, -7308202, 3447504, 4498488, 6267714, -3279812, -669588, 5194984, 5963842, -992016, 98078, -10257946, -15957466, -1018564, 5145100, 4725814, -119876, 6703464, -1255814, 6290202, 8740222, -966440, -567510, -2995406, 7867896, 4667932, 6886578, 4217034, 766434, 6154622, -2324684]
13130 i704936a1597272a0614954b231518C676414F519516A227910d213966a468530g76322
13120 g669188a0583708a6905502e860694C818630C175102c135992B385526c809540I235062
13110 I756272B436694a3704376f844706c494356A0874820C775718f159166a507350A865366
13100 C21320b70118B15612G091360a326060c092022a3317060a9128326a6618856f243082
13090 d000540E636142B893890B681890D985476A852074G13250e664992b679056a220624
13080 b94338b789186d947436h934876c549998B428024A7522818B723776a235414B144602
13070 A0994504e38708H830666A0317344G55628d533278E384918E323332A4206a091666
13060 I890664A3514808H485444F828a072874a165250B267164c87180d213314d092572
$$ y = [-9704936, -11597272, -10614954, -2231518, 3676414, 6519516, 1227910, -4213966, -1468530, -776322, -7669188, -10583708, -16905502, -5860694, 3818630, 3175102, -3135992, 2385526, -3809540, 9235062, 9756272, 2436694, -13704376, -6844706, -3494356, 10874820, 3775718, -6159166, -1507350, 1865366, 321320, -270118, 215612, 7091360, -1326060, -3092022, -13317060, -19128326, -16618856, -6243082, -4000540, 5636142, 2893890, 2681890, 4985476, 1852074, 713250, -5664992, -2679056, -1220624, -294338, -2789186, -4947436, -8934876, -3549998, 2428024, 17522818, 2723776, -1235414, 2144602, 10994504, -538708, 8830666, 10317344, 755628, -4533278, 5384918, 5323332, 14206, -1091666, 9890664, 13514808, 8485444, 6828, -1072874, -1165250, 2267164, -387180, -4213314, -4092572]
13050 i579740a5577650a167862e420858h79124E218990F073286a632404C189510D292374
13040 g267304e951596h306382g345552C995278E299086B519036E044416B770658C888376
13030 g007858C35384i28154a1159752e18344a369656d518178h66130a090576B580614
13020 a254950g007050C836374E386534C358074C468902A062084g763392D557592F336796
13010 c883436h043840G385726F629068D866272I998210A4144694A7053398B301402E35164
13000 d200386g964786f924620a3146318a6005814g705642e957884h061472a054482b944566
12990 c135004i490410a6957618a7531656e065324f535866a1130540a3182462i080816
12981 g146856E033616h1000D10598A366448d244828i530966g616396a5730364g964522
$$ y = [-9579740, -15577650, -1167862, -5420858, -879124, 5218990, 6073286, -1632404, 3189510, 4292374, -7267304, -5951596, -8306382, -7345552, 3995278, 5299086, 2519036, 5044416, 2770658, 3888376, -7007858, 335384, -928154, -11159752, -518344, -1369656, -4518178, -866130, -1090576, 2580614, -1254950, -7007050, 3836374, 5386534, 3358074, 3468902, 1062084, -7763392, 4557592, 6336796, -3883436, -8043840, 7385726, 6629068, 4866272, 9998210, 14144694, 17053398, 2301402, 535164, -4200386, -7964786, -6924620, -13146318, -16005814, -7705642, -5957884, -8061472, -1054482, -2944566, -3135004, -9490410, -16957618, -17531656, -5065324, -6535866, -11130540, -13182462, -9080816, -7146856, 5033616, -81000, 410598, 1366448, -4244828, -9530966, -7616396, -15730364, -7964522]
12971 a0568746a7732784a4100698a8779476g572648c365504C001070G293972A6392504
12962 B731540D212948E313048b79302a246026a0972762d127686F252092I61984D2690G96848
12951 c082158B788522b155912A060682b93062f52252C318484g322920g319810f697910
12941 i726814c568016B063066D496928C702764E157292i24808f951312h864558b452372
12931 D347706A726820E366762E953472F014722a480410b96710B623766f842966c428038
12921 d10362A153982h628850c123852g776110a1734784a9839866a8628948a2528624
12912 a0838858i611056i097982B459540I688644D660100G229270d628808a6282008a991270
12902 B24824h640478a1109792h396294d723466f81924a286572A4032B845506F619242
$$ y = [-10568746, -17732784, -14100698, -18779476, -7572648, -3365504, 3001070, 7293972, 16392504, 2731540, 4212948, 5313048, -279302, -1246026, -10972762, -4127686, 6252092, 961984, 42690, 796848, -3082158, 2788522, -2155912, 1060682, -293062, -652252, 3318484, -7322920, -7319810, -6697910, -9726814, -3568016, 2063066, 4496928, 3702764, 5157292, -924808, -6951312, -8864558, -2452372, 4347706, 1726820, 5366762, 5953472, 6014722, -1480410, -296710, 2623766, -6842966, -3428038, -410362, 1153982, -8628850, -3123852, -7776110, -11734784, -19839866, -18628948, -12528624, -10838858, -9611056, -9097982, 2459540, 9688644, 4660100, 7229270, -4628808, -16282008, -1991270, 224824, -8640478, -11109792, -8396294, -4723466, -681924, -1286572, 14032, 2845506, 6619242]
12892 H726520D092576A91736e350750a4819460d400580B905836a100282a4999192a4163050
12882 f438910e500300d878606a1497184e516080g301442B397556A407224D755962f752346
12872 g291198a1571290a0589246A1546162H136104e32704e926618g884134g304342i64196
12862 H233900C820852A0456636A0559142b098426b015758E87314f858786a2223974b051100
12852 e882128d371258A201020A0701086d018488b764084e458236d887912D215646b594608
12842 e79418B065026e379288i710384b310760B745762c800202D573000E395412E827668
12832 C584832G922552G282380A2914284C37610F089644b709924f161702a1306474a695378
12822 H578918A2301030c10868D741692D557232H827654E372230A332378c962488i135472
$$ y = [8726520, 4092576, 191736, -5350750, -14819460, -4400580, 2905836, -1100282, -14999192, -14163050, -6438910, -5500300, -4878606, -11497184, -5516080, -7301442, 2397556, 1407224, 4755962, -6752346, -7291198, -11571290, -10589246, 11546162, 8136104, -532704, -5926618, -7884134, -7304342, -964196, 8233900, 3820852, 10456636, 10559142, -2098426, -2015758, 587314, -6858786, -12223974, -2051100, -5882128, -4371258, 1201020, 10701086, -4018488, -2764084, -5458236, -4887912, 4215646, -2594608, -579418, 2065026, -5379288, -9710384, -2310760, 2745762, -3800202, 4573000, 5395412, 5827668, 3584832, 7922552, 7282380, 12914284, 337610, 6089644, -2709924, -6161702, -11306474, -1695378, 8578918, 12301030, -310868, 4741692, 4557232, 8827654, 5372230, 1332378, -3962488, -9135472]
12812 c932752a936750C021836B603724A172888c30130C768834G69916b575860B83818
12802 G734870a239470c142952e337632i546334a971312A46252G971376A0833702D009270
12792 e04184c710998A687066b12904b236276a1109390a762330G115348B693576G576468
12782 B100538B703642A90668d146424H458580H205268F83196c122934e141282g545210
12772 d373944a1306888c789570D2032A051916c499704C499918c575022b742456G083370
12762 H34504b377832c784732A2089354A5600862b517956D649050B868452G951904B474356
12752 D108858G697466B098666a2115178g092852b223152a604584d271628a4911160g905934
12742 a891870g731610f579704c671840A0397414A2356150h53348a1519084e460046D064504
$$ y = [-3932752, -1936750, 3021836, 2603724, 1172888, -330130, 3768834, 769916, -2575860, 283818, 7734870, -1239470, -3142952, -5337632, -9546334, -1971312, 146252, 7971376, 10833702, 4009270, -504184, -3710998, 1687066, -212904, -2236276, -11109390, -1762330, 7115348, 2693576, 7576468, 2100538, 2703642, 190668, -4146424, 8458580, 8205268, 683196, -3122934, -5141282, -7545210, -4373944, -11306888, -3789570, 42032, 1051916, -3499704, 3499918, -3575022, -2742456, 7083370, 834504, -2377832, -3784732, 12089354, 15600862, -2517956, 4649050, 2868452, 7951904, 2474356, 4108858, 7697466, 2098666, -12115178, -7092852, -2223152, -1604584, -4271628, -14911160, -7905934, -1891870, -7731610, -6579704, -3671840, 10397414, 12356150, -853348, -11519084, -5460046, 4064504]
12732 c587152i737654b933202f747162a1303810f445404C437662D416174e901422a0086714
12722 h120906D165854C14500f390234a0070350a0106650g424536I070362A0093564E427910
12712 a436680e41890D165120c580522g812492b25008a772460i426308B17908g808510i53424
12701 G411192I741554c0286c026396c820302b623672C486894H314320A0386188c222672
12691 H011928F740766D070098B23262E374514B233066g589836G36528B163068B778528
12681 e902172a2686660e203446I54124G664436G522904A814044b714184g476790i502728
12671 c3304D476564A113328g1676C970000C895462C04218a024822a35196h937378d916848
12660 h719110g367416A719334F801800i95890h878350a1527582B966644c798054A777608
$$ y = [-3587152, -9737654, -2933202, -6747162, -11303810, -6445404, 3437662, 4416174, -5901422, -10086714, -8120906, 4165854, 314500, -6390234, -10070350, -10106650, -7424536, 9070362, 10093564, 5427910, -1436680, -541890, 4165120, -3580522, -7812492, -225008, -1772460, -9426308, 217908, -7808510, -953424, 7411192, 9741554, -30286, -3026396, -3820302, -2623672, 3486894, 8314320, 10386188, -3222672, 8011928, 6740766, 4070098, 223262, 5374514, 2233066, -7589836, 736528, 2163068, 2778528, -5902172, -12686660, -5203446, 954124, 7664436, 7522904, 1814044, -2714184, -7476790, -9502728, -33304, 4476564, 1113328, -71676, 3970000, 3895462, 304218, -1024822, -135196, -8937378, -4916848, -8719110, -7367416, 1719334, 6801800, -995890, -8878350, -11527582, 2966644, -3798054, 1777608]
12650 I60270h227038b77006i293104i882996i292048a1419466a3373018e041090d601196
12640 B637514B924652F771350f684580g490572i326466d176732a0224660b750114h807594
12630 g955946c522664g909752a1769994c171364D516778G012818B946180E420774a717390
12620 F591284D489756I86446D84218C876252C766168c491420d283958a0025330a1600314
12610 a3109398g470502g981034f842506i934342i60772A1598650I243954A368752D604726
12600 g01174d840432a843450h605882a0835022h260712B605316d679482c881362C57530
12590 b115440e903106b660086a1353474g677080c620622C708434G37988H92216G806742
12580 b023546e979406b547986b152798E337528F300068A3873948I830554A1283590c16530
$$ y = [960270, -8227038, -277006, -9293104, -9882996, -9292048, -11419466, -13373018, -5041090, -4601196, 2637514, 2924652, 6771350, -6684580, -7490572, -9326466, -4176732, -10224660, -2750114, -8807594, -7955946, -3522664, -7909752, -11769994, -3171364, 4516778, 7012818, 2946180, 5420774, -1717390, 6591284, 4489756, 986446, 484218, 3876252, 3766168, -3491420, -4283958, -10025330, -11600314, -13109398, -7470502, -7981034, -6842506, -9934342, -960772, 11598650, 9243954, 1368752, 4604726, -701174, -4840432, -1843450, -8605882, -10835022, -8260712, 2605316, -4679482, -3881362, 357530, -2115440, -5903106, -2660086, -11353474, -7677080, -3620622, 3708434, 737988, 892216, 7806742, -2023546, -5979406, -2547986, -2152798, 5337528, 6300068, 13873948, 9830554, 11283590, -316530]
12570 d232264F803146F165128B126410a700960d187606a2463168a1045736i492380a269246
12560 F938302c440606e397336a774994a358386e987320e478080I53528i863572D207878
12550 B735668a0257150A606580h80016B873158f281908h097860C246434B92012i180238
12540 d749928h07270c975844a5940922a8938756e215254d634952b089862f60382E51236
12530 C138994C516672A819940f602862g778004f100870i330438h236116B802242E408280
12520 c715982a4196720e716160g815292h134904a1735632H66044a243460d542464F040344
12510 B223938F60584A0115886A046686E517744D095068F841446I557080D103400D723048
12500 h598156a929456C582672A3383526G900798A2622078D752668E757076G09052a958824
$$ y = [-4232264, 6803146, 6165128, 2126410, -1700960, -4187606, -12463168, -11045736, -9492380, -1269246, 6938302, -3440606, -5397336, -1774994, -1358386, -5987320, -5478080, 953528, -9863572, 4207878, 2735668, -10257150, 1606580, -880016, 2873158, -6281908, -8097860, 3246434, 292012, -9180238, -4749928, -807270, -3975844, -15940922, -18938756, -5215254, -4634952, -2089862, -660382, 551236, 3138994, 3516672, 1819940, -6602862, -7778004, -6100870, -9330438, -8236116, 2802242, 5408280, -3715982, -14196720, -5716160, -7815292, -8134904, -11735632, 866044, -1243460, -4542464, 6040344, 2223938, 660584, 10115886, 1046686, 5517744, 4095068, 6841446, 9557080, 4103400, 4723048, -8598156, -1929456, 3582672, 13383526, 7900798, 12622078, 4752668, 5757076, 709052, -1958824]
12490 I13820e235558E132916A0056964I772272A993508e000058b809860C85818B377182
12480 i84062H595420B721792H703428C31978B29162E954136A000280B360808f841172f54932
12469 h157390c138872C600532E876656A604196E985228A1855072D783286C11866F338380
12459 i51564G2760b140646e72896F46766C54192a418060D980662C871916f317100b436708
12448 a665618h63810a158778a848798h8490G486678A4938498i636684a4672260f823440
12438 c892696a969890b055376C325778A093846e145372A80550D07778d60004i46756G807610
12427 G29590B988322G516738B423484I85348E152774A1527974c412954c319448C988752
12417 e51954C213138F344932C828978A2337152C78180C555924e074950d307114a0249902
$$ y = [913820, -5235558, 5132916, 10056964, 9772272, 1993508, -5000058, -2809860, 385818, 2377182, -984062, 8595420, 2721792, 8703428, 331978, 229162, 5954136, 1000280, 2360808, -6841172, -654932, -8157390, -3138872, 3600532, 5876656, 1604196, 5985228, 11855072, 4783286, 311866, 6338380, -951564, 72760, -2140646, -572896, 646766, 354192, -1418060, 4980662, 3871916, -6317100, -2436708, -1665618, -863810, -1158778, -1848798, -88490, 7486678, 14938498, -9636684, -14672260, -6823440, -3892696, -1969890, -2055376, 3325778, 1093846, -5145372, 180550, 407778, -460004, -946756, 7807610, 729590, 2988322, 7516738, 2423484, 985348, 5152774, 11527974, -3412954, -3319448, 3988752, -551954, 3213138, 6344932, 3828978, 12337152, 378180, 3555924, -5074950, -4307114, -10249902]
12407 a028858c638822E642670E299246B879788f5024E362576D21674B68576D959184G769780
12396 A73960C774592I273180H558918e957770f723328h891206e915384f09708d6170a650400
12385 F547856A266808c551072D491276B138604i437862b405048C94054A1143334e574840
12375 C475116D440876a903148h889048b775714a0953890b88280F694804A2078642C855292
12365 B953800A722490b709828a2513136b2506368a4016062g539208d285486e975672
12356 a0177162B142604c900458i437964d788004D593680c212234D176796D359744b373758
12346 i309808C353030D205288D330946H93800G700780a115760d360210d512456h104156
12336 A374754f217920i13040a09926e010702B351608i03492A449080b255188a878254
$$ y = [-1028858, -3638822, 5642670, 5299246, 2879788, -65024, 5362576, 421674, 268576, 4959184, 7769780, 173960, 3774592, 9273180, 8558918, -5957770, -6723328, -8891206, -5915384, -609708, -46170, -1650400, 6547856, 1266808, -3551072, 4491276, 2138604, -9437862, -2405048, 394054, 11143334, -5574840, 3475116, 4440876, -1903148, -8889048, -2775714, -10953890, -288280, 6694804, 12078642, 3855292, 2953800, 1722490, -2709828, -12513136, -22506368, -14016062, -7539208, -4285486, -5975672, -10177162, 2142604, -3900458, -9437964, -4788004, 4593680, -3212234, 4176796, 4359744, -2373758, -9309808, 3353030, 4205288, 4330946, 893800, 7700780, -1115760, -4360210, -4512456, -8104156, 1374754, -6217920, -913040, -109926, -5010702, 2351608, -903492, 1449080, -2255188, -1878254]
12326 f958718A0484300F827738I64054a0700830a0152916A756010A638674i45982f086594
12316 C386808C837574H537052E6392D222442E877094F956174H64130E14680E402986d943800
12305 d228826g092310b112074a785880f140394a3101376f788452h267292e992774c072246
12295 c075876i659168a051156c845950e889874f882934g378828a102366B671798b305058
12285 f523746h816964a878324H487896A9746G690014F196278A5787950A2347630F250836
12275 b690782b07786c082572a1984902a1944204i294270A122364d793322c475238A890466
12265 a978448C518186G35074a588040E210180e407190f261676I535258A0885790F3194
12255 e517930c40844d734670f376446g935704B953286G877532b289906A2620F63042A596368
$$ y = [-6958718, 10484300, 6827738, 964054, -10700830, -10152916, 1756010, 1638674, -945982, -6086594, 3386808, 3837574, 8537052, 56392, 4222442, 5877094, 6956174, 864130, 514680, 5402986, -4943800, -4228826, -7092310, -2112074, -1785880, -6140394, -13101376, -6788452, -8267292, -5992774, -3072246, -3075876, -9659168, -1051156, -3845950, -5889874, -6882934, -7378828, -1102366, 2671798, -2305058, -6523746, -8816964, -1878324, 8487896, 19746, 7690014, 6196278, 15787950, 12347630, 6250836, -2690782, -207786, -3082572, -11984902, -11944204, -9294270, 1122364, -4793322, -3475238, 1890466, -1978448, 3518186, 735074, -1588040, 5210180, -5407190, -6261676, 9535258, 10885790, 63194, -5517930, -340844, -4734670, -6376446, -7935704, 2953286, 7877532, -2289906, 12620, 663042, 1596368]
12244 C864854b588180D077442D008386C824954F123972a0391576a3017690h954210e491734
12234 A47924e329722f095910g952202b309428b205884d512296f247960e337806e899712
12224 b389570C615868A0320884E184592i067510A850506A1452694A2937568A1316618
12215 G527200F25744A292102G10316A2471346I129404H352942F375840a688200A398100
12205 D594954F166930G304850H889146C249724a433846F896188I736780C745618F413256
12195 a0914844a2833826a4655694i09046F855348g42652B630186c397290a3419588a532746
12185 A1695834c027658a3425908b142392c915106a924770E354348E603672E819706C671282
12175 c8670e887238G112346F636616b435910A540770d792380a2529024b800398D123976
$$ y = [3864854, -2588180, 4077442, 4008386, 3824954, 6123972, -10391576, -13017690, -8954210, -5491734, 147924, -5329722, -6095910, -7952202, -2309428, -2205884, -4512296, -6247960, -5337806, -5899712, -2389570, 3615868, 10320884, 5184592, -9067510, 1850506, 11452694, 12937568, 11316618, 7527200, 625744, 1292102, 710316, 12471346, 9129404, 8352942, 6375840, -1688200, 1398100, 4594954, 6166930, 7304850, 8889146, 3249724, -1433846, 6896188, 9736780, 3745618, 6413256, -10914844, -12833826, -14655694, -909046, 6855348, -742652, 2630186, -3397290, -13419588, -1532746, 11695834, -3027658, -13425908, -2142392, -3915106, -1924770, 5354348, 5603672, 5819706, 3671282, -38670, -5887238, 7112346, 6636616, -2435910, 1540770, -4792380, -12529024, -2800398, 4123976]
12165 b90896g522650a5325758a0887174c371184A997868B384480D964738F267666E797460
12155 E282584d964292h107276c010556g67744C243212a0193098d210320b244454a1563608
12145 a4482418i644336c058916E688712D838298B579386A0119908d038852b995820d27132
12135 c942342d059942g302398d044352c972272e145124E22182a925072c973426A3798
12125 E123654D182828D496950A2880424a087872b944508h431064d538588D248964A1671672
12115 g530896f649656f810990b811828e669974H113874E620028c030636d890184g788288
12105 d867308a1080320h924130b379090A407024c188728d861324A535976d552176a7795354
12095 a044118D928806c546418d469682f142412d943152f091152b555700i453802g87878
$$ y = [-290896, -7522650, -15325758, -10887174, -3371184, 1997868, 2384480, 4964738, 6267666, 5797460, 5282584, -4964292, -8107276, -3010556, -767744, 3243212, -10193098, -4210320, -2244454, -11563608, -14482418, -9644336, -3058916, 5688712, 4838298, 2579386, 10119908, -4038852, -2995820, -427132, -3942342, -4059942, -7302398, -4044352, -3972272, -5145124, 522182, -1925072, -3973426, 13798, 5123654, 4182828, 4496950, 12880424, -1087872, -2944508, -8431064, -4538588, 4248964, 11671672, -7530896, -6649656, -6810990, -2811828, -5669974, 8113874, 5620028, -3030636, -4890184, -7788288, -4867308, -11080320, -8924130, -2379090, 1407024, -3188728, -4861324, 1535976, -4552176, -17795354, -1044118, 4928806, -3546418, -4469682, -6142412, -4943152, -6091152, -2555700, -9453802, -787878]
12085 E507224C383360A903860D648E426784F106962C522602a740084c923984c488638
12075 b161578A651212H950618G30728F966220C134134G61740a0316634e955598d289070
12065 h924378B116710B059434E891752A1409364c845514e875846f738170a212532a924712
12055 f89932B482850A0155998F728142C447178D132100A914238f041868d610342a770338
12045 A3442832e18982a1295982H37886A697984d330784h018004i580690g555814e027320
12035 f054412d8486I63226a809734c564108a243842e085612g695358b868128a251486
12025 e130310f035376A591858D293550a082536a785196a1729118A410252b430890c62156
12015 a516082G1534b32692B0308c74736a1128324h585490a0624030C360710c407478f497912
$$ y = [5507224, 3383360, 1903860, 4648, 5426784, 6106962, 3522602, -1740084, -3923984, -3488638, -2161578, 1651212, 8950618, 730728, 6966220, 3134134, 761740, -10316634, -5955598, -4289070, -8924378, 2116710, 2059434, 5891752, 11409364, -3845514, -5875846, -6738170, -1212532, -1924712, -689932, 2482850, 10155998, 6728142, 3447178, 4132100, 1914238, -6041868, -4610342, -1770338, 13442832, -518982, -11295982, 837886, 1697984, -4330784, -8018004, -9580690, -7555814, -5027320, -6054412, -48486, 963226, -1809734, -3564108, -1243842, -5085612, -7695358, -2868128, -1251486, -5130310, -6035376, 1591858, 4293550, -1082536, -1785196, -11729118, 1410252, -2430890, -362156, -1516082, 71534, -232692, 20308, -374736, -11128324, -8585490, -10624030, 3360710, -3407478, -6497912]
12004 f87456f89290A225994A591882a235552a2076684a2868916d864410D33212C960348
11994 I27154d387276e224570d025124B085312D691232D31748A400298f697364B570760
11984 B905462a165252B071432E054070D371720g553698e232526F241540B912310g236916
11974 C09848H23100b36118e034266i168780b399206a491270I147350G977516I368688
11964 B864264e723664e838894e483316A23224I199314C463964d647606a1419830f980752
11954 i219636F005252A1386944D533820C852508A6574332B10348a27140h7498D4422E89284
11943 d872718h434210B39566A3552018b41934A454820B597506B651000e436996a5139828
11933 a7099556a2888774e460586h455006B398104h568450a5114112a7266002c810952
$$ y = [-687456, -689290, 1225994, 1591882, -1235552, -12076684, -12868916, -4864410, 433212, 3960348, 927154, -4387276, -5224570, -4025124, 2085312, 4691232, 431748, 1400298, -6697364, 2570760, 2905462, -1165252, 2071432, 5054070, 4371720, -7553698, -5232526, 6241540, 2912310, -7236916, 309848, 823100, -236118, -5034266, -9168780, -2399206, -1491270, 9147350, 7977516, 9368688, 2864264, -5723664, -5838894, -5483316, 123224, 9199314, 3463964, -4647606, -11419830, -6980752, -9219636, 6005252, 11386944, 4533820, 3852508, 16574332, 210348, -127140, -87498, 44422, 589284, -4872718, -8434210, 239566, 13552018, -241934, 1454820, 2597506, 2651000, -5436996, -15139828, -17099556, -12888774, -5460586, -8455006, 2398104, -8568450, -15114112, -17266002, -3810952]
11924 I936670A2519462C847036A587246c113124H304402b466340g82456b856548b470376
11914 d415268A656232a514290D860836D034580c782742e173452A869330g59520c155304
11904 c069642c738822e214110h104700a7134116g093804i644116e973636B80654f957414
11894 c258274a520110a705154d290100b798152B366612c898710e405640b603050f35514
11884 c373070g432266h476380B375944h323450a144026B123838a216938f507800h821654
11874 a6782062A589180A0277122A7261176C004724A282990D442924I555492a622016a978214
11864 D453026g908872g950570a5699522a1096176a0042242i291626e534978a612684b454646
11854 G706988A0788724f996224A302996d523952h10372c47276d246412d935532d575010
$$ y = [9936670, 12519462, 3847036, 1587246, -3113124, 8304402, -2466340, -782456, -2856548, -2470376, -4415268, 1656232, -1514290, 4860836, 4034580, -3782742, -5173452, 1869330, -759520, -3155304, -3069642, -3738822, -5214110, -8104700, -17134116, -7093804, -9644116, -5973636, 280654, -6957414, -3258274, -1520110, -1705154, -4290100, -2798152, 2366612, -3898710, -5405640, -2603050, -635514, -3373070, -7432266, -8476380, 2375944, -8323450, -1144026, 2123838, -1216938, -6507800, -8821654, -16782062, 1589180, 10277122, 17261176, 3004724, 1282990, 4442924, 9555492, -1622016, -1978214, 4453026, -7908872, -7950570, -15699522, -11096176, -10042242, -9291626, -5534978, -1612684, -2454646, 7706988, 10788724, -6996224, 1302996, -4523952, -810372, -347276, -4246412, -4935532, -4575010]
11844 b0666H659896F775970c649002h706066f047572H16806D674168a780038d007280
11834 h852442A878322E855310a795730i114486h790110g485570e152576b352550d162644
11824 a1050180A129868b805102B97076c462982a499508f683440h605872d973708b274148
11814 f557400F72232B885222F09128H359336c683490b847556f382260i158934b343410
11804 g853246e113214A446384d647544d820650E661854C40258F784910F344330H080160
11794 b182242B389508A2927524G204026b924840d211900e65654h064182F040730A826358
11784 D015380H35700d432904g76736b700044h60914D75318B447148i527076g123090i775550
11773 B668754B22252d172146b464802B938012A109756C689266C170556i025396c485762
$$ y = [-20666, 8659896, 6775970, -3649002, -8706066, -6047572, 816806, 4674168, -1780038, -4007280, -8852442, 1878322, 5855310, -1795730, -9114486, -8790110, -7485570, -5152576, -2352550, -4162644, -11050180, 1129868, -2805102, 297076, -3462982, -1499508, -6683440, -8605872, -4973708, -2274148, -6557400, 672232, 2885222, 609128, 8359336, -3683490, -2847556, -6382260, -9158934, -2343410, -7853246, -5113214, 1446384, -4647544, -4820650, 5661854, 340258, 6784910, 6344330, 8080160, -2182242, 2389508, 12927524, 7204026, -2924840, -4211900, -565654, -8064182, 6040730, 1826358, 4015380, 835700, -4432904, -776736, -2700044, -860914, 475318, 2447148, -9527076, -7123090, -9775550, 2668754, 222252, -4172146, -2464802, 2938012, 1109756, 3689266, 3170556, -9025396, -3485762]
11763 d040550G67268a345088A59686h738058a4278918e783458i779068d539322F80776
11753 a930334f28148E870474A1523388A834390e184960i149368g594114a826416i361028
11743 A058794A093290F849446H940856C151244d137918f337446B459404A899922C729798
11733 h552746A86046a629640e140294i698248f243626i879930b552170E128688C036834
11723 E044008A2030808G752396C327730b477254B717936D534490A042698e247280a1559412
11713 g541932h659368c827512C690858F399528A478918C141006E978580D194302f836268
11703 f135636I854342D945618h111962a4017582g583312b978868a209740d723964d661476
11693 h589228a5158362a1686560h397066g42230d664506c124786a517238d387590a2611072
$$ y = [-4040550, 767268, -1345088, 159686, -8738058, -14278918, -5783458, -9779068, -4539322, 680776, -1930334, -628148, 5870474, 11523388, 1834390, -5184960, -9149368, -7594114, -1826416, -9361028, 1058794, 1093290, 6849446, 8940856, 3151244, -4137918, -6337446, 2459404, 1899922, 3729798, -8552746, 186046, -1629640, -5140294, -9698248, -6243626, -9879930, -2552170, 5128688, 3036834, 5044008, 12030808, 7752396, 3327730, -2477254, 2717936, 4534490, 1042698, -5247280, -11559412, -7541932, -8659368, -3827512, 3690858, 6399528, 1478918, 3141006, 5978580, 4194302, -6836268, -6135636, 9854342, 4945618, -8111962, -14017582, -7583312, -2978868, -1209740, -4723964, -4661476, -8589228, -15158362, -11686560, -8397066, -742230, -4664506, -3124786, -1517238, -4387590, -12611072]
11683 a5104762a1118390e487670F57922a268106C497166D901012B783192G032278b568942
11673 e083944h818634b748626e276852a2218018c912708A21930g70972a392058A566404
11663 h519232i590588A31466b658542H97576D998644F519510F90138I457664e135934
11653 a8094488a3030362e63280A558972e244660c012490B544626D163434e199772C875130
11643 A2759428A1235850a15794a296958A065548G585842D914292a63220a1085804e559228
11633 a2493814e854552c670370D217494A584544b253990f134348c899932a061554c572920
11623 h812244f020598F607560c235218D369288G700376B323902A912214D780260h362C18354
11612 F486352a673824D65160C678124I657142G543062A1000916E907354g407198i98786
$$ y = [-15104762, -11118390, -5487670, 657922, -1268106, 3497166, 4901012, 2783192, 7032278, -2568942, -5083944, -8818634, -2748626, -5276852, -12218018, -3912708, 121930, -770972, -1392058, 1566404, -8519232, -9590588, 131466, -2658542, 897576, 4998644, 6519510, 690138, 9457664, -5135934, -18094488, -13030362, -563280, 1558972, -5244660, -3012490, 2544626, 4163434, -5199772, 3875130, 12759428, 11235850, -115794, -1296958, 1065548, 7585842, 4914292, -163220, -11085804, -5559228, -12493814, -5854552, -3670370, 4217494, 1584544, -2253990, -6134348, -3899932, -1061554, -3572920, -8812244, -6020598, 6607560, -3235218, 4369288, 7700376, 2323902, 1912214, 4780260, -8362, 318354, 6486352, -1673824, 465160, 3678124, 9657142, 7543062, 11000916, 5907354, -7407198, -998786]
11602 a0800496i053750F695060B908518B856938C780540A406260D539684d280876d877488
11592 a578000d430864c639666E561734G251956E629768e698060c787592a3048624h572514
11582 c379332a802766a531724a534102a445496b824612f446486D840498G72600e37012
11572 A408476f500330f85446d808876a0981818C036130B926342E723248F461482D820646
11562 I77994D280454C258302B948516e094866a160128H058044B196944C752352A618042
11552 A3318846F823668h22022B888994D793346A261442c297804h923616F277640a694702
11542 g085644g01190D419424b676222A182102B556402A2650480C601952e076044a44220
11532 C318978c429674c945630h011006i99866H91354i63508A021784b146718A560006
$$ y = [-10800496, -9053750, 6695060, 2908518, 2856938, 3780540, 1406260, 4539684, -4280876, -4877488, -1578000, -4430864, -3639666, 5561734, 7251956, 5629768, -5698060, -3787592, -13048624, -8572514, -3379332, -1802766, -1531724, -1534102, -1445496, -2824612, -6446486, 4840498, 772600, -537012, 1408476, -6500330, -685446, -4808876, -10981818, 3036130, 2926342, 5723248, 6461482, 4820646, 977994, 4280454, 3258302, 2948516, -5094866, -1160128, 8058044, 2196944, 3752352, 1618042, 13318846, 6823668, -822022, 2888994, 4793346, 1261442, -3297804, -8923616, 6277640, -1694702, -7085644, -701190, 4419424, -2676222, 1182102, 2556402, 12650480, 3601952, -5076044, -144220, 3318978, -3429674, -3945630, -8011006, -999866, 891354, -963508, 1021784, -2146718, 1560006]
11522 c136174C017756F733840a453368g331592D61180E271716B293170a0391542a2676324
11512 a0682506i425994f684216a3602204a033096A945382c814484c411814A986802I560890
11502 E639182a76488c436642g14886D044628b805604h073516g516168f614964g478342
11492 b651204E863736D178032E45710D242788A847236C023572A0114224A1225986B126400
11482 f132050b65366d241960a630432D127366c699166B601496A557180b657546A308350
11472 b388558b00042D370494F433292I140924h105020a9537802h661322a2108582c542290
11462 E544556E868750H156562d402390a1655602h025804c006356C728716d42772a561548
11452 B624562a078164F788658c328750A715220a508490h201082i73370g65686g334854
$$ y = [-3136174, 3017756, 6733840, -1453368, -7331592, 461180, 5271716, 2293170, -10391542, -12676324, -10682506, -9425994, -6684216, -13602204, -1033096, 1945382, -3814484, -3411814, 1986802, 9560890, 5639182, -176488, -3436642, -714886, 4044628, -2805604, -8073516, -7516168, -6614964, -7478342, -2651204, 5863736, 4178032, 545710, 4242788, 1847236, 3023572, 10114224, 11225986, 2126400, -6132050, -265366, -4241960, -1630432, 4127366, -3699166, 2601496, 1557180, -2657546, 1308350, -2388558, -200042, 4370494, 6433292, 9140924, -8105020, -19537802, -8661322, -12108582, -3542290, 5544556, 5868750, 8156562, -4402390, -11655602, -8025804, -3006356, 3728716, -442772, -1561548, 2624562, -1078164, 6788658, -3328750, 1715220, -1508490, -8201082, -973370, -765686, -7334854]
11442 d016070b208562E053210A71008D986306D283108a3640296d414840e69192a6280788
11432 e965122E500542D697342C445996c41786E995848d543008D92368c385168b103302
11422 A1317304G206600A939626d854508c585742D733808A0630088f715124f018308h257922
11412 B700700i89804b309528d26332A940286a180006h635186g996816d483610c895898
11402 a9180468a6561912i894924g188378a498408e65010D024916A0153970C76974A1265096
11392 b627190e486224F11514a321074F934758D117278a749496f394358a910564a809378
11382 D559484A2017920A2194226H850396e645946d603616c63926A294360B957420c925184
11372 a1670860a304174f94130F4814b357870f358146C801016C716184D47810e349998
$$ y = [-4016070, -2208562, 5053210, 171008, 4986306, 4283108, -13640296, -4414840, -569192, -16280788, -5965122, 5500542, 4697342, 3445996, -341786, 5995848, -4543008, 492368, -3385168, -2103302, 11317304, 7206600, 1939626, -4854508, -3585742, 4733808, 10630088, -6715124, -6018308, -8257922, 2700700, -989804, -2309528, -426332, 1940286, -1180006, -8635186, -7996816, -4483610, -3895898, -19180468, -16561912, -9894924, -7188378, -1498408, -565010, 4024916, 10153970, 376974, 11265096, -2627190, -5486224, 611514, -1321074, 6934758, 4117278, -1749496, -6394358, -1910564, -1809378, 4559484, 12017920, 12194226, 8850396, -5645946, -4603616, -363926, 1294360, 2957420, -3925184, -11670860, -1304174, -694130, 64814, -2357870, -6358146, 3801016, 3716184, 447810, -5349998]
11362 a755374C122830D023194D284148F948604b231136h191504a4791598a2756496a0453334
11352 d229340E163300F405422G859814c491500i54688A357822c563616B828372B55900
11342 b801358e32604D082560b380518A775652b706992B86146E615726D578302F967648
11332 A3360594h09072e237498a3596344a1968446d939692g330108f596362c258416B809034
11322 B575472c411766d29190I86028E894364F71446e928750g998228b409430b099366
11312 e976618H27554E106678I903422D543902B594390C995516E709562F225968i88208
11302 c209836a718544a233832d744976b421864A85234d255082A42596e243590F320044
11292 F713030A3363702C726936D251524C33734d455394D507190A0015990B084802B373718
$$ y = [-1755374, 3122830, 4023194, 4284148, 6948604, -2231136, -8191504, -14791598, -12756496, -10453334, -4229340, 5163300, 6405422, 7859814, -3491500, -954688, 1357822, -3563616, 2828372, 255900, -2801358, -532604, 4082560, -2380518, 1775652, -2706992, 286146, 5615726, 4578302, 6967648, 13360594, -809072, -5237498, -13596344, -11968446, -4939692, -7330108, -6596362, -3258416, 2809034, 2575472, -3411766, -429190, 986028, 5894364, 671446, -5928750, -7998228, -2409430, -2099366, -5976618, 827554, 5106678, 9903422, 4543902, 2594390, 3995516, 5709562, 6225968, -988208, -3209836, -1718544, -1233832, -4744976, -2421864, 185234, -4255082, 142596, -5243590, 6320044, 6713030, 13363702, 3726936, 4251524, 333734, -4455394, 4507190, 10015990, 2084802, 2373718]
11282 c105608a219306c497480A628686C025284a291730d553104e157650i162922b804068
11272 a958318g288020a5339330f525250c535790E47488a700480A885804B15934c001798
11262 b62194I945010E220756F815602G638832C944538C718118I670586D990668G309450
11252 C527118h986890d332158a483190A661174d137950d307814A256272A900344F08528
11242 g301518i683762b13150d478938a3167334a1076866d634218d84514D83644a816280
11232 C614300a54592e957020E24822b499296g066988a627538d369428c724014d668130
11222 h828886a367120A2887304A1418252G332712G36052C268624C399490B020016a847638
11212 g892518f51606E435954F020368a123140a0404722d063928C299442F223568C50662
$$ y = [-3105608, -1219306, -3497480, 1628686, 3025284, -1291730, -4553104, -5157650, -9162922, -2804068, -1958318, -7288020, -15339330, -6525250, -3535790, 547488, -1700480, 1885804, 215934, -3001798, -262194, 9945010, 5220756, 6815602, 7638832, 3944538, 3718118, 9670586, 4990668, 7309450, 3527118, -8986890, -4332158, -1483190, 1661174, -4137950, -4307814, 1256272, 1900344, 608528, -7301518, -9683762, -213150, -4478938, -13167334, -11076866, -4634218, -484514, 483644, -1816280, 3614300, -154592, -5957020, 524822, -2499296, -7066988, -1627538, -4369428, -3724014, -4668130, -8828886, -1367120, 12887304, 11418252, 7332712, 736052, 3268624, 3399490, 2020016, -1847638, -7892518, -651606, 5435954, 6020368, -1123140, -10404722, -4063928, 3299442, 6223568, 350662]
11202 B847292F900618b5008B66186A110962a1730042a2068774h753444a2730012c76358
11192 h167728a4939170a2313726c194398A897038b487880H15176b133168E325942a242704
11182 B119176b252092B759004A096790A2395200c139818a0167010b088924H216004A6791302
11172 A2650358d23468a1235434a5024960d131484e37140A410496c229750h078380a373322
11162 A1640544I624926G250574B027370E233810h332578c445562a273598F072814A827210
11152 b851842d587670c567420c076460e152364c423720b771996c718528a2519374a0827722
11142 f183878b048362d836888B65284H028024D553686e16794f659194a6401290g533620
11132 i923028c432708A650714c88526b760786C114718H024708D928478D251582h44386
$$ y = [2847292, 6900618, -25008, 266186, 1110962, -11730042, -12068774, -8753444, -12730012, -376358, -8167728, -14939170, -12313726, -3194398, 1897038, -2487880, 815176, -2133168, 5325942, -1242704, 2119176, -2252092, 2759004, 1096790, 12395200, -3139818, -10167010, -2088924, 8216004, 16791302, 12650358, -423468, -11235434, -15024960, -4131484, -537140, 1410496, -3229750, -8078380, -1373322, 11640544, 9624926, 7250574, 2027370, 5233810, -8332578, -3445562, -1273598, 6072814, 1827210, -2851842, -4587670, -3567420, -3076460, -5152364, -3423720, -2771996, -3718528, -12519374, -10827722, -6183878, -2048362, -4836888, 265284, 8028024, 4553686, -516794, -6659194, -16401290, -7533620, -9923028, -3432708, 1650714, -388526, -2760786, 3114718, 8024708, 4928478, 4251582, -844386]
11122 B547670g72178C141864i479640F297064A0784962A0371926D538664G490034e582468
11112 a913752B870408b1596e863402f408982b294376A2056440A6657000F16438B603926
11102 c498784g648660E62394f400028f774060a3663646g432522a2270504b888108a344106
11092 e30762G79338A3817628E168496C979670C901148A670062a661474f576642e655346
11082 e055564A497074C071906B10078D090954I110408F378538C671524A3714666E453398
11072 F670344I089620D534824A2774586G271782c061778d79632c224378c128246b488022
11062 c344078a694934c636824e678928c247448b554806B783712D589386d451976a0509614
11052 f94484e713864h203278e458832d86314f540170a126202g718556B723414d095966
$$ y = [2547670, -772178, 3141864, -9479640, 6297064, 10784962, 10371926, 4538664, 7490034, -5582468, -1913752, 2870408, -21596, -5863402, -6408982, -2294376, 12056440, 16657000, 616438, 2603926, -3498784, -7648660, 562394, -6400028, -6774060, -13663646, -7432522, -12270504, -2888108, -1344106, -530762, 779338, 13817628, 5168496, 3979670, 3901148, 1670062, -1661474, -6576642, -5655346, -5055564, 1497074, 3071906, 210078, 4090954, 9110408, 6378538, 3671524, 13714666, 5453398, 6670344, 9089620, 4534824, 12774586, 7271782, -3061778, -479632, -3224378, -3128246, -2488022, -3344078, -1694934, -3636824, -5678928, -3247448, -2554806, 2783712, 4589386, -4451976, -10509614, -694484, -5713864, -8203278, -5458832, -486314, -6540170, -1126202, -7718556, 2723414, -4095966]
11042 e20538E26732g97028A915352h878588d20982C970132c017342d576492I70106d546292
11031 c669092G5264H576572G221888a868780f23700A697866F396474C953154A196990d68966
11020 a478276F840820A90212D474360C671186c627624g191742i25904E135842G627078
11010 A4284396A0592248f08116a240098E591126H471418G017596E157126a6699510a7197452
11000 b546800H13538E742878B003692d9464a878364h423374f152100G331564b233068f7540
10989 B03320e656856A8489096A2053516B232478I08446E043938C745902d240488b662252
10979 b577740d691280e07580C809142B567422B896884A3533200I675232E203878E590538
10969 f474592a38300d726100a960670g704362d317482B433964I882090D754204g78742
$$ y = [-520538, 526732, -797028, 1915352, -8878588, -420982, 3970132, -3017342, -4576492, 970106, -4546292, -3669092, 75264, 8576572, 7221888, -1868780, -623700, 1697866, 6396474, 3953154, 1196990, -468966, -1478276, 6840820, 190212, 4474360, 3671186, -3627624, -7191742, -925904, 5135842, 7627078, 14284396, 10592248, -608116, -1240098, 5591126, 8471418, 7017596, 5157126, -16699510, -17197452, -2546800, 813538, 5742878, 2003692, -49464, -1878364, -8423374, -6152100, 7331564, -2233068, -67540, 203320, -5656856, 18489096, 12053516, 2232478, 908446, 5043938, 3745902, -4240488, -2662252, -2577740, -4691280, -507580, 3809142, 2567422, 2896884, 13533200, 9675232, 5203878, 5590538, -6474592, -138300, -4726100, -1960670, -7704362, -4317482, 2433964, 9882090, 4754204, -778742]
10959 F761002A5554736E794474c672118I2870F251634c705006a957666g225352e882610
10949 f934976F630522c829466g38894c184876g589784a1996764c681240A1686684C347658
10939 b92272c995528C408712E802456A388160D920404B735690C442262e165750f257310
10929 b853074b042120G66836H80362C493376d417960a0705924d873678c646670a4391226
10919 b485092E149264H931446A4475014i3850h803602h797898i431952F7520a0053642
10909 g829240a920572g172856c007854e007882E60546C18280I56888d17870c405102G105708
10898 A87650A08818f204522d878324c288560f629614b438626h974608i267486a065508
10888 D174766C785790b789542g469554a0638822a0291536c62522b025812G94894A467408
$$ y = [6761002, 15554736, 5794474, -3672118, 92870, 6251634, -3705006, -1957666, -7225352, -5882610, -6934976, 6630522, -3829466, -738894, -3184876, -7589784, -11996764, -3681240, 11686684, 3347658, -292272, -3995528, 3408712, 5802456, 1388160, 4920404, 2735690, 3442262, -5165750, -6257310, -2853074, -2042120, 766836, 880362, 3493376, -4417960, -10705924, -4873678, -3646670, -14391226, -2485092, 5149264, 8931446, 14475014, -93850, -8803602, -8797898, -9431952, 67520, -10053642, -7829240, -1920572, -7172856, -3007854, -5007882, 560546, 318280, 956888, -417870, -3405102, 7105708, 187650, 108818, -6204522, -4878324, -3288560, -6629614, -2438626, -8974608, -9267486, -1065508, 4174766, 3785790, -2789542, -7469554, -10638822, -10291536, -362522, -2025812, 794894, 1467408]
10878 f669140a1044296g627826B916172A737508E543970E166216F862508e185620a617874
10868 C527616I918980C893018B004936H993560A2709130E579744C083480a660596a0557894
10858 f009322b525856E817856A734350C608576E530130C898506B490324i16772f777660
10848 h239774h212170a6431056i059306f846924f560366C811794a441214g608826D395638
10838 G90714a935848a124102C32168a912172b926552A398766c013962f877132f426884
10828 c715104H22394A534908e3712G600882D749850F795610C579766d776302A790318
10818 B887680d988228c975588E25928e773746c275298g545408a6062794e116748b085280
10808 f164540g737670d821828C674718C003366B555958F681336H015858I02424g39210
$$ y = [-6669140, -11044296, -7627826, 2916172, 1737508, 5543970, 5166216, 6862508, -5185620, -1617874, 3527616, 9918980, 3893018, 2004936, 8993560, 12709130, 5579744, 3083480, -1660596, -10557894, -6009322, -2525856, 5817856, 1734350, 3608576, 5530130, 3898506, 2490324, -916772, -6777660, -8239774, -8212170, -16431056, -9059306, -6846924, -6560366, 3811794, -1441214, -7608826, 4395638, 790714, -1935848, -1124102, 332168, -1912172, -2926552, 1398766, -3013962, -6877132, -6426884, -3715104, 822394, 1534908, -53712, 7600882, 4749850, 6795610, 3579766, -4776302, 1790318, 2887680, -4988228, -3975588, 525928, -5773746, -3275298, -7545408, -16062794, -5116748, -2085280, -6164540, -7737670, -4821828, 3674718, 3003366, 2555958, 6681336, 8015858, 902424, -739210]
10798 d594082a631412C660190d377930A298948b50724D916278A3369776C840376f913980
10788 H89494a606772a833638d668812a0872792A189928C891766E504786A678260e697332
10778 d639460a0885294a1052996f327180a686066F688384d155864e738844g879346B578296
10768 A38962D080448b519124A385496C121826C776220B452702D196558A488072e560538
10758 c92684b250622b538692a015452d468498b08912A1116620A3482826G985910A3429130
10748 A2386950f267248e424770g465042i19276c218026a480526C735972B345612H067242
10738 A2376284d747578B349426B353740h314310C747866A2134030I314840a851302f569472
10728 A573088h557730f826052f70460e289236a417674c196374F956484A2369018C573750
$$ y = [-4594082, -1631412, 3660190, -4377930, 1298948, -250724, 4916278, 13369776, 3840376, -6913980, 889494, -1606772, -1833638, -4668812, -10872792, 1189928, 3891766, 5504786, 1678260, -5697332, -4639460, -10885294, -11052996, -6327180, -1686066, 6688384, -4155864, -5738844, -7879346, 2578296, 138962, 4080448, -2519124, 1385496, 3121826, 3776220, 2452702, 4196558, 1488072, -5560538, -392684, -2250622, -2538692, -1015452, -4468498, -208912, 11116620, 13482826, 7985910, 13429130, 12386950, -6267248, -5424770, -7465042, -919276, -3218026, -1480526, 3735972, 2345612, 8067242, 12376284, -4747578, 2349426, 2353740, -8314310, 3747866, 12134030, 9314840, -1851302, -6569472, 1573088, -8557730, -6826052, -670460, -5289236, -1417674, -3196374, 6956484, 12369018, 3573750]
10718 A115292c144692H16060c200774g831722b514932e723020b373150E697078b308328
10708 i756710e675486c941832b575726c955264h559294a1289686A0946d430172c048980
10698 a1474874A033004E950696D220076C204804E829566b504760d482602i492108G763820
10688 C616684A817004B262840E320620A090336h92120E507208A064252E493156F550832
10678 H3976b053220B224300b35840c129270i623556a3174594i605880f334896a305856
10668 e708718f435858C812560H448352B238450G079134a363338g823462c246256c936176
10658 e418550I4982G756122I29608B87554c696426c4670B22322D874964b395450a610840
10647 a1481870A198390A0837148G480238a471896c781788B28522f928436F833946A1560322
$$ y = [1115292, -3144692, 816060, -3200774, -7831722, -2514932, -5723020, -2373150, 5697078, -2308328, -9756710, -5675486, -3941832, -2575726, -3955264, -8559294, -11289686, 10946, -4430172, -3048980, -11474874, 1033004, 5950696, 4220076, 3204804, 5829566, -2504760, -4482602, -9492108, 7763820, 3616684, 1817004, 2262840, 5320620, 1090336, -892120, 5507208, 1064252, 5493156, 6550832, 83976, -2053220, 2224300, -235840, -3129270, -9623556, -13174594, -9605880, -6334896, -1305856, -5708718, -6435858, 3812560, 8448352, 2238450, 7079134, -1363338, -7823462, -3246256, -3936176, -5418550, 94982, 7756122, 929608, 287554, -3696426, -34670, 222322, 4874964, -2395450, -1610840, -11481870, 1198390, 10837148, 7480238, -1471896, -3781788, 228522, -6928436, 6833946, 11560322]
10637 G121980B9766A2362586E93738b624948a1402748i049624H879590d189752i312792
10627 f431384A622206G061230f037968b309756F713976C423116A383110b990252e140706
10617 b350118F567444c812404B063152A2168292C753436C803296b397260C061566B070352
10607 C333740b77248A0489808a523228C861476A091266G209004I197128a76484a138874
10597 d515664e905058f957070B08866c10392h451622f131160b43960E659616B633666
10587 G121040F897850I369362F834774E839098C661334d672338H785218D467454A0933822
10577 D00334C111534A0364264D478150a771434b229256a1871042a6894884a5031962
10568 a9695450a1620160B885236I311588E186666c196550e404588f168022G66522b531012
$$ y = [7121980, 29766, 12362586, 593738, -2624948, -11402748, -9049624, 8879590, -4189752, -9312792, -6431384, 1622206, 7061230, -6037968, -2309756, 6713976, 3423116, 1383110, -2990252, -5140706, -2350118, 6567444, -3812404, 2063152, 12168292, 3753436, 3803296, -2397260, 3061566, 2070352, 3333740, -277248, 10489808, -1523228, 3861476, 1091266, 7209004, 9197128, -176484, -1138874, -4515664, -5905058, -6957070, 208866, -310392, -8451622, -6131160, -243960, 5659616, 2633666, 7121040, 6897850, 9369362, 6834774, 5839098, 3661334, -4672338, 8785218, 4467454, 10933822, 400334, 3111534, 10364264, 4478150, -1771434, -2229256, -11871042, -16894884, -15031962, -19695450, -11620160, 2885236, 9311588, 5186666, -3196550, -5404588, -6168022, 766522, -2531012]
10558 a99044A7954F325272a141496C531156C567928a552162g320586c842446a423522
10548 e365238i96042i761194e746082b448694D185170i145762a3108268i191402a023388
10538 a354E322830E758120a903136C30258I27640c908218d639206g702794h667322b415806
10527 h610940B670146B6628B821840C693570D737570F477864H239006F096084I027424
10517 i292010f417372i145438g877836b794920d410684F15170E358592C5118572B10509186
10507 A18998912D5535226A8807128A5536760B0032306H901208A4920644A9607384F180214
10498 I607330D221544G514146B399584a210836E43496a2595806g885006C000858E059372
10488 A677808A677778G314946I370310d309588a8962906a5612958f86156G647386D262522
$$ y = [-199044, 17954, 6325272, -1141496, 3531156, 3567928, -1552162, -7320586, -3842446, -1423522, -5365238, -996042, -9761194, -5746082, -2448694, 4185170, -9145762, -13108268, -9191402, -1023388, -1354, 5322830, 5758120, -1903136, 330258, 927640, -3908218, -4639206, -7702794, -8667322, -2415806, -8610940, 2670146, 26628, 2821840, 3693570, 4737570, 6477864, 8239006, 6096084, 9027424, -9292010, -6417372, -9145438, -7877836, -2794920, -4410684, 615170, 5358592, 35118572, 210509186, 118998912, 45535226, 18807128, 15536760, 20032306, 8901208, 14920644, 19607384, 6180214, 9607330, 4221544, 7514146, 2399584, -1210836, 543496, -12595806, -7885006, 3000858, 5059372, 1677808, 1677778, 7314946, 9370310, -4309588, -18962906, -15612958, -686156, 7647386, 4262522]
10478 C917014c825926F49656D542944g643754a5196146d058880a858340g793486a1094128
10468 d927340c844876H974708e433860f943932h976832c419324C897632a344528g081436
10458 c648358C496464A931120d478440f653740B324992d56596b067012b59046h809836
10448 e099370a507206c341962c012536i680762a2128354d889940h043714h896130g573082
10438 a2577464g045390c745158b31744g676372e676710E710376D310220D302126H119002
10428 H686318b921704B271972d003590a484520e512568h67736F459872d420896i295234
10418 f673262g24750E788198D68096D774548E635648D513932G156496A450990e967118
10408 A191506A1351424E975994b698254a4256112c125794F794412c578870e785498b888934
$$ y = [3917014, -3825926, 649656, 4542944, -7643754, -15196146, -4058880, -1858340, -7793486, -11094128, -4927340, -3844876, 8974708, -5433860, -6943932, -8976832, -3419324, 3897632, -1344528, -7081436, -3648358, 3496464, 1931120, -4478440, -6653740, 2324992, -456596, -2067012, -259046, -8809836, -5099370, -1507206, -3341962, -3012536, -9680762, -12128354, -4889940, -8043714, -8896130, -7573082, -12577464, -7045390, -3745158, -231744, -7676372, -5676710, 5710376, 4310220, 4302126, 8119002, 8686318, -2921704, 2271972, -4003590, -1484520, -5512568, -867736, 6459872, -4420896, -9295234, -6673262, -724750, 5788198, 468096, 4774548, 5635648, 4513932, 7156496, 1450990, -5967118, 1191506, 11351424, 5975994, -2698254, -14256112, -3125794, 6794412, -3578870, -5785498, -2888934]
10398 A0350686A7417246B24910b784482a513084D330308H861438A0231206G424346f00600
10388 B276366c617888b462162d468510b758206c76748D872822D251522D790104A386586
10378 e749774C589424A583716b579366B365778D716536a1502366D849092C213098B644010
10368 G720446A206900b545324A01486b725778e413544C80000A822210H701838H789410
10358 D846444C773860b504062i29222g811920d271806d351002A127530B809284c674182
10348 a3004964a4598248c822002E569340A6616436E010674h275242f220338A455534d448540
10338 e683906A39784a2400606f965370h763128A897310h43998a510732D042776b305094
10328 d579230F928054I667478d37918b876538g8620d439016D389394d335514g329362
$$ y = [10350686, 17417246, 224910, -2784482, -1513084, 4330308, 8861438, 10231206, 7424346, -600600, 2276366, -3617888, -2462162, -4468510, -2758206, -376748, 4872822, 4251522, 4790104, 1386586, -5749774, 3589424, 1583716, -2579366, 2365778, 4716536, -11502366, 4849092, 3213098, 2644010, 7720446, 1206900, -2545324, 101486, -2725778, -5413544, 380000, 1822210, 8701838, 8789410, 4846444, 3773860, -2504062, -929222, -7811920, -4271806, -4351002, 1127530, 2809284, -3674182, -13004964, -14598248, -3822002, 5569340, 16616436, 5010674, -8275242, -6220338, 1455534, -4448540, -5683906, 139784, -12400606, -6965370, -8763128, 1897310, -843998, -1510732, 4042776, -2305094, -4579230, 6928054, 9667478, -437918, -2876538, -78620, -4439016, 4389394, -4335514, -7329362]
10318 d442550e855112a0227656a345264E513222C262774F126888E140784G23878E460218
10308 C640936C903484d839534f738998a0024108c006088E529342F822128c960522a664516
10298 b735092b406794a4142868g659620I111814C267366e739410a0555306d235670h580968
10288 h696928a0161842h466358B862464B805582D428274E981408I602994A2430752E370350
10278 B836710G588246A82986g933034A647024F414528A972500A555160a0323700a3193146
10268 a0936138b006606A2005024C787138E343510F140328e214510D67700c469834C244746
10258 A0551144C769970B886736G076370D643490H746856h53410A873398A940222I313356
10248 D614562D143212d27388B716228g496960a2582888a2068732g608998g151438F349844
$$ y = [-4442550, -5855112, -10227656, -1345264, 5513222, 3262774, 6126888, 5140784, 723878, 5460218, 3640936, 3903484, -4839534, -6738998, -10024108, -3006088, 5529342, 6822128, -3960522, -1664516, -2735092, -2406794, -14142868, -7659620, 9111814, 3267366, -5739410, -10555306, -4235670, -8580968, -8696928, -10161842, -8466358, 2862464, 2805582, 4428274, 5981408, 9602994, 12430752, 5370350, 2836710, 7588246, 182986, -7933034, 1647024, 6414528, 1972500, 1555160, -10323700, -13193146, -10936138, -2006606, 12005024, 3787138, 5343510, 6140328, -5214510, 467700, -3469834, 3244746, 10551144, 3769970, 2886736, 7076370, 4643490, 8746856, -853410, 1873398, 1940222, 9313356, 4614562, 4143212, -427388, 2716228, -7496960, -12582888, -12068732, -7608998, -7151438, 6349844]
10238 A290578D719262e157514g083594g944528a0472270h281966f899270a223622e85208
10228 A720844i035608e227456D373290C971666c265540c172566D095904F11416G23596
10218 i980058a6466892b846060c061270A570896e068150b228212G455718H473824D974576
10208 g355744a2777860d695904g631628a9653588a3796108c339504c009724E843886
10199 A3952126D135310F492202A742104e006954b416772b073834e237788a2382290a4229164
10189 a1640730a8320014a0672096f099940g347198g997410i883066G65046h3728g376240
10179 c815398F563704G251992I088754e098454A578038I44964f234194d66384c992684
10169 d574788a239412a2354580c90192E025082I490136E758044B284718F295412i16978
$$ y = [1290578, 4719262, -5157514, -7083594, -7944528, -10472270, -8281966, -6899270, -1223622, -585208, 1720844, -9035608, -5227456, 4373290, 3971666, -3265540, -3172566, 4095904, 611416, 723596, -9980058, -16466892, -2846060, -3061270, 1570896, -5068150, -2228212, 7455718, 8473824, 4974576, -7355744, -12777860, -4695904, -7631628, -19653588, -13796108, -3339504, -3009724, 5843886, 13952126, 4135310, 6492202, 1742104, -5006954, -2416772, -2073834, -5237788, -12382290, -14229164, -11640730, -18320014, -10672096, -6099940, -7347198, -7997410, -9883066, 765046, -83728, -7376240, -3815398, 6563704, 7251992, 9088754, -5098454, 1578038, 944964, -6234194, -466384, -3992684, -4574788, -1239412, -12354580, -390192, 5025082, 9490136, 5758044, 2284718, 6295412, -916978]
10159 a0375768b156956i090712a2014252a802884g85606C649532b026632c003974g235584
10149 f40052i105080e418742E779098H220658b147352A993776g847848d796372f125852
10139 d635078c667824a0245030c532390D834934C540146e292300C133510I127482B840774
10129 c468430f445594b51028G049564D943010c438270h00950B94202e593492c630164
10119 e315872d359372c177974f493506C202350a237398c384694c60620a739698a313834
10109 e39254D106212A0214676D822182G580178h7686f127934B477110f65450G736140
10099 A1475504A8721164G040500C332472B694238I323022C443882A4159796I722436F619866
10089 d877120f281410B92050h247406i011682F347984H435160A2477474I767708B407082
$$ y = [-10375768, -2156956, -9090712, -12014252, -1802884, -785606, 3649532, -2026632, -3003974, -7235584, -640052, -9105080, -5418742, 5779098, 8220658, -2147352, 1993776, -7847848, -4796372, -6125852, -4635078, -3667824, -10245030, -3532390, 4834934, 3540146, -5292300, 3133510, 9127482, 2840774, -3468430, -6445594, -251028, 7049564, 4943010, -3438270, -800950, 294202, -5593492, -3630164, -5315872, -4359372, -3177974, -6493506, 3202350, -1237398, -3384694, -360620, -1739698, -1313834, -539254, 4106212, 10214676, 4822182, 7580178, -87686, -6127934, 2477110, -665450, 7736140, 11475504, 18721164, 7040500, 3332472, 2694238, 9323022, 3443882, 14159796, 9722436, 6619866, -4877120, -6281410, 292050, -8247406, -9011682, 6347984, 8435160, 12477474, 9767708, 2407082]
10079 d750874D166132E644126D193988D943326a0889624b845298e461516c778096G598762
10069 G771340A3896448A0938518D653310B341648f589378g037910a3293348b715772g082328
10059 d285658c856358e666154A665120G668236A2137284A0754250e803104e679202e18196
10049 H42132f163424c877114B379346G245744b376496i198568a2469418d961292a007166
10039 E258894c894036b704596d464478d990808b401986i67320h514302b558938B95114
10029 C919958C227592E321628B103468A239600e231428a400732H682832E563738D886910
10019 b174190a582488B921888d538564a1278862e012386g372252d523196c229748e464946
10009 a2921676c319936E21366D22160d03330a1239930a5535534a0445154b941274a954252
$$ y = [-4750874, 4166132, 5644126, 4193988, 4943326, -10889624, -2845298, -5461516, -3778096, 7598762, 7771340, 13896448, 10938518, 4653310, 2341648, -6589378, -7037910, -13293348, -2715772, -7082328, -4285658, -3856358, -5666154, 1665120, 7668236, 12137284, 10754250, -5803104, -5679202, -518196, 842132, -6163424, -3877114, 2379346, 7245744, -2376496, -9198568, -12469418, -4961292, -1007166, 5258894, -3894036, -2704596, -4464478, -4990808, -2401986, -967320, -8514302, -2558938, 295114, 3919958, 3227592, 5321628, 2103468, 1239600, -5231428, -1400732, 8682832, 5563738, 4886910, -2174190, -1582488, 2921888, -4538564, -11278862, -5012386, -7372252, -4523196, -3229748, -5464946, -12921676, -3319936, 521366, 422160, -403330, -11239930, -15535534, -10445154, -2941274, -1954252]
9999 g174826g672830c825990d790870d455272i719838b901364A769988f365266A362114
9989 i9614F137812B260208g8010a430884g786436a156916f927416a749976D81222C592460
9978 F163260A0107482c276952c278670C603454C730744B787894a220484a2105870c218326
9968 d058542a145778g489076e986684a3554790B960626E792026A2992970A777406b148706
9958 B479848B159160C485272i699140g514378a5157610B705432H37386A4595530I462256
9948 B190896c579724D921952b139716b824648B724208C518330F874990h93210f750204
9938 d828318H879318g278532c959310a591296F08638E484140g924346a3198540h992178
9928 a539452E74444C909862A351774d20552i478728c181170i110018g046046e706250
$$ y = [-7174826, -7672830, -3825990, -4790870, -4455272, -9719838, -2901364, 1769988, -6365266, 1362114, -99614, 6137812, 2260208, -78010, -1430884, -7786436, -1156916, -6927416, -1749976, 481222, 3592460, 6163260, 10107482, -3276952, -3278670, 3603454, 3730744, 2787894, -1220484, -12105870, -3218326, -4058542, -1145778, -7489076, -5986684, -13554790, 2960626, 5792026, 12992970, 1777406, -2148706, 2479848, 2159160, 3485272, -9699140, -7514378, -15157610, 2705432, 837386, 14595530, 9462256, 2190896, -3579724, 4921952, -2139716, -2824648, 2724208, 3518330, 6874990, -893210, -6750204, -4828318, 8879318, -7278532, -3959310, -1591296, 608638, 5484140, -7924346, -13198540, -8992178, -1539452, 574444, 3909862, 1351774, -420552, -9478728, -3181170, -9110018, -7046046, -5706250]
9918 i877012a2674650a326642B100396d23642c29434C209512a245858d323388b22806
9908 A464478d063766B146350h251562a3327934a4696762d772492A935936A1792234A3262680
9898 a51950b626722F542678E591170D188918a336898D17772a826228d956844C133638d874
9887 b564634B4878b997092g799720a204664d011864A784308i23112d086126F927338b387658
9876 a0903572i491908E396720A0707308E112066D553022D95662A403960d4634G299500
9866 F729472A763824f184574h747724A251954h464534d58988a584772a677402a2909744
9856 E983250E595068i389634a1696530h517378a302846h76956E938350d0510A1035912
9846 a287914c463332a882912h989084a6867244e888346H376556h11352G610370C912690
$$ y = [-9877012, -12674650, -1326642, 2100396, -423642, -329434, 3209512, -1245858, -4323388, -222806, 1464478, -4063766, 2146350, -8251562, -13327934, -14696762, -4772492, 1935936, 11792234, 13262680, -151950, -2626722, 6542678, 5591170, 4188918, -1336898, 417772, -1826228, -4956844, 3133638, -4874, -2564634, 24878, -2997092, -7799720, -1204664, -4011864, 1784308, -923112, -4086126, 6927338, -2387658, -10903572, -9491908, 5396720, 10707308, 5112066, 4553022, 495662, 1403960, -44634, 7299500, 6729472, 1763824, -6184574, -8747724, 1251954, -8464534, -458988, -1584772, -1677402, -12909744, 5983250, 5595068, -9389634, -11696530, -8517378, -1302846, -876956, 5938350, -40510, 11035912, -1287914, -3463332, -1882912, -8989084, -16867244, -5888346, 8376556, -811352, 7610370, 3912690]
9836 H46076A4867042A5010224g123924h205130D393124H417178B806348f820064d733632
9826 a328600d164072a096972B766654b531900E762614F734686E386832g081582a276904
9816 D64866b870260G95332F693018f56284h076032d717386a2622116h815142c415996
9806 b941776f57476a212848a768248d605092A2794904A7215334B901734h129092a6510474
9796 C026132A574170D454624e34174a951900H204184A3520914A802506b253590c569998
9786 C883302G132824B583534a668B878918b87994i093874a047692a915212c525128G329806
9775 I964020b650212A714960a148448C257634g718762A045208A812736A964244F754592
9765 D148240b810584d685656a191632h46424f138728a5123248a0910702i791260F37396
$$ y = [846076, 14867042, 15010224, -7123924, -8205130, 4393124, 8417178, 2806348, -6820064, -4733632, -1328600, -4164072, -1096972, 2766654, -2531900, 5762614, 6734686, 5386832, -7081582, -1276904, 464866, -2870260, 795332, 6693018, -656284, -8076032, -4717386, -12622116, -8815142, -3415996, -2941776, -657476, -1212848, -1768248, -4605092, 12794904, 17215334, 2901734, -8129092, -16510474, 3026132, 1574170, 4454624, -534174, -1951900, 8204184, 13520914, 1802506, -2253590, -3569998, 3883302, 7132824, 2583534, -1668, 2878918, -287994, -9093874, -1047692, -1915212, -3525128, 7329806, 9964020, -2650212, 1714960, -1148448, 3257634, -7718762, 1045208, 1812736, 1964244, 6754592, 4148240, -2810584, -4685656, -1191632, -846424, -6138728, -15123248, -10910702, -9791260, 637396]
9755 F850704A1600340a727006E328734B2631914A2229602I6056a2664392a1092560A768464
9745 f618086d843586c219636E298928a2627106b4636572a0904750A319194I661464a535338
9735 E256144F399616H804656B789530I231328F348046E661584E690184b235274g47708
9725 C237522D505430a87620B92456D013936c349676C375032h065450d054726A910388
9715 A552772A234176a679448d514418i006686A334080A2729072H940568B252170c964888
9705 A350728I290558E130688a0261470a0739812i720800a8016516e795472B948128F646100
9695 H613142H947904A409056D112770B188948h49624a182662e068712b955418f203998
9685 a0627000b015394G343248c055662d404310a0999972a0767466a1008140e962444
$$ y = [6850704, 11600340, -1727006, 5328734, 22631914, 12229602, 96056, -12664392, -11092560, 1768464, -6618086, -4843586, -3219636, 5298928, -12627106, -24636572, -10904750, 1319194, 9661464, -1535338, 5256144, 6399616, 8804656, 2789530, 9231328, 6348046, 5661584, 5690184, -2235274, -747708, 3237522, 4505430, -187620, 292456, 4013936, -3349676, 3375032, -8065450, -4054726, 1910388, 1552772, 1234176, -1679448, -4514418, -9006686, 1334080, 12729072, 8940568, 2252170, -3964888, 1350728, 9290558, 5130688, -10261470, -10739812, -9720800, -18016516, -5795472, 2948128, 6646100, 8613142, 8947904, 1409056, 4112770, 2188948, -849624, -1182662, -5068712, -2955418, -6203998, -10627000, -2015394, 7343248, -3055662, -4404310, -10999972, -10767466, -11008140, -5962444]
9676 A0140736D330858H902958A0518086D514968e13204c39692h531592c646736C882758
9666 h7852A1108c816812e101022a72358b008720A416652C201610B495484E011354B917832
9655 i550978b00192A673352A662228C550076B069260a864574A756646A13390c776568F16690
9644 g239580d896930a0633136a6854136a1399924e945754d856444A11618b051078e178456
9634 b723666g592986a0260444C544478C074658E81594b553202e990F493324a067336d959090
9623 A711374A0663136H433304H645038G757410A773978d025410H741530A629690E343184
9613 D873022B06930e656638D396906G373574A4011844c185938C360112B358416a5889142
9603 a2156510f527674g445166a2154974a3636856h181240C220494b46774g896666c683962
$$ y = [10140736, 4330858, 8902958, 10518086, 4514968, -513204, -339692, -8531592, -3646736, 3882758, -87852, 11108, -3816812, -5101022, -172358, -2008720, 1416652, 3201610, 2495484, 5011354, 2917832, -9550978, -200192, 1673352, 1662228, 3550076, 2069260, -1864574, 1756646, 113390, -3776568, 616690, -7239580, -4896930, -10633136, -16854136, -11399924, -5945754, -4856444, 111618, -2051078, -5178456, -2723666, -7592986, -10260444, 3544478, 3074658, 581594, -2553202, -5990, 6493324, -1067336, -4959090, 1711374, 10663136, 8433304, 8645038, 7757410, 1773978, -4025410, 8741530, 1629690, 5343184, 4873022, 206930, -5656638, 4396906, 7373574, 14011844, -3185938, 3360112, 2358416, -15889142, -12156510, -6527674, -7445166, -12154974, -13636856, -8181240, 3220494, -246774, -7896666, -3683962]
9593 h293918a1727380h677384h601650a6051016c013382B538818D374346A1867200F415926
9583 E751448A3826238A3439754c731802d188078e917546a0585960f606260b707204b912476
9573 a1856014a5028002e234846e620078a468956A926630H088040A2036890E427938B212216
9563 C20426E338132C811558b357686E072998A0815774G855464E886652H870238G557400
9553 F167962A1044366e165310a3552950d423634d529754e300618B635780G30176b612364
9543 c262888a970992D820846c082490c181072c529556e956196f251840c093674B021234
9533 e788556g907666a325716B400366H828314G176058A405032a097440D075024f71318
9523 g484372b385392B261436b962860e339546b533422g766330c398074a4395808a2993720
$$ y = [-8293918, -11727380, -8677384, -8601650, -16051016, -3013382, 2538818, 4374346, 11867200, 6415926, 5751448, 13826238, 13439754, -3731802, -4188078, -5917546, -10585960, -6606260, -2707204, -2912476, -11856014, -15028002, -5234846, -5620078, -1468956, 1926630, 8088040, 12036890, 5427938, 2212216, 320426, 5338132, 3811558, -2357686, 5072998, 10815774, 7855464, 5886652, 8870238, 7557400, 6167962, 11044366, -5165310, -13552950, -4423634, -4529754, -5300618, 2635780, 730176, -2612364, -3262888, -1970992, 4820846, -3082490, -3181072, -3529556, -5956196, -6251840, -3093674, 2021234, -5788556, -7907666, -1325716, 2400366, 8828314, 7176058, 1405032, -1097440, 4075024, -671318, -7484372, -2385392, 2261436, -2962860, -5339546, -2533422, -7766330, -3398074, -14395808, -12993720]
9513 b935266H180624G84700G025476H052086F738146a910318d0080a316878B399830F903658
9502 C508888H683072E398708A3159044A0948912D325558e188452a2587776g011776b008226
9492 a3677322a808682D30092A568862E655538G485318F828956G612656b256890D412638
9482 a381800a0371702c85068f406794h513146h649376A837538A3725778C077788h952418
9472 a552548B090142B001122B59958C481972B828808a863618D308710B496978A137752
9462 g439596A827052i03896A1844392A1113932a864294c925380i84218A558270A059074
9452 h84228c11946a08396a4391152i647454f873852a0222802i936456a3786606i696406
9442 b323254f365064E851858A6988902A0886192I405600A0631164c550698a192930D813284
$$ y = [-2935266, 8180624, 784700, 7025476, 8052086, 6738146, -1910318, -40080, -1316878, 2399830, 6903658, 3508888, 8683072, 5398708, 13159044, 10948912, 4325558, -5188452, -12587776, -7011776, -2008226, -13677322, -1808682, 430092, 1568862, 5655538, 7485318, 6828956, 7612656, -2256890, 4412638, -1381800, -10371702, -385068, -6406794, -8513146, -8649376, 1837538, 13725778, 3077788, -8952418, -1552548, 2090142, 2001122, 259958, 3481972, 2828808, -1863618, 4308710, 2496978, 1137752, -7439596, 1827052, -903896, 11844392, 11113932, -1864294, -3925380, -984218, 1558270, 1059074, -884228, -311946, -108396, -14391152, -9647454, -6873852, -10222802, -9936456, -13786606, -9696406, -2323254, -6365064, 5851858, 16988902, 10886192, 9405600, 10631164, -3550698, -1192930, 4813284]
9432 d074916e424614A2000074D499264b490582G74982c915934a2658486a001880A0050460
9422 A9793348C5309656C4871220E7717750A95702986I72201806F38950440A81900686
9414 H2594360E4217174D4066214B6993850B0461158A7922146G041424A1995054G107854
9405 B0330736A5734876B38090B527140A956696I849606A0559926A2930426C261232a61514
9395 C304852c02412C863382A3588222A7995206B6745590C6771294G7967594A99648276
9386 I40064118F81887642A93284982I0723158E5966734C0703000A7247526A5344272F65390
9377 i13344C424432D616288G739768I854296H157978E112178H237932A537328c413116
9367 H724956A0094478A3255890F536590B88408H132992E569146D01768A27286d740976
$$ y = [-4074916, -5424614, 12000074, 4499264, -2490582, 774982, -3915934, -12658486, -1001880, 10050460, 19793348, 35309656, 34871220, 57717750, 195702986, 972201806, 638950440, 181900686, 82594360, 54217174, 44066214, 26993850, 20461158, 17922146, 7041424, 11995054, 7107854, 20330736, 15734876, 238090, 2527140, 1956696, 9849606, 10559926, 12930426, 3261232, -161514, 3304852, -302412, 3863382, 13588222, 17995206, 26745590, 36771294, 77967594, 199648276, 940064118, 681887642, 193284982, 90723158, 55966734, 30703000, 17247526, 15344272, 665390, -913344, 3424432, 4616288, 7739768, 9854296, 8157978, 5112178, 8237932, 1537328, -3413116, 8724956, 10094478, 13255890, 6536590, 288408, 8132992, 5569146, 401768, 127286, -4740976]
9357 F12802A965706f044450b641490a940454g480814a2570820a1099898a0977336c506940
9347 A802030A436592C343286b01600a308494F077168e623374e74420D543992D475906
9337 a947490b404862B376620A571642d176120D867704A095200H807006A4017458A0610140
9327 A66578C563194a193350d391084i450926e491880h577296D981192I16326d894484b64698
9316 c014758f993388b06486e739666C138726F579834H718644B218120B842998E922492
9306 A121054B854708b980172g06952G598154F399502C794152a547094B399186c424358
9296 a0227762B22148E069504f26132a388040g308458f063314a2668538g300018A240946
9286 c662984h254410C438506b373726F717844H419100A201264I1506F425572A467970
$$ y = [612802, 1965706, -6044450, -2641490, -1940454, -7480814, -12570820, -11099898, -10977336, -3506940, 1802030, 1436592, 3343286, -201600, -1308494, 6077168, -5623374, -574420, 4543992, 4475906, -1947490, -2404862, 2376620, 1571642, -4176120, 4867704, 1095200, 8807006, 14017458, 10610140, 166578, 3563194, -1193350, -4391084, -9450926, -5491880, -8577296, 4981192, 916326, -4894484, -264698, -3014758, -6993388, -206486, -5739666, 3138726, 6579834, 8718644, 2218120, 2842998, 5922492, 1121054, 2854708, -2980172, -706952, 7598154, 6399502, 3794152, -1547094, 2399186, -3424358, -10227762, 222148, 5069504, -626132, -1388040, -7308458, -6063314, -12668538, -7300018, 1240946, -3662984, -8254410, 3438506, -2373726, 6717844, 8419100, 1201264, 91506, 6425572, 1467970]
9276 A416544g116478c928508D897170G163368E670974H17578a063180d14168c574550
9266 A789760f371868g158936D1434A968470d912408a7024064a9915928a3142314e356482
9256 g517654F470560A0426166C124356F339732a804690i136572a847128d603718i121570
9246 a097502G896896E184588A338136D826008C774592E915034D613558I603556A1823620
9236 C851634A4787192A7047672C4585306F9387092C07952794E42345870A43662704E2472738
9227 B9157730A2017988A0142310f518692A1292386D692342B839598D948336E142018E156626
9217 F172048A998116d019042F400224F720344H00550E1674a93286b994310I490248A715406
9206 B530488D641182D755090E528134E434796h330648a593020A449684F22906D973800
$$ y = [1416544, -7116478, -3928508, 4897170, 7163368, 5670974, 817578, -1063180, -414168, -3574550, 1789760, -6371868, -7158936, 41434, 1968470, -4912408, -17024064, -19915928, -13142314, -5356482, -7517654, 6470560, 10426166, 3124356, 6339732, -1804690, -9136572, -1847128, -4603718, -9121570, -1097502, 7896896, 5184588, 1338136, 4826008, 3774592, 5915034, 4613558, 9603556, 11823620, 3851634, 14787192, 17047672, 34585306, 69387092, 307952794, 542345870, 143662704, 52472738, 29157730, 12017988, 10142310, -6518692, 11292386, 4692342, 2839598, 4948336, 5142018, 5156626, 6172048, 1998116, -4019042, 6400224, 6720344, 800550, 51674, -193286, -2994310, 9490248, 1715406, 2530488, 4641182, 4755090, 5528134, 5434796, -8330648, -1593020, 1449684, 622906, 4973800]
9196 c427102c52128E528674B477778d94654a748676a398302I52650b687320C264552B878226
9185 C92542g62802E429294D697526D756694D522100B561098a186140E256056A1957576
9175 E077796b853734b997724B94222b218572D56468A024224a179602f498814a1827106F3110
9164 a870238a983730B68772c783224A316180F0624c278718b198338h784604a0701726
9154 C649766A8143844c51512i145016g673300a5640290d286258A645086B259138A636236
9144 e622754d710258i289862f863976a4795974H35824D449032C007944C046806I828262
9134 a806878B979802b376308A160784e19724D060056i791784f956818A94810g058376f22124
9123 A1187954E914776b707102A0505016a05364C172160g386340A082486F25860f833312
$$ y = [-3427102, -352128, 5528674, 2477778, -494654, -1748676, -1398302, 952650, -2687320, 3264552, 2878226, 392542, -762802, 5429294, 4697526, 4756694, 4522100, 2561098, -1186140, 5256056, 11957576, 5077796, -2853734, -2997724, 294222, -2218572, 456468, 1024224, -1179602, -6498814, -11827106, 63110, -1870238, -1983730, 268772, -3783224, 1316180, 60624, -3278718, -2198338, -8784604, -10701726, 3649766, 18143844, -351512, -9145016, -7673300, -15640290, -4286258, 1645086, 2259138, 1636236, -5622754, -4710258, -9289862, -6863976, -14795974, 835824, 4449032, 3007944, 3046806, 9828262, -1806878, 2979802, -2376308, 1160784, -519724, 4060056, -9791784, -6956818, 194810, -7058376, -622124, 11187954, 5914776, -2707102, 10505016, -105364, 3172160, -7386340, 1082486, 625860, -6833312]
9113 g000456c933736A375282b900938B929404d932974c791542f115946g472530b323926
9103 e39744b948054a0080478a2268050a6437556b615148f261060g136678i273764b447342
9093 B081242D125062d11566a1829418F019684A917144H060456A0252316c322078C047070
9083 c164370E565532D973824E601484A0192058A0779460C203640A3849178G613838G860580
9073 C230786A368652B094510d473108H49232g789774f272002A637264B249590A0689962
9063 A1229298B931344G467856A614912e028178h052126C106476a693452b909992A1463614
9053 e1394A367688B214866e625998e946030i26076a385202G277096H766528G08716i551644
9042 a3615994a846992I41352a583250C932556E854156g78358h65988G439604A2655944
$$ y = [-7000456, -3933736, 1375282, -2900938, 2929404, -4932974, -3791542, -6115946, -7472530, -2323926, -539744, -2948054, -10080478, -12268050, -16437556, -2615148, -6261060, -7136678, -9273764, -2447342, 2081242, 4125062, -411566, -11829418, 6019684, 1917144, 8060456, 10252316, -3322078, 3047070, -3164370, 5565532, 4973824, 5601484, 10192058, 10779460, 3203640, 13849178, 7613838, 7860580, 3230786, 1368652, 2094510, -4473108, 849232, -7789774, -6272002, 1637264, 2249590, 10689962, 11229298, 2931344, 7467856, 1614912, -5028178, -8052126, 3106476, -1693452, -2909992, 11463614, -51394, 1367688, 2214866, -5625998, -5946030, -926076, -1385202, 7277096, 8766528, 708716, -9551644, -13615994, -1846992, 941352, -1583250, 3932556, 5854156, -778358, -865988, 7439604, 12655944]
9032 D863018A194542E577744F179420H134608A1885444G625406E145028a43574i132070
9022 B166138A4828892E277412g813430h68486C515414b04140A333828c002272g826818
9012 E218020B52520C314124C617964C11146G87364d190818F636636G860124D801060F098900
9001 D388494A732470c710d162442d184500f954092h232356a792592C128272E148662g702460
8990 e014234C988994e92088C52402E718100A0489034I016644G377572B131074F80682
8980 A877120b931370a0739028g883590A376948G099504d462400a1903058d778444C74550
8970 G807528B736102e52836c969760f696114F156102A1009068E629398b096622B531682
8960 c967574b367116A72492B838622B423778D262204a476244D601042G243188E854406
$$ y = [4863018, 1194542, 5577744, 6179420, 8134608, 11885444, 7625406, 5145028, -143574, -9132070, 2166138, 14828892, 5277412, -7813430, -868486, 3515414, -204140, 1333828, -3002272, -7826818, 5218020, 252520, 3314124, 3617964, 311146, 787364, -4190818, 6636636, 7860124, 4801060, 6098900, 4388494, 1732470, -3710, -4162442, -4184500, -6954092, -8232356, -1792592, 3128272, 5148662, -7702460, -5014234, 3988994, -592088, 352402, 5718100, 10489034, 9016644, 7377572, 2131074, 680682, 1877120, -2931370, -10739028, -7883590, 1376948, 7099504, -4462400, -11903058, -4778444, 374550, 7807528, 2736102, -552836, -3969760, -6696114, 6156102, 11009068, 5629398, -2096622, 2531682, -3967574, -2367116, 172492, 2838622, 2423778, 4262204, -1476244, 4601042, 7243188, 5854406]
8950 a486132A231554a059770C913952B82848a208888d180384d379428a742036E218168
8940 I32518D31460A603694A420988H887098c503932C08504G064338E468364E939682A449738
8929 a118596G314354b150592H108254e228052a416298C617024G800708B739718b676338
8919 G739508C569298b775848e65320B403718E353840F373568A495240c277378D890696
8909 F532542E883068b299726i116178b413342A411942c248228a1754080A231670D337874
8899 B748632F549460G498758H529700A0919880a2202310a74470B37174D285958a012380
8889 B423578I900326A0529902E85264a551270c597496g06360i352590c565620D102818
8879 e617338a127700a713266D122142g03172e164546f174648d207578a1593412e019842
$$ y = [-1486132, 1231554, -1059770, 3913952, 282848, -1208888, -4180384, -4379428, -1742036, 5218168, 932518, 431460, 1603694, 1420988, 8887098, -3503932, 308504, 7064338, 5468364, 5939682, 1449738, -1118596, 7314354, -2150592, 8108254, -5228052, -1416298, 3617024, 7800708, 2739718, -2676338, 7739508, 3569298, -2775848, -565320, 2403718, 5353840, 6373568, 1495240, -3277378, 4890696, 6532542, 5883068, -2299726, -9116178, -2413342, 1411942, -3248228, -11754080, 1231670, 4337874, 2748632, 6549460, 7498758, 8529700, 10919880, -12202310, -174470, 237174, 4285958, -1012380, 2423578, 9900326, 10529902, 585264, -1551270, -3597496, -706360, -9352590, -3565620, 4102818, -5617338, -1127700, -1713266, 4122142, -703172, -5164546, -6174648, -4207578, -11593412, -5019842]
8869 h987340a2749490a640796b392136H47520a294284d303640C370186c080028e391214
8859 e597260d369446b416360A962360b519478H126726E28452C226384e29560c063010
8849 c759960a875224d216306E842128E287842f425044d064390c670298d608502f606148
8839 b938840b381914c720294f162662C418264i02522C136818E512630C665768I256996
8829 H118376f057456D146182A0541106A7830654D932600a0182574B75984A156392h62522
8819 e714714f302232g564782G83268c495776c832024i116270E026084H471516A5024102
8809 E157498a871596H794806D96578F750568a629364d429714e731774A437418E138672
8799 b599406B546178f225372c337882E240680H58230C757316d130584e824476a776540
$$ y = [-8987340, -12749490, -1640796, -2392136, 847520, -1294284, -4303640, 3370186, -3080028, -5391214, -5597260, -4369446, -2416360, 1962360, -2519478, 8126726, 528452, 3226384, -529560, -3063010, -3759960, -1875224, -4216306, 5842128, 5287842, -6425044, -4064390, -3670298, -4608502, -6606148, -2938840, -2381914, -3720294, -6162662, 3418264, -902522, 3136818, 5512630, 3665768, 9256996, 8118376, -6057456, 4146182, 10541106, 17830654, 4932600, -10182574, 275984, 1156392, -862522, -5714714, -6302232, -7564782, 783268, -3495776, -3832024, -9116270, 5026084, 8471516, 15024102, 5157498, -1871596, 8794806, 496578, 6750568, -1629364, -4429714, -5731774, 1437418, 5138672, -2599406, 2546178, -6225372, -3337882, 5240680, 858230, 3757316, -4130584, -5824476, -1776540]
8789 a921406a0214670d332178h39268d246448h959620g507818b283346F866874h236766
8779 a811204B588592a798986a766244E044376H562024G365558e690842e863610h9478B22016
8768 b722580b097448a862730F47048E877478I581958E306862c025072i73708e120530
8758 b345556A351890c354298d125430a2573284h652780a2756152e193472a1083720i075762
8748 e373470i645688d769860d988470c032804D558592F808512C892844g26606C276172
8738 a431424b416574h086100f961072C861078c502508c133920G539640F909710B716032
8728 a3313140i267054g57116C007562f77984B280940c012578e56888b570902b922390G24116
8717 i88320b3350138a6799356i374416C71542g446166h930088c081198a0373478g715350
$$ y = [-1921406, -10214670, -4332178, -839268, -4246448, -8959620, -7507818, -2283346, 6866874, -8236766, -1811204, 2588592, -1798986, -1766244, 5044376, 8562024, 7365558, -5690842, -5863610, -89478, 222016, -2722580, -2097448, -1862730, 647048, 5877478, 9581958, 5306862, -3025072, -973708, -5120530, -2345556, 1351890, -3354298, -4125430, -12573284, -8652780, -12756152, -5193472, -11083720, -9075762, -5373470, -9645688, -4769860, -4988470, -3032804, 4558592, 6808512, 3892844, -726606, 3276172, -1431424, -2416574, -8086100, -6961072, 3861078, -3502508, -3133920, 7539640, 6909710, 2716032, -13313140, -9267054, -757116, 3007562, -677984, 2280940, -3012578, -556888, -2570902, -2922390, 724116, -988320, -23350138, -16799356, -9374416, 371542, -7446166, -8930088, -3081198, -10373478, -7715350]
8707 h743510b926532C891040a518106d820250H18206e03228A3817000E423128E783328
8697 f105902a4472188h79038e670316b519462a420198f505710C445028H08744d846312
8687 a824718b376096b374414A046126G850632A519498g518256h707700a1389048c012568
8677 F290478g248510a1610196f308888B608620C800768F724562D7382a003894h643604
8667 I756426I935896E559522D601638G023630I112392D489736D482578B35794b343510
8657 a880642g110242f636506a298156C552912A25164B174296e687274a6460376g354402
8647 a2854462a0432484C577108A119652e11478C066922c863706a3090006i723386a6377980
8637 C166658a268758b15228A080962D874840d948558d830294d79040E984606D742416a02488
$$ y = [-8743510, -2926532, 3891040, -1518106, -4820250, 818206, -503228, 13817000, 5423128, 5783328, -6105902, -14472188, -879038, -5670316, -2519462, -1420198, -6505710, 3445028, 808744, -4846312, -1824718, -2376096, -2374414, 1046126, 7850632, 1519498, -7518256, -8707700, -11389048, -3012568, 6290478, -7248510, -11610196, -6308888, 2608620, 3800768, 6724562, 47382, -1003894, -8643604, 9756426, 9935896, 5559522, 4601638, 7023630, 9112392, 4489736, 4482578, 235794, -2343510, -1880642, -7110242, -6636506, -1298156, 3552912, 125164, 2174296, -5687274, -16460376, -7354402, -12854462, -10432484, 3577108, 1119652, -511478, 3066922, -3863706, -13090006, -9723386, -16377980, 3166658, -1268758, -215228, 1080962, 4874840, -4948558, -4830294, -479040, 5984606, 4742416, -102488]
8626 c771436B33554c249540a696112a3359158i749408G197842A3760318I837934e717686
8616 a3363112a0478122a2925890a2194888a0267242B035790A0205974F066078e175728
8607 A0754758A049848G647862G16384a1549468a2483874a938846C229842A0344862I071288
8597 e59994a993086b792444f439148f745672c747090G418174d7520A015138I807250a86818
8586 D258312H533794F966584C378996f84950I93570e507416A987208C456924d321580
8576 a0193546a3501270f617766A0129606D44586F436106C333066e93388a122066f660016
8566 a2777790a2172916C785344F847700I211936A991760f038436e834588b399628b292570
8556 G899816B53912D03502F699742F633808e17930A348606B054700h406726h557720e476538
$$ y = [-3771436, 233554, -3249540, -1696112, -13359158, -9749408, 7197842, 13760318, 9837934, -5717686, -13363112, -10478122, -12925890, -12194888, -10267242, 2035790, 10205974, 6066078, -5175728, 10754758, 1049848, 7647862, 716384, -11549468, -12483874, -1938846, 3229842, 10344862, 9071288, -559994, -1993086, -2792444, -6439148, -6745672, -3747090, 7418174, -47520, 1015138, 9807250, -186818, 4258312, 8533794, 6966584, 3378996, -684950, 993570, -5507416, 1987208, 3456924, -4321580, -10193546, -13501270, -6617766, 10129606, 444586, 6436106, 3333066, -593388, -1122066, -6660016, -12777790, -12172916, 3785344, 6847700, 9211936, 1991760, -6038436, -5834588, -2399628, -2292570, 7899816, 253912, 403502, 6699742, 6633808, -517930, 1348606, 2054700, -8406726, -8557720, -5476538]
8545 c836830c251488C691216B897878d906150c693234i516770g477448a0832876b717066
8535 e616212i727880e253200D66992c745268b68268d564502e614252F27334C784592d165746
8524 a950122b075276e995896A83538E827828A571618a708252B413994A817124A652702
8514 B277602c373018E256672b980482a3233232a1028528c820658A2668166B837060a0536
8504 a318398c963030f62178a1110130e088998g120292h789090a0696556c112992g6696
8494 b041446B155612c56418f078968C322026g14524d273782a323274C022658A124166
8484 b830222g962054g109814i482938a7480C850940f591630a0721082a807364F150322
8474 C182424E94970H62398A06638c461730B148928I388306E309494a327484D073694E183190
$$ y = [-3836830, -3251488, 3691216, 2897878, -4906150, -3693234, -9516770, -7477448, -10832876, -2717066, -5616212, -9727880, -5253200, 466992, -3745268, -268268, -4564502, -5614252, 627334, 3784592, -4165746, -1950122, -2075276, -5995896, 183538, 5827828, 1571618, -1708252, 2413994, 1817124, 1652702, 2277602, -3373018, 5256672, -2980482, -13233232, -11028528, -3820658, 12668166, 2837060, -10536, -1318398, -3963030, -662178, -11110130, -5088998, -7120292, -8789090, -10696556, -3112992, -76696, -2041446, 2155612, -356418, -6078968, 3322026, -714524, -4273782, -1323274, 3022658, 1124166, -2830222, -7962054, -7109814, -9482938, -17480, 3850940, -6591630, -10721082, -1807364, 6150322, 3182424, 594970, 862398, 106638, -3461730, 2148928, 9388306, 5309494, -1327484, 4073694, 5183190]
8463 c070046d592350C124226A302470D18748f420826A229296a632272d962600E949082
8453 e941578e250652e16904F105546H594872C229556B705346E792716c782360d810706
8443 h743754A669004d683326g335948B207050B833862F550874A190790b044600c381322
8433 I273116E785540a080386D628092a392524B792778A815586a258126a0790648i063308
8423 a296524a38538G323626D849632f31750a102836a6391344h644278F513840A0217194
8413 a40252E005210G670494A0574860G118754G233484F901188C484614D252624D087112
8403 B811296d125938a56232c943290B483386A0042652B402834b206526b976656g014116
8393 C812258C710480a885786d47502b780686G509352A0382064h39520c99038B136732
$$ y = [-3070046, -4592350, 3124226, 1302470, 418748, -6420826, 1229296, -1632272, -4962600, 5949082, -5941578, -5250652, -516904, 6105546, 8594872, 3229556, 2705346, 5792716, -3782360, -4810706, -8743754, 1669004, -4683326, -7335948, 2207050, 2833862, 6550874, 1190790, -2044600, -3381322, 9273116, 5785540, -1080386, 4628092, -1392524, 2792778, 1815586, -1258126, -10790648, -9063308, -1296524, -138538, 7323626, 4849632, -631750, -1102836, -16391344, -8644278, 6513840, 10217194, -140252, 5005210, 7670494, 10574860, 7118754, 7233484, 6901188, 3484614, 4252624, 4087112, 2811296, -4125938, -156232, -3943290, 2483386, 10042652, 2402834, -2206526, -2976656, -7014116, 3812258, 3710480, -1885786, -447502, -2780686, 7509352, 10382064, -839520, -399038, 2136732]
8383 a917858B08828b902412a220708B682678D506328F368632b553246I954868c962224
8373 d344578e319580G066498D092790A3810782A0618942A2980060B349264D298308E747646
8363 e500510a0193618h462818G60794b94894a6646198a1749810b1054786B237740d69258
8353 a2926836a1186852c736994H52800i672452e064348A847764a530876c139982A2678716
8343 A0437394D323154A096952D707928B022974A1955152F442454a80666A314630A2275164
8333 H743170C336794A836106G734474c365202g623368a0674444a4740668a2442338a0977268
8323 g552490D069248g34232H007284C65636b864648a0072438i569130D410356f113048G1168
8312 C467016C032514D469330G533162a790752c42500E03504E27038B806942G723130E116350
$$ y = [-1917858, 208828, -2902412, -1220708, 2682678, 4506328, 6368632, -2553246, 9954868, -3962224, -4344578, -5319580, 7066498, 4092790, 13810782, 10618942, 12980060, 2349264, 4298308, 5747646, -5500510, -10193618, -8462818, 760794, -294894, -16646198, -11749810, -21054786, 2237740, -469258, -12926836, -11186852, -3736994, 852800, -9672452, -5064348, 1847764, -1530876, -3139982, 12678716, 10437394, 4323154, 1096952, 4707928, 2022974, 11955152, 6442454, -180666, 1314630, 12275164, 8743170, 3336794, 1836106, 7734474, -3365202, -7623368, -10674444, -14740668, -12442338, -10977268, -7552490, 4069248, -734232, 8007284, 365636, -2864648, -10072438, -9569130, 4410356, -6113048, 71168, 3467016, 3032514, 4469330, 7533162, -1790752, -342500, 503504, 527038, 2806942, 7723130, 5116350]
8301 F960838C909518e416382a65468H274418F664440c90520H537650B296310D979806
8291 A2178444G516852C024656h57354E427310D501610c830560e329752E38580D137694
8281 c400694A044184E868486G110498b001452a0515098h981036b137380I326078H59676
8271 d969330A505622b82636a633454B520982B747348I722766F278482G897660e885684
8261 a5490790f306444g215000d400870A567924C79758B537982B366094A409846a559132
8251 h842400h948452C160954B476152b127006A562418d883288A661362C900286E396896
8241 e232750A688766a287334a126354b508154e106950e806760D489202A049060E769504
8231 a483396b747544D842518D335292e35408E6960G931744C296668a617114c456462d457338
$$ y = [6960838, 3909518, -5416382, -165468, 8274418, 6664440, -390520, 8537650, 2296310, 4979806, 12178444, 7516852, 3024656, -857354, 5427310, 4501610, -3830560, -5329752, 538580, 4137694, -3400694, 1044184, 5868486, 7110498, -2001452, -10515098, -8981036, -2137380, 9326078, 859676, -4969330, 1505622, -282636, -1633454, 2520982, 2747348, 9722766, 6278482, 7897660, -5885684, -15490790, -6306444, -7215000, -4400870, 1567924, 379758, 2537982, 2366094, 1409846, -1559132, -8842400, -8948452, 3160954, 2476152, -2127006, 1562418, -4883288, 1661362, 3900286, 5396896, -5232750, 1688766, -1287334, -1126354, -2508154, -5106950, -5806760, 4489202, 1049060, 5769504, -1483396, -2747544, 4842518, 4335292, -535408, 56960, 7931744, 3296668, -1617114, -3456462, -4457338]
8220 b968636C244874C899702H531092G197302b50712D641194c368474H025338A298022
8210 b804590B579628C192602C667802g288064d919748B18164H073302A5164390c14654
8200 a756592b165084a464644C120418e38840a0986746f965958a022706A255362E074108
8190 f08314d216360C52504a319296i765412i56250A821400g909896D31146G38836B71124
8179 g654778a3664734a592844C042234C327470a087908a2571950a3302362a1154834G9768
8169 b636202e576222A0945010A044116g139708e227720c223124g999174a5712904g262556
8159 d507186E563628e279674i389450a6365730g721520a563910b509428G58022B264074
8149 C906972E184198A1376772a746776c927434B998038e494260h69600e165100f30312
$$ y = [-2968636, 3244874, 3899702, 8531092, 7197302, -250712, 4641194, -3368474, 8025338, 1298022, -2804590, 2579628, 3192602, 3667802, -7288064, -4919748, 218164, 8073302, 15164390, -314654, -1756592, -2165084, -1464644, 3120418, -538840, -10986746, -6965958, -1022706, 1255362, 5074108, -608314, -4216360, 352504, -1319296, -9765412, -956250, 1821400, -7909896, 431146, 738836, 271124, -7654778, -13664734, -1592844, 3042234, 3327470, -1087908, -12571950, -13302362, -11154834, 79768, -2636202, -5576222, 10945010, 1044116, -7139708, -5227720, -3223124, -7999174, -15712904, -7262556, -4507186, 5563628, -5279674, -9389450, -16365730, -7721520, -1563910, -2509428, 758022, 2264074, 3906972, 5184198, 11376772, -1746776, -3927434, 2998038, -5494260, -869600, -5165100, -630312]
8139 E71916a183776C426892D765480G686426H316698A259350E785964D28878h738528
8129 g678712c597030i094434g202986f228670a474568f828484g613694C001504A92790
8119 F011336G91674c210942D498480A8046056A2736926A3440134G037596f304604a752870
8109 E653890A108676a518394a72100C900522A53438f27424F388628E760650A509220a770166
8098 e587862a689066D134336i330066h499042D713640C425380e197518c089576h436682
8088 e506712a667580b950072B147370C780956d887902b522568b149184g319024i54756
8078 D124990G833052A820684A521450E786080B472774c157524a6878060D60864F684348
8068 B759720B540632E173016a0107332b242430d930958D369400C115332c655826H328266
$$ y = [571916, -1183776, 3426892, 4765480, 7686426, 8316698, 1259350, 5785964, 428878, -8738528, -7678712, -3597030, -9094434, -7202986, -6228670, -1474568, -6828484, -7613694, 3001504, 192790, 6011336, 791674, -3210942, 4498480, 18046056, 12736926, 13440134, 7037596, -6304604, -1752870, 5653890, 1108676, -1518394, -172100, 3900522, 153438, -627424, 6388628, 5760650, 1509220, -1770166, -5587862, -1689066, 4134336, -9330066, -8499042, 4713640, 3425380, -5197518, -3089576, -8436682, -5506712, -1667580, -2950072, 2147370, 3780956, -4887902, -2522568, -2149184, -7319024, -954756, 4124990, 7833052, 1820684, 1521450, 5786080, 2472774, -3157524, -16878060, 460864, 6684348, 2759720, 2540632, 5173016, -10107332, -2242430, -4930958, 4369400, 3115332, -3655826, 8328266]
8058 a342658A0555324A5077928I845874F598842E776894H026858H442000F795608C187992
8048 I632390D706836e417258e866562i801090G21592b504842c908560D913284e11894
8038 H092700A6194174A2585842A0115524d17350A580646C476464D159544A4399060H788840
8028 F043212g698706c461928b295978b080496G396618F690536a350720c259824A590326
8018 E234756F165812G273558C556880h759028d312952a2171060h420066d324884G978498
8008 F805026G758076F71652B879412C728948D041668d405388a030496c158886E938722
7998 c302656b557766e137058a2915858g768938C469840a538016h220514g496438a52810
7988 F57202h319056d98314D196008d013262a2925774e79060f019668d859294a820934
$$ y = [-1342658, 10555324, 15077928, 9845874, 6598842, 5776894, 8026858, 8442000, 6795608, 3187992, 9632390, 4706836, -5417258, -5866562, -9801090, 721592, -2504842, -3908560, 4913284, -511894, 8092700, 16194174, 12585842, 10115524, -417350, 1580646, 3476464, 4159544, 14399060, 8788840, 6043212, -7698706, -3461928, -2295978, -2080496, 7396618, 6690536, -1350720, -3259824, 1590326, 5234756, 6165812, 7273558, 3556880, -8759028, -4312952, -12171060, -8420066, -4324884, 7978498, 6805026, 7758076, 671652, 2879412, 3728948, 4041668, -4405388, -1030496, -3158886, 5938722, -3302656, -2557766, -5137058, -12915858, -7768938, 3469840, -1538016, -8220514, -7496438, -152810, 657202, -8319056, -498314, 4196008, -4013262, -12925774, -579060, -6019668, -4859294, -1820934]
7978 h184314f809732d533632E389932g894558a0039144f947876f612902f946908g057724
7968 a0954330D491640F312622C706752A155434H52074G735124C975226E192556b913766
7958 B417138B972394i313874a415072c389774B397248h854056a135738d647934a1475568
7948 i832768e960858e738996a981714D093314B314356b756000g936282g407720c614412
7938 e44926c989296c005748g36308c730828b00762C14152h580844a2900896f271852a193080
7927 b995888c760086c042958D726442I559880D789204a434484e275140d917760D674818
7917 g6654H909616C754660a42736h5762b471282A0767178A4737896A2644512C567438
7907 g666664e019754e931710h471938h029474a3880356a0096072a5873716b0947630i780922
$$ y = [-8184314, -6809732, -4533632, 5389932, -7894558, -10039144, -6947876, -6612902, -6946908, -7057724, -10954330, 4491640, 6312622, 3706752, 1155434, 852074, 7735124, 3975226, 5192556, -2913766, 2417138, 2972394, -9313874, -1415072, -3389774, 2397248, -8854056, -1135738, -4647934, -11475568, -9832768, -5960858, -5738996, -1981714, 4093314, 2314356, -2756000, -7936282, -7407720, -3614412, -544926, -3989296, -3005748, -736308, -3730828, -200762, 314152, -8580844, -12900896, -6271852, -1193080, -2995888, -3760086, -3042958, 4726442, 9559880, 4789204, -1434484, -5275140, -4917760, 4674818, -76654, 8909616, 3754660, -142736, -85762, -2471282, 10767178, 14737896, 12644512, 3567438, -7666664, -5019754, -5931710, -8471938, -8029474, -13880356, -10096072, -15873716, -20947630, -9780922]
7897 b145582C567086e534980B793368f750992b123628A4451342H689346c621260E226290
7887 b692446C521498i334732e995720a745812c722484I094232A3776390B140266A052260
7877 G410730C041898e13416A044266a0094486a6779902a5814584i734538d656336a378774
7867 A426294E542016B905220c45972g683396a2620032a2917402a451640a357136C419378
7857 e408502h315212a7871046d949000C158588e490066h819562A890398g558738a3009828
7847 b585476b050180h713360a0018372a0987802a0088670a546962e433074g484592B058614
7837 e566726a861018d540720i551640g930586a011026d19474i7700a94978B252280B37154
7826 f111872a391534d330016D98928B195022a0015246i183362b666190G707588A819242
$$ y = [-2145582, 3567086, -5534980, 2793368, -6750992, -2123628, 14451342, 8689346, -3621260, 5226290, -2692446, 3521498, -9334732, -5995720, -1745812, -3722484, 9094232, 13776390, 2140266, 1052260, 7410730, 3041898, -513416, 1044266, -10094486, -16779902, -15814584, -9734538, -4656336, -1378774, 1426294, 5542016, 2905220, -345972, -7683396, -12620032, -12917402, -1451640, -1357136, 3419378, -5408502, -8315212, -17871046, -4949000, 3158588, -5490066, -8819562, 1890398, -7558738, -13009828, -2585476, -2050180, -8713360, -10018372, -10987802, -10088670, -1546962, -5433074, -7484592, 2058614, -5566726, -1861018, -4540720, -9551640, -7930586, -1011026, -419474, -97700, -194978, 2252280, 237154, -6111872, -1391534, -4330016, 498928, 2195022, -10015246, -9183362, -2666190, 7707588, 1819242]
7816 B324156A0834794B404030g263924A321024C707708I933456G386110C606298D881430
7806 G322540c831666d524772h378940c948106a882460B94750C176382B319884D186006
7796 H856904a208750g988334g355892A1543660F601536E674428A1181298A1077716H565660
7786 A602742f047524i11580b005702B949254F744634b496330f775574d481994A3793234
7776 A3065322D433166B591328C756934D414724h47116a604928d968886A050586a01902
7766 C449598B298808B879598E768324A0864182d866334f056104a1054656a0058028a0107932
7756 d885444g57086c067110d347438c069002B607270c790582g404698a747130a1062590
7746 D97456c875942a1518200c067874c36380G442902E147742h40094B431390b528616
$$ y = [2324156, 10834794, 2404030, -7263924, 1321024, 3707708, 9933456, 7386110, 3606298, 4881430, 7322540, -3831666, -4524772, -8378940, -3948106, -1882460, 294750, 3176382, 2319884, 4186006, 8856904, -1208750, -7988334, -7355892, 11543660, 6601536, 5674428, 11181298, 11077716, 8565660, 1602742, -6047524, -911580, -2005702, 2949254, 6744634, -2496330, -6775574, -4481994, 13793234, 13065322, 4433166, 2591328, 3756934, 4414724, -847116, -1604928, -4968886, 1050586, -101902, 3449598, 2298808, 2879598, 5768324, 10864182, -4866334, -6056104, -11054656, -10058028, -10107932, -4885444, -757086, -3067110, -4347438, -3069002, 2607270, -3790582, -7404698, -1747130, -11062590, 497456, -3875942, -11518200, -3067874, -336380, 7442902, 5147742, -840094, 2431390, -2528616]
7736 d540594b984498A759512a425256b222980E73094g583472f492460d169148a2828478
7726 a211662E419674C232380E523784C646110I68952c3304g353278A895266A324232A226190
7715 b505914e665800h434110G345702I63704a0447956c307514b878406g964980a0480568
7705 b11856E433042A609344b764996B667132G830656E90206B480448b662142d095616f02706
7694 E351592E775144H693896C249166C123740F10544f482610b55466F7722h701548a2360106
7683 a372984a144122c872258b395454d016400b860764F056610c001846H532274C263722
7673 A98722B648432F365624a433262g58452h657704i831080a2556624a5996862a0970468
7663 g335864g829960h930678e036950g533168a2269890e606242d081852B923966h388786
$$ y = [-4540594, -2984498, 1759512, -1425256, -2222980, 573094, -7583472, -6492460, -4169148, -12828478, -1211662, 5419674, 3232380, 5523784, 3646110, 968952, -33304, -7353278, 1895266, 1324232, 1226190, -2505914, -5665800, -8434110, 7345702, 963704, -10447956, -3307514, -2878406, -7964980, -10480568, -211856, 5433042, 1609344, -2764996, 2667132, 7830656, 590206, 2480448, -2662142, -4095616, -602706, 5351592, 5775144, 8693896, 3249166, 3123740, 610544, -6482610, -255466, 67722, -8701548, -12360106, -1372984, -1144122, -3872258, -2395454, -4016400, -2860764, 6056610, -3001846, 8532274, 3263722, 198722, 2648432, 6365624, -1433262, -758452, -8657704, -9831080, -12556624, -15996862, -10970468, -7335864, -7829960, -8930678, -5036950, -7533168, -12269890, -5606242, -4081852, 2923966, -8388786]
7653 b342278e473370e182040B402840f356902g991686B926300I50232a9050848a1307112
7643 a0275734f704478C218938A844772a2359440f074104c095648e685552B190762d676444
7633 i852116e84238h4548D616256B854204e338008e20300a616136D139682H264010h35086
7622 h933688a008104f550872a015522e426140a385746A203974a0759136c476454G057890
7612 c971102e821196A448872B513358F540712e517430a8146122g221926b150056b951682
7602 b479044b778140e074766e61440b333150d39308f253888b573174B611982F090178
7592 A2087350C836024a131452D899004A430070e74254b927362a1003614a0476474c003774
7582 b810644B648150D048516e623478f023884h105676g419700b125914b657434E28912
$$ y = [-2342278, -5473370, -5182040, 2402840, -6356902, -7991686, 2926300, 950232, -19050848, -11307112, -10275734, -6704478, 3218938, 1844772, -12359440, -6074104, -3095648, -5685552, 2190762, -4676444, -9852116, -584238, -84548, 4616256, 2854204, -5338008, -520300, -1616136, 4139682, 8264010, -835086, -8933688, -1008104, -6550872, -1015522, -5426140, -1385746, 1203974, -10759136, -3476454, 7057890, -3971102, -5821196, 1448872, 2513358, 6540712, -5517430, -18146122, -7221926, -2150056, -2951682, -2479044, -2778140, -5074766, -561440, -2333150, -439308, -6253888, -2573174, 2611982, 6090178, 12087350, 3836024, -1131452, 4899004, 1430070, -574254, -2927362, -11003614, -10476474, -3003774, -2810644, 2648150, 4048516, -5623478, -6023884, -8105676, -7419700, -2125914, -2657434, 528912]
7572 c66892g131370h909732e906958a758106e127316H044544A0697108E873964a1715762
7562 a3306730A734128a491030e316176f839440c599966C403938b268260d809658h718006
7552 a2013094b618258i271722i321670d689144f726198e146150g493286D253452B784712
7542 i80140A24408b216064B246436H394630H830578H401662A0928254A3885942F086216
7532 A1863048I099766A070046b251786h92072g452494e326538f627714D444800C357704
7522 h261024g912754f809784a200978c593952a4201650e899342A439108E014982G856926
7512 A3476054A4275172G072598g47986b215570b276084C108124A1488708E2088b941136
7502 C641670b987518a1654886c063874e005298a0549354a358982C302668C070718D525730
$$ y = [-366892, -7131370, -8909732, -5906958, -1758106, -5127316, 8044544, 10697108, 5873964, -11715762, -13306730, 1734128, -1491030, -5316176, -6839440, -3599966, 3403938, -2268260, -4809658, -8718006, -12013094, -2618258, -9271722, -9321670, -4689144, -6726198, -5146150, -7493286, 4253452, 2784712, -980140, 124408, -2216064, 2246436, 8394630, 8830578, 8401662, 10928254, 13885942, 6086216, 11863048, 9099766, 1070046, -2251786, -892072, -7452494, -5326538, -6627714, 4444800, 3357704, -8261024, -7912754, -6809784, -1200978, -3593952, -14201650, -5899342, 1439108, 5014982, 7856926, 13476054, 14275172, 7072598, -747986, -2215570, -2276084, 3108124, 11488708, 52088, -2941136, 3641670, -2987518, -11654886, -3063874, -5005298, -10549354, -1358982, 3302668, 3070718, 4525730]
7492 D317580d190456g478810a08364G071696H8750f634410a730876B372394e656874d155336
7481 b194904a4503438a537500A072088d26574c735096a0702614g431016D375788e829286
7471 C021048c693954c701182I035734D135480B521698B636394f096194C957124C775280
7461 g425452d687456a5282132a4404792a27542C741650h747766g090432E51068i15866
7451 H41178E74402D502840d989580b752888f008754f638470c722412B463296A494814g5356
7440 E74304E91760F828196e430270h366096H54078E551328a0503842B282396d228248
7430 B596520c390130a4585838h67756d24916c332644f986224h9820h392618a1193736
7420 e914266A971282b059396B895834d692398e212224a345338d29216d871244D595880
$$ y = [4317580, -4190456, -7478810, -108364, 7071696, 88750, -6634410, -1730876, 2372394, -5656874, -4155336, -2194904, -14503438, -1537500, 1072088, -426574, -3735096, -10702614, -7431016, 4375788, -5829286, 3021048, -3693954, -3701182, 9035734, 4135480, 2521698, 2636394, -6096194, 3957124, 3775280, -7425452, -4687456, -15282132, -14404792, -127542, 3741650, -8747766, -7090432, 551068, -915866, 841178, 574402, 4502840, -4989580, -2752888, -6008754, -6638470, -3722412, 2463296, 1494814, -75356, 574304, 591760, 6828196, -5430270, -8366096, 854078, 5551328, -10503842, 2282396, -4228248, 2596520, -3390130, -14585838, -867756, -424916, -3332644, -6986224, -89820, -8392618, -11193736, -5914266, 1971282, -2059396, 2895834, -4692398, -5212224, -1345338, -429216, -4871244, 4595880]
7410 C685330b755744B283600B215956E421994A757954F748444g650882h804036e99128
7400 g15588a0138366f028094f441042a4347810g650090a6193640c802556b014082a94234
7390 f895822e203216e119662f412218a109346e772636d422262d050076c339920e613832
7380 i42978f91932a357408h052028B460416E941572B68434h815146c875014a694060a006112
7369 c906284G566672B085820D145850e55830B98102f179478B91742b815364f430966g61356
7358 C102874A114754B826730A792060H142582c770906i262174b356258h82140f492626
7348 G66092A339802B96432g779404h195664F82018E649310a0187604a210582A929544
7338 a302546a27314c138214i541416c663368g095708g99998C196898i01196F001116
$$ y = [3685330, -2755744, 2283600, 2215956, 5421994, 1757954, 6748444, -7650882, -8804036, -599128, -715588, -10138366, -6028094, -6441042, -14347810, -7650090, -16193640, -3802556, -2014082, -194234, -6895822, -5203216, -5119662, -6412218, -1109346, -5772636, -4422262, -4050076, -3339920, -5613832, -942978, -691932, -1357408, -8052028, 2460416, 5941572, 268434, -8815146, -3875014, -1694060, -1006112, -3906284, 7566672, 2085820, 4145850, -555830, 298102, -6179478, 291742, -2815364, -6430966, -761356, 3102874, 1114754, 2826730, 1792060, 8142582, -3770906, -9262174, -2356258, -882140, -6492626, 766092, 1339802, 296432, -7779404, -8195664, 682018, 5649310, -10187604, -1210582, 1929544, -1302546, -127314, -3138214, -9541416, -3663368, -7095708, -799998, 3196898, -901196, 6001116]
7328 A0787190E643552A2021754A4635994F128598E813158C561272b511940A492624A2680854
7318 A5912660A9524004H526496b695958f00070E414686H213420H072712E904540B810440
7308 b171618A81748B188566f344230h446100C508552a696268B910432H260322H511910
7298 a174398g799334a0038512c686066d819550b695992e118034a9149764b3192500f933806
7288 e798578b757064c385344a7695336a3856084f558440a437910c450408B873030I683364
7278 A1631682D488902I8986F863598H779828b625172C477094E074494E140154f31282
7268 A981102A2325358a354854g894180a2561842c517338D473350A989450b45694D659770
7258 a41924G053882A0717252B762624E8160E395018d00438h741412a5024204h675630
$$ y = [10787190, 5643552, 12021754, 14635994, 6128598, 5813158, 3561272, -2511940, 1492624, 12680854, 15912660, 19524004, 8526496, -2695958, -600070, 5414686, 8213420, 8072712, 5904540, 2810440, -2171618, 181748, 2188566, -6344230, -8446100, 3508552, -1696268, 2910432, 8260322, 8511910, -1174398, -7799334, -10038512, -3686066, -4819550, -2695992, -5118034, -19149764, -23192500, -6933806, -5798578, -2757064, -3385344, -17695336, -13856084, -6558440, -1437910, -3450408, 2873030, 9683364, 11631682, 4488902, 98986, 6863598, 8779828, -2625172, 3477094, 5074494, 5140154, -631282, 1981102, 12325358, -1354854, -7894180, -12561842, -3517338, 4473350, 1989450, -245694, 4659770, -141924, 7053882, 10717252, 2762624, 58160, 5395018, -400438, -8741412, -15024204, -8675630]
7248 g310938f244642c78646B298890H055964g046424a306858i932200a170742b616330
7238 C97600D010538D405970A2704114E712040D04456D565694D399492C003206a376946
7228 e23084c809944a3128080a3341738b976122d006926c040926G190122e480956A054042
7218 C093242B354008b61002a304948h093280h103260a0994982a1714380d156002b752448
7208 e766804a2315502B08370i857822a0012090b0734118a6444740b434128a2738168
7199 a7430214i503990A846394A400004h76390d110770e630992C100638A2546912B85162
7189 a1892462f86522a531700e97456b404150d477186D274950F896676i08536e137478
7179 d638158g803274D651672E368728A2129360E574654F189064A955664g157788a856604
$$ y = [-7310938, -6244642, -378646, 2298890, 8055964, -7046424, -1306858, -9932200, -1170742, -2616330, 397600, 4010538, 4405970, 12704114, 5712040, 404456, 4565694, 4399492, 3003206, -1376946, -523084, -3809944, -13128080, -13341738, -2976122, -4006926, -3040926, 7190122, -5480956, 1054042, 3093242, 2354008, -261002, -1304948, -8093280, -8103260, -10994982, -11714380, -4156002, -2752448, -5766804, -12315502, 208370, -9857822, -10012090, -20734118, -16444740, -2434128, -12738168, -17430214, -9503990, 1846394, 1400004, -876390, -4110770, -5630992, 3100638, 12546912, 285162, -11892462, -686522, -1531700, -597456, -2404150, -4477186, 4274950, 6896676, -908536, -5137478, -4638158, -7803274, 4651672, 5368728, 12129360, 5574654, 6189064, 1955664, -7157788, -1856604]
7169 f31494C797606B580260c048532f859742C5762F327796A1481020A7723328H969198
7159 a377422f096076d036190a225550A08688G549614A6559362A4020274C09144a0469040
7149 h554906a139400b746798c122294A213350f811790c609434E062110c26732d937344
7139 B401372C92850I932484D455226A580184G155700D877952H454574b041170e89510
7129 F576578D570674E486518C049536h250276b615006c677912i962756b788666a206050
7119 A235932e615564a0324424e39550c436994E514570d635234h350116C004750c758446
7109 f828974g509242a738650d979966a0094996c419704G793622A719804B241480D885656
7099 C756536b596268b465982E01492H118986A9533790B517352b935942B336538c967850
$$ y = [-631494, 3797606, 2580260, -3048532, -6859742, 35762, 6327796, 11481020, 17723328, 8969198, -1377422, -6096076, -4036190, -1225550, 108688, 7549614, 16559362, 14020274, 309144, -10469040, -8554906, -1139400, -2746798, -3122294, 1213350, -6811790, -3609434, 5062110, -326732, -4937344, 2401372, 392850, 9932484, 4455226, 1580184, 7155700, 4877952, 8454574, -2041170, -589510, 6576578, 4570674, 5486518, 3049536, -8250276, -2615006, -3677912, -9962756, -2788666, -1206050, 1235932, -5615564, -10324424, -539550, -3436994, 5514570, -4635234, -8350116, 3004750, -3758446, -6828974, -7509242, -1738650, -4979966, -10094996, -3419704, 7793622, 1719804, 2241480, 4885656, 3756536, -2596268, -2465982, 501492, 8118986, 19533790, 2517352, -2935942, 2336538, -3967850]
7089 c025128c285788i974986a2494634H588948A0629342A1049908B547186f501162I09762
7079 B328256b175338f483888d621558E922952a33334g849002g614930d382394b270958
7069 d018576e346364a2113508e253588i633330e244964h837600d769816c580548D477542
7059 C685598b66898D726070F803656H686482A4577300G15140g244040c773688f309614
7049 b905594h846014e591228a983096a0170122E444790b123940d862446g249586g60390
7039 H48430G986854D965544B197282f849934i420182e318800B784370i393224B401328
7029 a405400h185312a418722b461262I7768D207194B672446c984864e316616i49556I601820
7018 G617588d038824g041266e624036c470024a1907462a6057552c667268d002710f171824
$$ y = [-3025128, -3285788, -9974986, -12494634, 8588948, 10629342, 11049908, 2547186, -6501162, 909762, 2328256, -2175338, -6483888, -4621558, 5922952, -133334, -7849002, -7614930, -4382394, -2270958, -4018576, -5346364, -12113508, -5253588, -9633330, -5244964, -8837600, -4769816, -3580548, 4477542, 3685598, -266898, 4726070, 6803656, 8686482, 14577300, 715140, -7244040, -3773688, -6309614, -2905594, -8846014, -5591228, -1983096, -10170122, 5444790, -2123940, -4862446, -7249586, -760390, 848430, 7986854, 4965544, 2197282, -6849934, -9420182, -5318800, 2784370, -9393224, 2401328, -1405400, -8185312, -1418722, -2461262, 97768, 4207194, 2672446, -3984864, -5316616, -949556, 9601820, 7617588, -4038824, -7041266, -5624036, -3470024, -11907462, -16057552, -3667268, -4002710, -6171824]
7008 A282912A424390a2079742a0298254e092522c820716A906768H736528a20472c380160
6998 d88114G26198c560706D612632G288712c495516B476510D566704a1667010f006662
6988 e591800b486448b41096b991590g999282i61656E5676B729456D10490a242298E189342
6977 B969428a42840e253784A305676C402870D282064c701518d059366A0291138b779924
6967 e793782c233412g020894a1766518f21070E023078C367512A254272B691608a53920
6957 d295202G37034C017370E558384C209076B366598G051816b081666c123440a0366716
6947 i856570h868784a1555802a3567900a9776328a3904738I87264a1488302a1457736
6938 B748976A962534a01842C200298D884074A72398g235958d862966g296858C164430
$$ y = [1282912, 1424390, -12079742, -10298254, -5092522, -3820716, 1906768, 8736528, -120472, -3380160, -488114, 726198, -3560706, 4612632, 7288712, -3495516, 2476510, 4566704, -11667010, -6006662, -5591800, -2486448, -241096, -2991590, -7999282, -961656, 55676, 2729456, 410490, -1242298, 5189342, 2969428, -142840, -5253784, 1305676, 3402870, 4282064, -3701518, -4059366, 10291138, -2779924, -5793782, -3233412, -7020894, -11766518, -621070, 5023078, 3367512, 1254272, 2691608, -153920, -4295202, 737034, 3017370, 5558384, 3209076, 2366598, 7051816, -2081666, -3123440, -10366716, -9856570, -8868784, -11555802, -13567900, -19776328, -13904738, 987264, -11488302, -11457736, 2748976, 1962534, -101842, 3200298, 4884074, 172398, -7235958, -4862966, -7296858, 3164430]
6928 G892124h19372d562260e379080g630134e647030a0762318a642682A1842078A3787030
6918 f0826a725150b335930c685286e574358C374108b81360C909022C579096D246744F659460
6907 H589694C401840D506190A297166c095430a3909538f214662c174810d200470e036694
6897 A181716e465928h668960E006034C488962E654036D068476a167448d426594c683728
6887 G71800A292190d754866g658836g505654b598444g292462e122604f021070C846298
6877 C637416E826572A527690a400622g414354a0236552c401360g275224f75674f291508
6867 d315136f092036a4721324d435770e46608f991316d11598c617922B729960E626028
6857 D416616C990416A2695180A315862f82244b100402d094328b083182f263886c523844
$$ y = [7892124, -819372, -4562260, -5379080, -7630134, -5647030, -10762318, -1642682, 11842078, 13787030, -60826, -1725150, -2335930, -3685286, -5574358, 3374108, -281360, 3909022, 3579096, 4246744, 6659460, 8589694, 3401840, 4506190, 1297166, -3095430, -13909538, -6214662, -3174810, -4200470, -5036694, 1181716, -5465928, -8668960, 5006034, 3488962, 5654036, 4068476, -1167448, -4426594, -3683728, 771800, 1292190, -4754866, -7658836, -7505654, -2598444, -7292462, -5122604, -6021070, 3846298, 3637416, 5826572, 1527690, -1400622, -7414354, -10236552, -3401360, -7275224, -675674, -6291508, -4315136, -6092036, -14721324, -4435770, -546608, -6991316, -411598, -3617922, 2729960, 5626028, 4416616, 3990416, 12695180, 1315862, -682244, -2100402, -4094328, -2083182, -6263886, -3523844]
6847 B630154C097848g013352h854042a442804A488196a0837320E45558B591674b373618
6837 E710598G959320a083494E307868C861810i87874E138144B778526A764998I89794B11542
6826 a551508b850744c57592B46244F376554A1874182B3298386I214888D679174A3135534
6816 C076830b475078A883904e472106a976726a697520f340190F7628b32484a525114g820242
6805 B461490c067050F377112c411388h805210e619254d802340c02302A972096G739234
6795 A61892a55974a371306c367890A596696H895358D901158a015576d819470f587254
6785 C969324B585544e177518d623180f272888i722382g178568e167756g640088c136940
6775 a061052A489958h236124b095458a602926c807452E225888D48100c33060c38376g395210
$$ y = [2630154, 3097848, -7013352, -8854042, -1442804, 1488196, -10837320, 545558, 2591674, -2373618, 5710598, 7959320, -1083494, 5307868, 3861810, -987874, 5138144, 2778526, 1764998, 989794, 211542, -1551508, -2850744, -357592, 246244, 6376554, 11874182, 23298386, 9214888, 4679174, 13135534, 3076830, -2475078, 1883904, -5472106, -1976726, -1697520, -6340190, 67628, -232484, -1525114, -7820242, 2461490, -3067050, 6377112, -3411388, -8805210, -5619254, -4802340, -302302, 1972096, 7739234, 161892, -155974, -1371306, -3367890, 1596696, 8895358, 4901158, -1015576, -4819470, -6587254, 3969324, 2585544, -5177518, -4623180, -6272888, -9722382, -7178568, -5167756, -7640088, -3136940, -1061052, 1489958, -8236124, -2095458, -1602926, -3807452, 5225888, 448100, -333060, -338376, -7395210]
6764 B436022B392976C450446A557370C772132D894718C260662g19992D028514C885534
6754 A762198h39740E604030h222674C652394A0034332H533394B36490b726164i358768
6744 d516848d7294b968624e584114g341376F980900A1771164E018986H978948G159346
6734 H51276d99854B60924A897948F759266D567646c085574A820214F533588E045804A557518
6723 g357224f275604h851776c857858a341044a821240g098338i402632F8526C619650
6713 b293794A781908a320910B402446F936604c754792a0236018e778132c938350c608794
6703 c106486g188720h570376i82518A0921024F022080b854392d115062D573474C839228
6693 C223934c165650a0184246b176172d5412E223764H369172A0440130H358032B267214
$$ y = [2436022, 2392976, 3450446, 1557370, 3772132, 4894718, 3260662, -719992, 4028514, 3885534, 1762198, -839740, 5604030, -8222674, 3652394, 10034332, 8533394, 236490, -2726164, -9358768, -4516848, -47294, -2968624, -5584114, -7341376, 6980900, 11771164, 5018986, 8978948, 7159346, 851276, -499854, 260924, 1897948, 6759266, 4567646, -3085574, 1820214, 6533588, 5045804, 1557518, -7357224, -6275604, -8851776, -3857858, -1341044, -1821240, -7098338, -9402632, 68526, 3619650, -2293794, 1781908, -1320910, 2402446, 6936604, -3754792, -10236018, -5778132, -3938350, -3608794, -3106486, -7188720, -8570376, -982518, 10921024, 6022080, -2854392, -4115062, 4573474, 3839228, 3223934, -3165650, -10184246, -2176172, -45412, 5223764, 8369172, 10440130, 8358032, 2267214]
6683 B318968d207116f006908a280634F02756g486242A376506G996342F049284d793502
6673 I23506E468286C443302E292834f207556B906414a775016d072948A683566F197630
6663 A2783386A7916128C631240C299274A0375506a049796c332880A481668C596480H560330
6653 E988722G985228A691216A848216B585434G969622A3720152A4323794F932518e96926
6643 a928634f611758e595016b675152I268532E259116I70336h59656a5069024i444304
6633 e116320i740266f598226a0160288h019876a941728a200484B739980B135138d693532
6623 b602090E248882H044772g185946e663324A611952C465272A819530C540018a621374
6613 e542534c650762A1205506E403360B718318D509906b008700A223248A170466G05494
$$ y = [2318968, -4207116, -6006908, -1280634, 602756, -7486242, 1376506, 7996342, 6049284, -4793502, 923506, 5468286, 3443302, 5292834, -6207556, 2906414, -1775016, -4072948, 1683566, 6197630, 12783386, 17916128, 3631240, 3299274, 10375506, -1049796, -3332880, 1481668, 3596480, 8560330, 5988722, 7985228, 1691216, 1848216, 2585434, 7969622, 13720152, 14323794, 6932518, -596926, -1928634, -6611758, -5595016, -2675152, 9268532, 5259116, 970336, -859656, -15069024, -9444304, -5116320, -9740266, -6598226, -10160288, -8019876, -1941728, -1200484, 2739980, 2135138, -4693532, -2602090, 5248882, 8044772, -7185946, -5663324, 1611952, 3465272, 1819530, 3540018, -1621374, -5542534, -3650762, 11205506, 5403360, 2718318, 4509906, -2008700, 1223248, 1170466, 705494]
6603 H875318d673078a503298g882798h495544b070140a754414b528316i564094a0567982
6593 e263126d398068i75736C28164A490472A840106B791880a440010a940746i41064C027584
6582 d4184C385444d141552a228068a411486a2722028d429830h81730i827128a1206768
6572 h664804I297126D124778E029230B136336g573174h239436e370260E923300B57918
6562 a573808b024912B731882B885318A29926D583750i359922h895262a4444730a6728950
6552 e551192A933624f992806a174584A4508402C481892b581408e816464a1956268a619522
6542 a8694a1124760a1954286c639558i359856h391800c843528c8658b984604h46532C246402
6531 a6497772f878194b085302b166754a408964d412782a792970a161532b41096c41724
$$ y = [8875318, -4673078, -1503298, -7882798, -8495544, -2070140, -1754414, -2528316, -9564094, -10567982, -5263126, -4398068, -975736, 328164, 1490472, 1840106, 2791880, -1440010, -1940746, -941064, 3027584, -44184, 3385444, -4141552, -1228068, -1411486, -12722028, -4429830, -881730, -9827128, -11206768, -8664804, 9297126, 4124778, 5029230, 2136336, -7573174, -8239436, -5370260, 5923300, 257918, -1573808, -2024912, 2731882, 2885318, 129926, 4583750, -9359922, -8895262, -14444730, -16728950, -5551192, 1933624, -6992806, -1174584, 14508402, 3481892, -2581408, -5816464, -11956268, -1619522, -18694, -11124760, -11954286, -3639558, -9359856, -8391800, -3843528, -38658, -2984604, -846532, 3246402, -16497772, -6878194, -2085302, -2166754, -1408964, -4412782, -1792970, -1161532, -241096, -341724]
6521 H129950b868146B958240H134218D287928c926872g369510g427650a1802876a2093772
6511 a641640a653752a594818A232666B024686a2961684a0711144H409384G502222G840898
6501 a2853932e376974d770096d173956a2759972D703848G652422A700516c353300A0032668
6491 C602204e732894a6127206f701506b76528f997626e697492h54304D287814H418762
6481 b040646D427678A893700c59368e621826D70292A297030B099162c191580C931764
6471 D551826c642122F448274A3202068D780548a834510A955470A001052D069948I755502
6461 A0159470E918422A5766278A9356008C979304a03022A883102D597980A0949814H139732
6451 d975046F349018G00262f729512d152602e247030g077432c644096f820328D216376
$$ y = [8129950, -2868146, 2958240, 8134218, 4287928, -3926872, -7369510, -7427650, -11802876, -12093772, -1641640, -1653752, -1594818, 1232666, 2024686, -12961684, -10711144, 8409384, 7502222, 7840898, -12853932, -5376974, -4770096, -4173956, -12759972, 4703848, 7652422, 1700516, -3353300, 10032668, 3602204, -5732894, -16127206, -6701506, -276528, -6997626, -5697492, -854304, 4287814, 8418762, -2040646, 4427678, 1893700, -359368, -5621826, 470292, 1297030, 2099162, -3191580, 3931764, 4551826, -3642122, 6448274, 13202068, 4780548, -1834510, 1955470, 1001052, 4069948, 9755502, 10159470, 5918422, 15766278, 19356008, 3979304, -103022, 1883102, 4597980, 10949814, 8139732, -4975046, 6349018, 700262, -6729512, -4152602, -5247030, -7077432, -3644096, -6820328, 4216376]
6441 e220390g240624F240558A044262d925260g639050d805076d271828A952412G795590
6431 a802234b55738D027654a445446b651726A004794B536376E648022a0840558b553948
6421 a030698c02270a078112A746522B333348g520454b583948d456648F744964i7596f68080
6410 B994250b163474b361364A445462e653378a0716468A866352c556362f366850d074086
6400 c513878i30162a0115192A386078D255784b573748d644942i96e390396a5008952
6390 a3215752d298840B376650B4410c374928c2714g95148f172334d180752D169754A729756
6379 g566598d653510e311994b066330i496270a309502D481184B94600e028194g603832
6369 B485274f835648A183538d229388i402296h20874B831764g52870C613932E5290a614698
$$ y = [-5220390, -7240624, 6240558, 1044262, -4925260, -7639050, -4805076, -4271828, 1952412, 7795590, -1802234, -255738, 4027654, -1445446, -2651726, 1004794, 2536376, 5648022, -10840558, -2553948, -1030698, -302270, -1078112, 1746522, 2333348, -7520454, -2583948, -4456648, 6744964, -97596, -668080, 2994250, -2163474, -2361364, 1445462, -5653378, -10716468, 1866352, -3556362, -6366850, -4074086, -3513878, -930162, -10115192, 1386078, 4255784, -2573748, -4644942, -996, -5390396, -15008952, -13215752, -4298840, 2376650, 24410, -3374928, -32714, -795148, -6172334, -4180752, 4169754, 1729756, -7566598, -4653510, -5311994, -2066330, -9496270, -1309502, 4481184, 294600, -5028194, -7603832, 2485274, -6835648, 1183538, -4229388, -9402296, -820874, 2831764, -752870, 3613932, 55290, -1614698]
6358 a292616c729994b989418C812804c718630d979506a2928020c285734c416324I31164
6348 i404148a4749708c591856E53370E434342E011400D151566D86504a234258d3484B68138
6337 G086044E732118A326250H643414A1011118C677232A0270258E458924g107942i047582
6327 F687752D19410C882922e770992G859528A0581844E891366C410148C470268d686090
6317 D703136D911836A643252E79896A0366124g344120e539410a625492b893232c28624
6307 C252538B609308I853134B78378E962366a420142i895204a5499426a6046896a6814352
6297 a6065538b015662i053476h478978c194974h5584b008012b149114g301696i574428
6287 e333578c57558a106806b303308b265250e73150D381058G702214H735352f433318
$$ y = [-1292616, -3729994, -2989418, 3812804, -3718630, -4979506, -12928020, -3285734, -3416324, 931164, -9404148, -14749708, -3591856, 553370, 5434342, 5011400, 4151566, 486504, -1234258, -43484, 268138, 7086044, 5732118, 1326250, 8643414, 11011118, 3677232, 10270258, 5458924, -7107942, -9047582, 6687752, 419410, 3882922, -5770992, 7859528, 10581844, 5891366, 3410148, 3470268, -4686090, 4703136, 4911836, 1643252, 579896, 10366124, -7344120, -5539410, -1625492, -2893232, -328624, 3252538, 2609308, 9853134, 278378, 5962366, -1420142, -9895204, -15499426, -16046896, -16814352, -16065538, -2015662, -9053476, -8478978, -3194974, -85584, -2008012, -2149114, -7301696, -9574428, -5333578, -357558, -1106806, -2303308, -2265250, -573150, 4381058, 7702214, 8735352, -6433318]
6277 f541654a586590F666794d383312c189280c561550G942950i07958C999868f94630
6267 D006686c048400f44584A727886A258374F01208c844216h952818e350640e455526
6257 d875328e589166A849400b999084b504452D266508f975328a921188C768040A1758118
6247 D080862c136594E599238C225558A176708e505064i081172b953192a812844A053278
6237 i90560b032256A486356C595240D863966G782104E573608B590136A414096b035432
6227 a4032066d160836b208476B248594g28998D115760b141490a432500a9985674a5817168
6217 b239338A746846F66664G636946A513742B462276a150618E592710A633210b155378
6207 f048930A065948D161130h112012a43082d228734B705848E511926G204510F411510
$$ y = [-6541654, -1586590, 6666794, -4383312, -3189280, -3561550, 7942950, -907958, 3999868, -694630, 4006686, -3048400, -644584, 1727886, 1258374, 601208, -3844216, -8952818, -5350640, -5455526, -4875328, -5589166, 1849400, -2999084, -2504452, 4266508, -6975328, -1921188, 3768040, 11758118, 4080862, -3136594, 5599238, 3225558, 1176708, -5505064, -9081172, -2953192, -1812844, 1053278, -990560, -2032256, 1486356, 3595240, 4863966, 7782104, 5573608, 2590136, 1414096, -2035432, -14032066, -4160836, -2208476, 2248594, -728998, 4115760, -2141490, -1432500, -19985674, -15817168, -2239338, 1746846, 666664, 7636946, 1513742, 2462276, -1150618, 5592710, 1633210, -2155378, -6048930, 1065948, 4161130, -8112012, -143082, -4228734, 2705848, 5511926, 7204510, 6411510]
6197 B797208I380352h7904b791254G116508A1745664B672714a523904h126804g736590
6187 h440302d440710b986594b389414g253668a5551286a1435578a0596338E096002c885702
6177 C555888E454808C14322g281528b419152B668352B965552c152690C188660A3556444
6167 d973024h740504E102640C93760f019178B070192C000508d811498a559254b573506
6157 E074090c384670C050060H94038E80776a693858f521602d340814F735784b634938
6147 C674052e550294c176230D102798B364742D247476a347996a0549740a5375320f150472
6137 d591594B217710f945220F815052c927936i067270b82b038102E38794A012960e096858
6126 a6085474d333170G988060d275644A951620a52134G14192b42130F481588E892146
$$ y = [2797208, 9380352, -87904, -2791254, 7116508, 11745664, 2672714, -1523904, -8126804, -7736590, -8440302, -4440710, -2986594, -2389414, -7253668, -15551286, -11435578, -10596338, 5096002, -3885702, 3555888, 5454808, 314322, -7281528, -2419152, 2668352, 2965552, -3152690, 3188660, 13556444, -4973024, -8740504, 5102640, 393760, -6019178, 2070192, 3000508, -4811498, -1559254, -2573506, 5074090, -3384670, 3050060, 894038, 580776, -1693858, -6521602, -4340814, 6735784, -2634938, 3674052, -5550294, -3176230, 4102798, 2364742, 4247476, -1347996, -10549740, -15375320, -6150472, -4591594, 2217710, -6945220, 6815052, -3927936, -9067270, -282, -2038102, 538794, 1012960, -5096858, -16085474, -4333170, 7988060, -4275644, 1951620, -152134, 714192, -242130, 6481588, 5892146]
6116 G762816A1886024f56916i212722b927406d13742a520234d902552a1472742a0492600
6106 h935346b224608a673302H5256H362248b510130d890726b247124A2138748B307810
6096 f718028f186446C023930E249456H012390A4517676C721928b874000c156586g279498
6086 g662832a0354760f857336c931060e783618b61386A592682F200894A050292a582108
6076 C097244c779244a586200a401828h394374h084286B382816b142070a184986E666556
6066 E100500d165284E72974a79008c311986a0359094h884366a2520258a2218100e081702
6056 F64226b145598c443080d482372b884476f183120h870330a0590680e906464f83214
6046 B289358c794816i270754E888066F194684B320726E431110a948880a0591868h320904
$$ y = [7762816, 11886024, -656916, -9212722, -2927406, -413742, -1520234, -4902552, -11472742, -10492600, -8935346, -2224608, -1673302, 85256, 8362248, -2510130, -4890726, -2247124, 12138748, 2307810, -6718028, -6186446, 3023930, 5249456, 8012390, 14517676, 3721928, -2874000, -3156586, -7279498, -7662832, -10354760, -6857336, -3931060, -5783618, -261386, 1592682, 6200894, 1050292, -1582108, 3097244, -3779244, -1586200, -1401828, -8394374, -8084286, 2382816, -2142070, -1184986, 5666556, 5100500, -4165284, 572974, -179008, -3311986, -10359094, -8884366, -12520258, -12218100, -5081702, 664226, -2145598, -3443080, -4482372, -2884476, -6183120, -8870330, -10590680, -5906464, -683214, 2289358, -3794816, -9270754, 5888066, 6194684, 2320726, 5431110, -1948880, -10591868, -8320904]
6036 g624794f582216B778938f186074f322896a3389702a9611714a0623248f291820i275948
6026 B849598a76282h263570a041034e873926F175090B137186g840844f645416h043584
6016 g799696D4178A6839148A1203824F855624I727856H878000b274346c75574c376856
6006 f479994e317918b282016c254056e381196d539596b373126i117534g012458C124530
5996 I80270A034784b799922D135156e312788a8079820a2790832i808292g953170A840732
5986 c099508f113470a5728708a4800560b690266a627116c47992E41582a140676f222420
5976 f377150d989982g772138a811188e458082C970892a536476f578270A309872g621794
5966 f264696a3648330h919500a2578836a0606694a0994140i098420d908172c755538g688242
$$ y = [-7624794, -6582216, 2778938, -6186074, -6322896, -13389702, -19611714, -10623248, -6291820, -9275948, 2849598, -176282, -8263570, -1041034, -5873926, 6175090, 2137186, -7840844, -6645416, -8043584, -7799696, 44178, 16839148, 11203824, 6855624, 9727856, 8878000, -2274346, -375574, -3376856, -6479994, -5317918, -2282016, -3254056, -5381196, -4539596, -2373126, -9117534, -7012458, 3124530, 980270, 1034784, -2799922, 4135156, -5312788, -18079820, -12790832, -9808292, -7953170, 1840732, -3099508, -6113470, -15728708, -14800560, -2690266, -1627116, -347992, 541582, -1140676, -6222420, -6377150, -4989982, -7772138, -1811188, -5458082, 3970892, -1536476, -6578270, 1309872, -7621794, -6264696, -13648330, -8919500, -12578836, -10606694, -10994140, -9098420, -4908172, -3755538, -7688242]
5956 h315686d109494D578804A069672C362132b027336A202796H161674h228176b339780
5946 G25110b815082e778156g665700B015586g261852a493608i801574d771992i132666
5936 a2619820i303326i513352f625806c014534d452380d189504A0927598e58648A1267406
5926 F8923274B18426090C73603388A90671738H8991472D7502612B8248900B8607130
5918 B0810414A5079370A3059802A8177770A3648474G474878E908264a160496h48410g44568
5908 H358362H824738A3057986B4348534H3844014B93278946C50449270A72547814I3460502
5899 D9567744B9559934B8763574B1000766B0699584A2534338G643242I460920A0385840
5890 A911110f345154I138074H861520F444350A1879462A2448660C2993980A06511764
$$ y = [-8315686, -4109494, 4578804, 1069672, 3362132, -2027336, 1202796, 8161674, -8228176, -2339780, 725110, -2815082, -5778156, -7665700, 2015586, -7261852, -1493608, -9801574, -4771992, -9132666, -12619820, -9303326, -9513352, -6625806, -3014534, -4452380, -4189504, 10927598, -558648, 11267406, 68923274, 218426090, 373603388, 190671738, 88991472, 47502612, 28248900, 28607130, 20810414, 15079370, 13059802, 18177770, 13648474, 7474878, 5908264, -1160496, -848410, -744568, 8358362, 8824738, 13057986, 24348534, 83844014, 293278946, 350449270, 172547814, 93460502, 49567744, 29559934, 28763574, 21000766, 20699584, 12534338, 7643242, 9460920, 10385840, 1911110, -6345154, 9138074, 8861520, 6444350, 11879462, 12448660, 32993980, 106511764]
5881 C33525746C02939532A41240354G7865060D1685014B6501652B2941314A7669550
5873 A3661506A2315448H551416A8587144A1176020A0100292E281072A3338164A620774
5864 B696590D470692e655220d466718D123142b441106F270332a8352A0350956C945688
5854 F270626G323124I593022f139512C515324I256810A0146226B362492A251972A0230052
5844 b700540B405732d001012A350514a745242e76540a238030A216348e197134g903810
5834 E135810F734690a502530b293336d324596C165936H35512A994762E782112H884078
5824 B500884H243576b63298d546032C11170D687596A3930576A2300154c621106b553190
5814 A352794E641708a633958f95090G928562B115184C959780D943542H29676f9860E689874
$$ y = [333525746, 302939532, 141240354, 77865060, 41685014, 26501652, 22941314, 17669550, 13661506, 12315448, 8551416, 18587144, 11176020, 10100292, 5281072, 13338164, 1620774, 2696590, 4470692, -5655220, -4466718, 4123142, -2441106, 6270332, -18352, 10350956, 3945688, 6270626, 7323124, 9593022, -6139512, 3515324, 9256810, 10146226, 2362492, 1251972, 10230052, -2700540, 2405732, -4001012, 1350514, -1745242, -576540, -1238030, 1216348, -5197134, -7903810, 5135810, 6734690, -1502530, -2293336, -4324596, 3165936, 835512, 1994762, 5782112, 8884078, 2500884, 8243576, -263298, -4546032, 311170, 4687596, 13930576, 12300154, -3621106, -2553190, 1352794, 5641708, -1633958, -695090, 7928562, 2115184, 3959780, 4943542, 829676, -69860, 5689874]
5803 B277262c589470D78244A1592782g56090e561308i796716a3321028a061986D920852
5793 A0408076A146624A886160E922288F82382i75762C668876b131568g023648d240578
5783 B025806B925394a280676B25436i05132C24402C990428B074642d675736B487362E424816
5772 a0471394a978444B5898F732228E46868c184802a906170B173566H968050e787960
5762 B489738C957324A732326D838256I029104A3625824A503338c739224C240684b449764
5752 A821528e502518a3509274a3758466f326140F69930b435422d055362d927900b594580
5742 b4200A872780C861852C062834A545712b184380A0322066A354386c490836d181894
5732 c887140f77326c6398A4393672D498474F472344e16070d708690c159148D558334g5912
$$ y = [2277262, -3589470, 478244, 11592782, -756090, -5561308, -9796716, -13321028, -1061986, 4920852, 10408076, 1146624, 1886160, 5922288, 682382, -975762, 3668876, -2131568, -7023648, -4240578, 2025806, 2925394, -1280676, 225436, -905132, 324402, 3990428, 2074642, -4675736, 2487362, 5424816, -10471394, -1978444, 25898, 6732228, 546868, -3184802, -1906170, 2173566, 8968050, -5787960, 2489738, 3957324, 1732326, 4838256, 9029104, 13625824, 1503338, -3739224, 3240684, -2449764, 1821528, -5502518, -13509274, -13758466, -6326140, 669930, -2435422, -4055362, -4927900, -2594580, -24200, 1872780, 3861852, 3062834, 1545712, -2184380, 10322066, 1354386, -3490836, -4181894, -3887140, -677326, -36398, 14393672, 4498474, 6472344, -516070, -4708690, -3159148, 4558334, -75912]
5721 D841296A145298I708220a326128d321984b896248b805212c833526a0904262c788410
5711 A0128798A502076D576884A275420e089866a639592A055754g04898b130814A263448
5701 c506746h833804B06036A629106F843290D832002c137118E503910a655486A1251766
5691 f385454h389430a4436356f336952f138584c938018a2290882d417556B518556H125200
5681 A1084668H475444A310442A639900e65842F552346B837110D466468B816586E054450
5671 G75020A694116D722702A3075744A3177988H037876i48610C948384F032504A0240280
5661 A2951950G707838G493904B589878c311254c535620e738634a3116296B148340C613256
5651 C020404I6272A445778h091856D183454C164704c250904D47054f325376g536346
$$ y = [4841296, 1145298, 9708220, -1326128, -4321984, -2896248, -2805212, -3833526, -10904262, -3788410, 10128798, 1502076, 4576884, 1275420, -5089866, -1639592, 1055754, -704898, -2130814, 1263448, -3506746, -8833804, 206036, 1629106, 6843290, 4832002, -3137118, 5503910, -1655486, 11251766, -6385454, -8389430, -14436356, -6336952, -6138584, -3938018, -12290882, -4417556, 2518556, 8125200, 11084668, 8475444, 1310442, 1639900, -565842, 6552346, 2837110, 4466468, 2816586, 5054450, 775020, 1694116, 4722702, 13075744, 13177988, 8037876, -948610, 3948384, 6032504, 10240280, 12951950, 7707838, 7493904, 2589878, -3311254, -3535620, -5738634, -13116296, 2148340, 3613256, 3020404, 96272, 1445778, -8091856, 4183454, 3164704, -3250904, 447054, -6325376, -7536346]
5641 a0570080h808416c767968b8594h479138C119188A3516004D049460a387134C762056
5631 H701986I389674f569146B111014a222326E429684e79370i977366c852838F540446
5621 a398310f823976a5748428h068278H73038E929388D811498c296700b381670a390938
5611 b540452i6264e199398g089492a123282f481266e242252D578112c018880b568210
5601 E737896f982708b778854A165934G021436c96176a908900E754690G70648b445546f8008
5590 a856568a115288g99688A1091958A1249194C613488A296096G426122B788504F632614
5580 a964106e841796H36254b005868d377160h78772A1854178H396680D783426A468202
5570 e44796c581164e212260A890684D452144B018062C981982e163280A87282c754818i51404
$$ y = [-10570080, -8808416, -3767968, -28594, -8479138, 3119188, 13516004, 4049460, -1387134, 3762056, 8701986, 9389674, -6569146, 2111014, -1222326, 5429684, -579370, -9977366, -3852838, 6540446, -1398310, -6823976, -15748428, -8068278, 873038, 5929388, 4811498, -3296700, -2381670, -1390938, -2540452, -96264, -5199398, -7089492, -1123282, -6481266, -5242252, 4578112, -3018880, -2568210, 5737896, -6982708, -2778854, 1165934, 7021436, -396176, -1908900, 5754690, 770648, -2445546, -68008, -1856568, -1115288, -799688, 11091958, 11249194, 3613488, 1296096, 7426122, 2788504, 6632614, -1964106, -5841796, 836254, -2005868, -4377160, -878772, 11854178, 8396680, 4783426, 1468202, -544796, -3581164, -5212260, 1890684, 4452144, 2018062, 3981982, -5163280, 187282, -3754818, -951404]
5559 i041986a1210954d709928g98306F404670F805916E228412a0762108f253638d530602
5549 g521446i56676D343024H051816D528472h24458g227342e734706g6434F424140A964952
5538 E625790F508990b557272a969822c163790D620944g17552D445546A1973684F552204
5528 d186944B700984C527950H68030I927416c861602a4103074a4030020d347422g688230
5518 c277052F695408A7097892A0247366A0621604A2528522C572370d666646h884692g977406
5508 c875288h27262D048832b182800b77232C865708E109064A0767028I645156B495334
5498 H971474A2841570C594170b031340a061062B169310a021544D204524b905286f642714
5488 a5928830h279518h5312A866168G859004G806730H465368C473336f913516b468298
$$ y = [-9041986, -11210954, -4709928, -798306, 6404670, 6805916, 5228412, -10762108, -6253638, -4530602, -7521446, -956676, 4343024, 8051816, 4528472, -824458, -7227342, -5734706, -76434, 6424140, 1964952, 5625790, 6508990, -2557272, -1969822, -3163790, 4620944, -717552, 4445546, 11973684, 6552204, -4186944, 2700984, 3527950, 868030, 9927416, -3861602, -14103074, -14030020, -4347422, -7688230, -3277052, 6695408, 17097892, 10247366, 10621604, 12528522, 3572370, -4666646, -8884692, -7977406, -3875288, -827262, 4048832, -2182800, -277232, 3865708, 5109064, 10767028, 9645156, 2495334, 8971474, 12841570, 3594170, -2031340, -1061062, 2169310, -1021544, 4204524, -2905286, -6642714, -15928830, -8279518, -85312, 1866168, 7859004, 7806730, 8465368, 3473336, -6913516, -2468298]
5478 a269134b89760F423252H7664E57438A3325208G169684A746124D367030h379680c222872
5467 B810564B383714C74746b120670a064942a716130B441216C378986C336154c240506
5457 A3310158A4959614H698578C859068h231724g561428a400534a843070a790878A536164
5447 C826670A102694i402710g028424d422224b599506B086794B741356c627054C887006
5437 C92686b36386D828184B717904h148712F082162A1215398b408212a5813316f915756
5427 e242880i89504A068002G993070d160796A045800a648156c24156D229806I49382B765292
5416 F575074D932238f5314F693252A389470A583728a809462h148480e105794a000588
5406 b750580h310234d698538e719350a3303080d756768A121738e48908a3734860a1105694
$$ y = [-1269134, -289760, 6423252, 87664, 557438, 13325208, 7169684, 1746124, 4367030, -8379680, -3222872, 2810564, 2383714, 374746, -2120670, -1064942, -1716130, 2441216, 3378986, 3336154, -3240506, 13310158, 14959614, 8698578, 3859068, -8231724, -7561428, -1400534, -1843070, -1790878, 1536164, 3826670, 1102694, -9402710, -7028424, -4422224, -2599506, 2086794, 2741356, -3627054, 3887006, 392686, -236386, 4828184, 2717904, -8148712, 6082162, 11215398, -2408212, -15813316, -6915756, -5242880, -989504, 1068002, 7993070, -4160796, 1045800, -1648156, -324156, 4229806, 949382, 2765292, 6575074, 4932238, -65314, 6693252, 1389470, 1583728, -1809462, -8148480, -5105794, -1000588, -2750580, -8310234, -4698538, -5719350, -13303080, -4756768, 1121738, -548908, -13734860, -11105694]
5396 c625612D281056b800936a0579992h328080i557648a52650G30992C855196E155988
5386 b08232g97204d804756B918092A1051668a1723482c705024B8448a893636E945720
5376 E470778g929284b058776d925292a569260a1886820h820102h67868a727692h414316
5366 a0047086a5131138a0756032a9959760a5691630g413490e630620a71986f93876b453004
5356 i90736B014984C328472D190024e609766a3348260h189484b681082C770060C041884
5346 C773092G473414A3423650E409462A931336d053730G345824A747234B285614d321464
5336 g872876a1792550g51900H645990D537184G09994A1284708B509416b303480f935722
5326 b079262c66224A008604I561980F371208A184778C301738D734932G410360F767326
$$ y = [-3625612, 4281056, -2800936, -10579992, -8328080, -9557648, -152650, 730992, 3855196, 5155988, -208232, -797204, -4804756, 2918092, 11051668, -11723482, -3705024, 28448, -1893636, 5945720, 5470778, -7929284, -2058776, -4925292, -1569260, -11886820, -8820102, -867868, -1727692, -8414316, -10047086, -15131138, -10756032, -19959760, -15691630, -7413490, -5630620, -171986, -693876, -2453004, -990736, 2014984, 3328472, 4190024, -5609766, -13348260, -8189484, -2681082, 3770060, 3041884, 3773092, 7473414, 13423650, 5409462, 1931336, -4053730, 7345824, 1747234, 2285614, -4321464, -7872876, -11792550, -751900, 8645990, 4537184, 709994, 11284708, 2509416, -2303480, -6935722, -2079262, -366224, 1008604, 9561980, 6371208, 1184778, 3301738, 4734932, 7410360, 6767326]
5316 D467424D233692G242758D170784C726306f66908d709382A1124734d845648a234094
5306 a2599976a0469746d755232b34218A499318B255746A852602a329010c310906e692410
5296 c727798I130224A2484622E253762A437856b23736C256404E085550A5112600f520154
5286 D362590D751644g73196A513588F631050B305192a058068a1738648i252480a0945134
5276 e945632g914442a1258498f491330b202816a0076308D060494A0541850e96122e322392
5266 H341236e05494e107458a619416g58558a277992B994448E201412A321718F966498
5256 b671096h333408G503440H215592I791368B538894a504388h858490i966014i701766
5246 e425238F155830I565156D062994D084646B03820C366486d916762c574754B755540
$$ y = [4467424, 4233692, 7242758, 4170784, 3726306, -666908, -4709382, 11124734, -4845648, -1234094, -12599976, -10469746, -4755232, -234218, 1499318, 2255746, 1852602, -1329010, -3310906, -5692410, -3727798, 9130224, 12484622, 5253762, 1437856, -223736, 3256404, 5085550, 15112600, -6520154, 4362590, 4751644, -773196, 1513588, 6631050, 2305192, -1058068, -11738648, -9252480, -10945134, -5945632, -7914442, -11258498, -6491330, -2202816, -10076308, 4060494, 10541850, -596122, -5322392, 8341236, -505494, -5107458, -1619416, -758558, -1277992, 2994448, 5201412, 1321718, 6966498, -2671096, -8333408, 7503440, 8215592, 9791368, 2538894, -1504388, -8858490, -9966014, -9701766, -5425238, 6155830, 9565156, 4062994, 4084646, 203820, 3366486, -4916762, -3574754, 2755540]
5236 G373220B089182c464726d440470c616670g098204h182002c899672C177694c557524
5226 A710528A433544A0248644D238890G67448D116174h683322a381574E813248D977900
5216 A104936B814388h80002H97982a2246198a1338708d760596C116442G003444C153542
5206 g44204b762814D058236e162646a0219632f051558a533318a047388g573612f701602
5196 E94358G136666C184940G640330A1264038G299830E304772E548546I448182d145442
5186 d751806f159762g360190e484996A400952f114280f976002i334708g767976c975384
5176 a474462i054154e203728G796632B520486i203386f565736a0006130E814070b686452
5166 C902342C802132e306574C360646A334878H911374C368494E655714f42212d466170
$$ y = [7373220, 2089182, -3464726, -4440470, -3616670, -7098204, -8182002, -3899672, 3177694, -3557524, 1710528, 1433544, 10248644, 4238890, 767448, 4116174, -8683322, -1381574, 5813248, 4977900, 1104936, 2814388, -880002, 897982, -12246198, -11338708, -4760596, 3116442, 7003444, 3153542, -744204, -2762814, 4058236, -5162646, -10219632, -6051558, -1533318, -1047388, -7573612, -6701602, 594358, 7136666, 3184940, 7640330, 11264038, 7299830, 5304772, 5548546, 9448182, -4145442, -4751806, -6159762, -7360190, -5484996, 1400952, -6114280, -6976002, -9334708, -7767976, -3975384, -1474462, -9054154, -5203728, 7796632, 2520486, -9203386, -6565736, -10006130, 5814070, -2686452, 3902342, 3802132, -5306574, 3360646, 1334878, 8911374, 3368494, 5655714, -642212, -4466170]
5156 d782346B036070A201258b120150c829846i39762g11312b011412c140094A161446F26320
5145 b896444d931056a130640a0381008e823638a139010A999348g017314e704672C865394
5135 F978796A822898a131504d651560c412138D373862B388290b699858b882618b465784
5125 g433390a06712g900834h121028a5003200d013590H189372h27728d819916C40050
5115 b122806h690834a0034106a4849588a0518986b213134b52936h42274b578990h478230
5105 E010200C792570F58562b382784d220158H744402D534228A5600210D079158E629346
5095 D568256h231824g86664c991358b289902b024552B665390h831888h709096G80414
5085 d265672d674172b38112D9210a103502C63674D499478b135866i018228h773660b492184
$$ y = [-4782346, 2036070, 1201258, -2120150, -3829846, -939762, -711312, -2011412, -3140094, 1161446, 626320, -2896444, -4931056, -1130640, -10381008, -5823638, -1139010, 1999348, -7017314, -5704672, 3865394, 6978796, 1822898, -1131504, -4651560, -3412138, 4373862, 2388290, -2699858, -2882618, -2465784, -7433390, -106712, -7900834, -8121028, -15003200, -4013590, 8189372, -827728, -4819916, 340050, -2122806, -8690834, -10034106, -14849588, -10518986, -2213134, -252936, -842274, -2578990, -8478230, 5010200, 3792570, 658562, -2382784, -4220158, 8744402, 4534228, 15600210, 4079158, 5629346, 4568256, -8231824, -786664, -3991358, -2289902, -2024552, 2665390, -8831888, -8709096, 780414, -4265672, -4674172, -238112, 49210, -1103502, 363674, 4499478, -2135866, -9018228, -8773660, -2492184]
5074 b263252d787210I18080I77212G254894E710020F016154F226764B024258A436298
5064 c991224e979752d992860d104150A278774G030456b316158i887600c192320H6758
5054 i899462f27730G826328b250928D119066F426922i74996E01182c872904a539202e475618
5043 a468824C135500D22058D316680B0169394A1187200F393664e649138d49950a369106
5033 a66000A653848A798342C687696a988208a221434a06808d767902f882600b092884
5023 B793854D770510D826264a78918D221478F326714G752284B750912A138244I15350
5013 f493894h55034e650840a0490100b676144A688500A481858c098304h482040c292854
5003 A411762A364678d044230d49938E768290D437764h203106e501634b901422c91302
$$ y = [-2263252, -4787210, 918080, 977212, 7254894, 5710020, 6016154, 6226764, 2024258, 1436298, -3991224, -5979752, -4992860, -4104150, 1278774, 7030456, -2316158, -9887600, -3192320, 86758, -9899462, -627730, 7826328, -2250928, 4119066, 6426922, -974996, 501182, -3872904, -1539202, -5475618, -1468824, 3135500, 422058, 4316680, 20169394, 11187200, 6393664, -5649138, -449950, -1369106, -166000, 1653848, 1798342, 3687696, -1988208, -1221434, -106808, -4767902, -6882600, -2092884, 2793854, 4770510, 4826264, -178918, 4221478, 6326714, 7752284, 2750912, 1138244, 915350, -6493894, -855034, -5650840, -10490100, -2676144, 1688500, 1481858, -3098304, -8482040, -3292854, 1411762, 1364678, -4044230, -449938, 5768290, 4437764, -8203106, -5501634, -2901422, -391302]
4993 E906702A390190C201994e431452e75686H808986i37262B790684E639964a3774214
4983 f958498a139718A892570A3297516I572158e726328F244594e549754b075502A541606
4973 e043284d482918e289004A946572A671284g499356A687734B296622G118912f53400
4963 d719440d223606c526374d448236c893458a9083932a524386F703724i412900e219876
4953 c061386a188750c120932h158308f654208g620042F24112g054532b002120C110696
4943 A3282696a864948c579046C29318F017716d770582a5936252a5313626a5003470a2029714
4933 e152610e667392h698000c387792D941448A1608314C719096A1773612A853442D434506
4923 D107062A1964818A746758E034316F114892A0708506D953636b358460f528588g324832
$$ y = [5906702, 1390190, 3201994, -5431452, -575686, 8808986, -937262, 2790684, 5639964, -13774214, -6958498, -1139718, 1892570, 13297516, 9572158, -5726328, 6244594, -5549754, -2075502, 1541606, -5043284, -4482918, -5289004, 1946572, 1671284, -7499356, 1687734, 2296622, 7118912, -653400, -4719440, -4223606, -3526374, -4448236, -3893458, -19083932, -1524386, 6703724, -9412900, -5219876, -3061386, -1188750, -3120932, -8158308, -6654208, -7620042, 624112, -7054532, -2002120, 3110696, 13282696, -1864948, -3579046, 329318, 6017716, -4770582, -15936252, -15313626, -15003470, -12029714, -5152610, -5667392, -8698000, -3387792, 4941448, 11608314, 3719096, 11773612, 1853442, 4434506, 4107062, 11964818, 1746758, 5034316, 6114892, 10708506, 4953636, -2358460, -6528588, -7324832]
4913 G700634A1084156E310210F725206C866578D995986B015156g950492a2616844d648540
4903 B814846C350696C899332e0834I036358C972822A4058310A0107158D892084G674850
4893 H812384d301138a5239826a4382942b772706C848754F7144C568286A601586b628298
4883 d774668g981246c982206i38910b906126d96028B41162F704230G218042E288962A315784
4872 H006964b440338B315970a599746e762018i441622A320724A753386h06306E124734
4862 F971838a400508b701836d271436A003940E121342C069560a632334f257052h085550
4852 A00888A0643054B570642D706830B019684c84998d214892B709292E666224G271082
4842 G400510A681342C337006e620552e749200A748016a2363616a8599108a0733922a895640
$$ y = [7700634, 11084156, 5310210, 6725206, 3866578, 4995986, 2015156, -7950492, -12616844, -4648540, 2814846, 3350696, 3899332, -50834, 9036358, 3972822, 14058310, 10107158, 4892084, 7674850, 8812384, -4301138, -15239826, -14382942, -2772706, 3848754, 67144, 3568286, 1601586, -2628298, -4774668, -7981246, -3982206, -938910, -2906126, -496028, 241162, 6704230, 7218042, 5288962, 1315784, 8006964, -2440338, 2315970, -1599746, -5762018, -9441622, 1320724, 1753386, -806306, 5124734, 6971838, -1400508, -2701836, -4271436, 1003940, 5121342, 3069560, -1632334, -6257052, -8085550, 100888, 10643054, 2570642, 4706830, 2019684, -384998, -4214892, 2709292, 5666224, 7271082, 7400510, 1681342, 3337006, -5620552, -5749200, 1748016, -12363616, -18599108, -10733922, -1895640]
4832 d437208a5428240i618384c255770a334800F511900C461124c987524f665096F969516
4822 H492664a877438b361170A002648H33584e245014E114038A4364544A0806138B550872
4812 G784128A5724330a279560f675730a207904a3157370B03658E677570c110204I756542
4802 F205272a821116A0429798E38252C377832b541212F306816E004668b115494i637290
4792 A642714B634824h523410A208730E463660d654536e899586d359080h627532A603956
4782 A033280d130384i608700i242946g223170e977504h7032F787408A1244954A0547158
4772 I846340I064288A504092E118400A872792B266296d893330d898114E47842e828536
4762 b782082A516660F779482F191282c324962f294158G866178H564768B0056070A9309008
$$ y = [-4437208, -15428240, -9618384, -3255770, -1334800, 6511900, 3461124, -3987524, -6665096, 6969516, 8492664, -1877438, -2361170, 1002648, 833584, -5245014, 5114038, 14364544, 10806138, 2550872, 7784128, 15724330, -1279560, -6675730, -1207904, -13157370, 203658, 5677570, -3110204, 9756542, 6205272, -1821116, 10429798, 538252, 3377832, -2541212, 6306816, 5004668, -2115494, -9637290, 1642714, 2634824, -8523410, 1208730, 5463660, -4654536, -5899586, -4359080, -8627532, 1603956, 1033280, -4130384, -9608700, -9242946, -7223170, -5977504, -87032, 6787408, 11244954, 10547158, 9846340, 9064288, 1504092, 5118400, 1872792, 2266296, -4893330, -4898114, 547842, -5828536, -2782082, 1516660, 6779482, 6191282, -3324962, -6294158, 7866178, 8564768, 20056070, 19309008]
4752 F633326G324954A3774036I951964A2028898D729328A990942E640174I759972F238626
4742 I471908F771366D230220B04978f154426d264654e843444f80330F506860C641990c90906
4731 a02698H576094D664588c053810h749904b468364h792414H65452E660578a209682
4721 A468788e81254e034336b2446B044222B482362A967442E303254A0588340A0213944
$$ y = [6633326, 7324954, 13774036, 9951964, 12028898, 4729328, 1990942, 5640174, 9759972, 6238626, 9471908, 6771366, 4230220, 204978, -6154426, -4264654, -5843444, -680330, 6506860, 3641990, -390906, -102698, 8576094, 4664588, -3053810, -8749904, -2468364, -8792414, 865452, 5660578, -1209682, 1468788, -581254, -5034336, -22446, 2044222, 2482362, 1967442, 5303254, 10588340, 10213944]
$$ [...]
##END=
