##TITLE=R-(+)-LIMONENE $$ Begin of the data block
##JCAMP-DX=5.00 $$ ACD/SpecManager v 12.01
##DATE=05 Nov 2007 17:25:52
##DATA TYPE=NMR SPECTRUM
##DATA CLASS=XYDATA
##ORIGIN=Bruker BioSpin GmbH
##OWNER=ochem
##.OBSERVE FREQUENCY=300.03180
##.ACQUISITION TIME=3.42098
##.ZERO FILL=0
##.SHIFT REFERENCE=INTERNAL,  ,16384, -2.0163
##.OBSERVE NUCLEUS=^1H
##.ACQUISITION MODE=SIMULTANEOUS
##SPECTROMETER/DATA SYSTEM=??
##.SOLVENT NAME=CHLOROFORM-d
##SWCYCLICAL=4789.27197
##NPOINTS=16384
##FIRSTX=4184.02539063
##LASTX=-604.95434570
##MAXX=4184.02539063
##MINX=-604.95434570
##MAXY=27493798.00000000
##MINY=-8613.37500000
##XFACTOR=1.0000000000
##YFACTOR=0.100000000000000
##FIRSTY=448.12500000
##DELTAX=-0.29231396
##XUNITS=HZ
##YUNITS=ARBITRARY UNITS
##XYDATA=(X++(Y..Y))
$$ [...]
3595b293A128b596g19g37a214e68A499I06f07d92c36i53i71c324b026i00b953d933
$$ -2293 1128 -2596 -719 -737 -1214 -568 1499 906 -607 -492 -336 -953 -971 -3324 -2026 -900 -2953 -4933
3589.5h596f266f268h209g514e838f374g819i839b481a816b870c536d981d089d291
$$ -8596 -6266 -6268 -8209 -7514 -5838 -6374 -7819 -9839 -2481 -1816 -2870 -3536 -4981 -4089 -4291
3584.8e836c181e026c159c211c744c238g91G23c153c056b203b651b912c721d566d89
$$ -5836 -3181 -5026 -3159 -3211 -3744 -3238 -791 723 -3153 -3056 -2203 -2651 -2912 -3721 -4566 -489
3579.8g23F80a641a641a906e211f374f216d733a091A30g12a626a668a140b458c348
$$ -723 680 -1641 -1641 -1906 -5211 -6374 -6216 -4733 -1091 130 -712 -1626 -1668 -1140 -2458 -3348
3574.8c26g846i314c189a136f659f458e284d867b160c061c186e763d391d853b829a431
$$ -326 -7846 -9314 -3189 -1136 -6659 -6458 -5284 -4867 -2160 -3061 -3186 -5763 -4391 -4853 -2829 -1431
3569.9e45c047H21B04a065b138c398a764A329G40F39A942D80A38B162F39B602C258
$$ -545 -3047 821 204 -1065 -2138 -3398 -1764 1329 740 639 1942 480 138 2162 639 2602 3258
3564.6A644E697B835D184B444I41B208A309b255a227a203a336a028a356A164D115B816
$$ 1644 5697 2835 4184 2444 941 2208 1309 -2255 -1227 -1203 -1336 -1028 -1356 1164 4115 2816
3559.6B043B116i30b306c503c511a336d251a155AB211A707A9a253e66a2a266b595a476
$$ 2043 2116 -930 -2306 -3503 -3511 -1336 -4251 -1155 1 2211 1707 19 -1253 -566 -12 -1266 -2595 -1476
3554.1a448A448A081I06a421d293d166c294a294D56D54e09b649I36a34a427b300h45
$$ -1448 1448 1081 906 -1421 -4293 -4166 -3294 -1294 456 454 -509 -2649 936 -134 -1427 -2300 -845
3548.8b383b507b384c468b834b151b541b821c027b826c254a965h28i14A261A003B198
$$ -2383 -2507 -2384 -3468 -2834 -2151 -2541 -2821 -3027 -2826 -3254 -1965 -828 -914 1261 1003 2198
3543.9b78a228c681b216g13b568f004a633d05c42c497c223c407e844c380c606b579
$$ -278 -1228 -3681 -2216 -713 -2568 -6004 -1633 -405 -342 -3497 -3223 -3407 -5844 -3380 -3606 -2579
3538.9b431a888c793c353c643f37a516g73c429d653b653b781c397c919a253b069b438
$$ -2431 -1888 -3793 -3353 -3643 -637 -1516 -773 -3429 -4653 -2653 -2781 -3397 -3919 -1253 -2069 -2438
3533.9b841b948a440a780c063b059G98a348a291c908a563A39I6A046A724A187a719
$$ -2841 -2948 -1440 -1780 -3063 -2059 798 -1348 -1291 -3908 -1563 139 96 1046 1724 1187 -1719
3528.9c73b789a678E88F06g68b146a162B571f20a014d55a623H37a259A698A543A186
$$ -373 -2789 -1678 588 606 -768 -2146 -1162 2571 -620 -1014 -455 -1623 837 -1259 1698 1543 1186
3523.7A298f28B066B67c20D81b855b894A73B319G3B53a903b946b984e89a97b948a134
$$ 1298 -628 2066 267 -320 481 -2855 -2894 173 2319 73 253 -1903 -2946 -2984 -589 -197 -2948 -1134
3518.1h2A79a052b836d036b459B61a375a758a786f48A972D20B59e741d239a265A39
$$ -82 179 -1052 -2836 -4036 -2459 261 -1375 -1758 -1786 -648 1972 420 259 -5741 -4239 -1265 139
3512.9F71b772b001f96a917a774e043d523d788c584c726b525a808d623F6c71b094b261
$$ 671 -2772 -2001 -696 -1917 -1774 -5043 -4523 -4788 -3584 -3726 -2525 -1808 -4623 66 -371 -2094 -2261
3507.6a194B59a77B54a648a918h78d209e101d124a932e063a289a659b073B301b95c686
$$ -1194 259 -177 254 -1648 -1918 -878 -4209 -5101 -4124 -1932 -5063 -1289 -1659 -2073 2301 -295 -3686
3502.3d404d583d390c38b564c487b029a911c53a427b598a803a764a183e08I73a397
$$ -4404 -4583 -4390 -338 -2564 -3487 -2029 -1911 -353 -1427 -2598 -1803 -1764 -1183 -508 973 -1397
3497.4c983e615a61G49g4a023h78a004f62a802a956f26a274A6b229a722b550b6B384
$$ -3983 -5615 -161 749 -74 -1023 -878 -1004 -662 -1802 -1956 -626 -1274 16 -2229 -1722 -2550 -26 2384
3491.8B075b652A06a206g84A709a312c778c409F04a342b147d233a666b932a428D09
$$ 2075 -2652 106 -1206 -784 1709 -1312 -3778 -3409 604 -1342 -2147 -4233 -1666 -2932 -1428 409
3486.9A281B249A325C23a826b391b390G31i7i49e99i40c633a649d261A853A326D07
$$ 1281 2249 1325 323 -1826 -2391 -2390 731 -97 -949 -599 -940 -3633 -1649 -4261 1853 1326 407
3481.6h64a196a699A088I24A31d99i59b259A025I51G31G24A496a433b806f13D486A157
$$ -864 -1196 -1699 1088 924 131 -499 -959 -2259 1025 951 731 724 1496 -1433 -2806 -613 4486 1157
3476B436c125a907a18a152b98a137b25a253b126i63A608A141c84b189d86B89b910a069
$$ 2436 -3125 -1907 -118 -1152 -298 -1137 -225 -1253 -2126 -963 1608 1141 -384 -2189 -486 289 -2910 -1069
3470.5D42d8B079B579D300D571A515a299a221a423A29B307d39b866c894B50B92b279
$$ 442 -48 2079 2579 4300 4571 1515 -1299 -1221 -1423 129 2307 -439 -2866 -3894 250 292 -2279
3465.2G70D309E33a253A948e73a014a746c775b416a356a594b618c928b811a502b008
$$ 770 4309 533 -1253 1948 -573 -1014 -1746 -3775 -2416 -1356 -1594 -2618 -3928 -2811 -1502 -2008
3460.3a324D96B359A648A161b246e95f13g74h59H26c056c323a413i59b648b578d708
$$ -1324 496 2359 1648 1161 -2246 -595 -613 -774 -859 826 -3056 -3323 -1413 -959 -2648 -2578 -4708
3455b968f854a79A124E3B89B118A018E74b443g10A116D82H09A281c73G92f54b29A619
$$ -2968 -6854 -179 1124 53 289 2118 1018 574 -2443 -710 1116 482 809 1281 -373 792 -654 -229 1619
3449.1a94H5A944H4c83c08a338f323a751a33d027c649b468e864c023B583f07c699a036
$$ -194 85 1944 84 -383 -308 -1338 -6323 -1751 -133 -4027 -3649 -2468 -5864 -3023 2583 -607 -3699 -1036
3443.6b390e21c294H79A01b676b728h95a574g73H33C229h79B254B254c414a839E814
$$ -2390 -521 -3294 879 101 -2676 -2728 -895 -1574 -773 833 3229 -879 2254 2254 -3414 -1839 5814
3438.3a774d364D66E548I0c546A946C411A853F30g39a14b103b082a3A117B469c28a729
$$ -1774 -4364 466 5548 90 -3546 1946 3411 1853 630 -739 -114 -2103 -2082 -13 1117 2469 -328 -1729
3432.8C58i62a481c685a601C962I53C778A736A012a083c836c325b803g79h78H07E17
$$ 358 -962 -1481 -3685 -1601 3962 953 3778 1736 1012 -1083 -3836 -3325 -2803 -779 -878 807 517
3427.5b255A34b944c993c424f28a746e76d154b723c076c785A58A484A186c678B079
$$ -2255 134 -2944 -3993 -3424 -628 -1746 -576 -4154 -2723 -3076 -3785 158 1484 1186 -3678 2079
3422.5a046a028a173A889H63b861b578b139A049c85c335a10b585a822H54C768a506
$$ -1046 -1028 -1173 1889 863 -2861 -2578 -2139 1049 -385 -3335 -110 -2585 -1822 854 3768 -1506
3417.6A901c164d088a474E34A246f78c753c578c130a278h43e574e543d054b120A575
$$ 1901 -3164 -4088 -1474 534 1246 -678 -3753 -3578 -3130 -1278 -843 -5574 -5543 -4054 -2120 1575
3412.6e146c623c654C383B171a503a819b657a901I4a419a274a283b289h74A904a031
$$ -5146 -3623 -3654 3383 2171 -1503 -1819 -2657 -1901 94 -1419 -1274 -1283 -2289 -874 1904 -1031
3407.6C49C069D3B306F34A56A242I83d269b793B534B007D8C959F999C523A098a19D79
$$ 349 3069 43 2306 634 156 1242 983 -4269 -2793 2534 2007 48 3959 6999 3523 1098 -119 479
3402.1I99A498C924A890D93a349A86B792d05a298B358A466g4A026C248D861C279B451
$$ 999 1498 3924 1890 493 -1349 186 2792 -405 -1298 2358 1466 -74 1026 3248 4861 3279 2451
3396.8G04a123E05A929b04A753A773a032d050d143b078B52g23c933f94g92a034a441
$$ 704 -1123 505 1929 -204 1753 1773 -1032 -4050 -4143 -2078 252 -723 -3933 -694 -792 -1034 -1441
3391.6D3F24a181c215B356a526a619b976e96a111b402a479a673a616b985e68a919d627
$$ 43 624 -1181 -3215 2356 -1526 -1619 -2976 -596 -1111 -2402 -1479 -1673 -1616 -2985 -568 -1919 -4627
3386.3a253b368a062a341a819c910a586a322i58b903a249a188b368g98a568d528b161
$$ -1253 -2368 -1062 -1341 -1819 -3910 -1586 -1322 -958 -2903 -1249 -1188 -2368 -798 -1568 -4528 -2161
3381.3A31G68b076A545A077F91d77b631F94i63d470g33A665A199C57b267D94a080c269
$$ 131 768 -2076 1545 1077 691 -477 -2631 694 -963 -4470 -733 1665 1199 357 -2267 494 -1080 -3269
3375.8c268a305d07D68A53d26d191b711c141b620b474c014a444b31a149d541b687b134
$$ -3268 -1305 -407 468 153 -426 -4191 -2711 -3141 -2620 -2474 -3014 -1444 -231 -1149 -4541 -2687 -2134
3370.5a311b984b314a883c224a421C303A609a423h53C55i93b841c167c356d158b139
$$ -1311 -2984 -2314 -1883 -3224 -1421 3303 1609 -1423 -853 355 -993 -2841 -3167 -3356 -4158 -2139
3365.5B179A789a163b894c698a941a116A226C806B079A2B13C9a790a446a224e26a376
$$ 2179 1789 -1163 -2894 -3698 -1941 -1116 1226 3806 2079 12 213 39 -1790 -1446 -1224 -526 -1376
3360.3c891a869a273f61D03C555i23D06i9G62B423F18a636b94A695D08e90c488a597
$$ -3891 -1869 -1273 -661 403 3555 -923 406 -99 762 2423 618 -1636 -294 1695 408 -590 -3488 -1597
3354.7b649b29B63b115a512a493a74d233c400a673i67I43a226a969C128C726C329B479
$$ -2649 -229 263 -2115 -1512 -1493 -174 -4233 -3400 -1673 -967 943 -1226 -1969 3128 3726 3329 2479
3349.5d59e23c063c804C11D43h29A850B18F19G51a42f68a632G06a613A470A83A626
$$ -459 -523 -3063 -3804 311 443 -829 1850 218 619 751 -142 -668 -1632 706 -1613 1470 183 1626
3343.9C673B18H57B082A505g06a563a256c156b200c303c517a718d06D26i60A416A524
$$ 3673 218 857 2082 1505 -706 -1563 -1256 -3156 -2200 -3303 -3517 -1718 -406 426 -960 1416 1524
3338.7B821F17f8c63a935A218G59D133B877fb093c751g77A494F74A021B813A219B591
$$ 2821 617 -68 -363 -1935 1218 759 4133 2877 -6 -2093 -3751 -777 1494 674 1021 2813 1219 2591
3333.1B089A796A503B233D734E1f80A131B201A684A293c222a739a779a151G9B71A395
$$ 2089 1796 1503 2233 4734 51 -680 1131 2201 1684 1293 -3222 -1739 -1779 -1151 79 271 1395
3327.8C294b323a395i11h71A51F34B616A821h13B647e52g26D33B357A348h11A650D713
$$ 3294 -2323 -1395 -911 -871 151 634 2616 1821 -813 2647 -552 -726 433 2357 1348 -811 1650 4713
3322.3B815B675C143C148A19A065H38I49E76C197C373C601B937D704C788A219a539
$$ 2815 2675 3143 3148 119 1065 838 949 576 3197 3373 3601 2937 4704 3788 1219 -1539
3317.3a973B001B639C356D080F048C823C566A901A236A204H74E9g99I96B02B729B9
$$ -1973 2001 2639 3356 4080 6048 3823 3566 1901 1236 1204 874 59 -799 996 202 2729 29
3312.1B626D071C826B853c3A262A389A643C77b890i34a911c577f89a02h01a448c50
$$ 2626 4071 3826 2853 -33 1262 1389 1643 377 -2890 -934 -1911 -3577 -689 -102 -801 -1448 -350
3306.8a588c198A138B463B643d49b31B223B31a765F5A985b428b546I90B161a469A12
$$ -1588 -3198 1138 2463 2643 -449 -231 2223 231 -1765 65 1985 -2428 -2546 990 2161 -1469 112
3301.5A538G90A963D979B006C41B606C61a910A429C001F039e781d331A957B200c349
$$ 1538 790 1963 4979 2006 341 2606 361 -1910 1429 3001 6039 -5781 -4331 1957 2200 -3349
3296.6a104i46c419a504a536b308d702c353H74F77C664A568B31c3f53g51b350A105
$$ -1104 -946 -3419 -1504 -1536 -2308 -4702 -3353 874 677 3664 1568 231 -33 -653 -751 -2350 1105
3291.3a078D52E4D016C349B105D349B098c78A967A489A873A714a525a928b222b994
$$ -1078 452 54 4016 3349 2105 4349 2098 -378 1967 1489 1873 1714 -1525 -1928 -2222 -2994
3286.3c41a53H59D126B805B478c16B72B581C24a332b31B505A960B476a507a613a109
$$ -341 -153 859 4126 2805 2478 -316 272 2581 324 -1332 -231 2505 1960 2476 -1507 -1613 -1109
3281.1G93B834B179a121a287a399H24a878c768A954B734I23a091a413b258a061c392
$$ 793 2834 2179 -1121 -1287 -1399 824 -1878 -3768 1954 2734 923 -1091 -1413 -2258 -1061 -3392
3276.1c517A213B826E92a000b721g95A143A551A831A40B025B016E185C771C125B91
$$ -3517 1213 2826 592 -1000 -2721 -795 1143 1551 1831 140 2025 2016 5185 3771 3125 291
3271.1b691a835a286f48B569B504D04b58g77a213a220a873a875I49a143a366A68F62
$$ -2691 -1835 -1286 -648 2569 2504 404 -258 -777 -1213 -1220 -1873 -1875 949 -1143 -1366 168 662
3265.9b46a66b57e42d42B151I38c46b143b54e58a516h24b458d66c376i99a98a517B69
$$ -246 -166 -257 -542 -442 2151 938 -346 -2143 -254 -558 -1516 -824 -2458 -466 -3376 -999 -198 -1517 269
3260a118A261A033D20b67E3B23d56A33h8E46b19A22a704g43h64a223c409c026A306
$$ -1118 1261 1033 420 -267 53 223 -456 133 -88 546 -219 122 -1704 -743 -864 -1223 -3409 -3026 1306
3254.2a46G08D437a286a93b558c66A43a489a122c287c046c284d03C66a054c394b504
$$ -146 708 4437 -1286 -193 -2558 -366 143 -1489 -1122 -3287 -3046 -3284 -403 366 -1054 -3394 -2504
3248.9a895b558e38A185g2b340E03H7A914C181A339A91A448A904f19b87a72a11d30
$$ -1895 -2558 -538 1185 -72 -2340 503 87 1914 3181 1339 191 1448 1904 -619 -287 -172 -111 -430
3243.4b04f73a302a91E77a049B459B481A93C067E307E019C241A701A400A673A833B938
$$ -204 -673 -1302 -191 577 -1049 2459 2481 193 3067 5307 5019 3241 1701 1400 1673 1833 2938
3238.1I46B064A313b42b177f84D18h86e508c863h63b087A09f02A443D46a336b858C73
$$ 946 2064 1313 -242 -2177 -684 418 -886 -5508 -3863 -863 -2087 109 -602 1443 446 -1336 -2858 373
3232.5A239F16a346a654a389a130A354H28a96A57C151D356F33F75c63e4C122A891A321
$$ 1239 616 -1346 -1654 -1389 -1130 1354 828 -196 157 3151 4356 633 675 -363 -54 3122 1891 1321
3227B049H64I63I06C314B085A419A803B266h16b80B970B077C514B964f62f42b35b732
$$ 2049 864 963 906 3314 2085 1419 1803 2266 -816 -280 2970 2077 3514 2964 -662 -642 -235 -2732
3221.4c198b600c812b234b858c08b226f25a118b26g66a418i94C4b304d219b044a426
$$ -3198 -2600 -3812 -2234 -2858 -308 -2226 -625 -1118 -226 -766 -1418 -994 34 -2304 -4219 -2044 -1426
3216.2I89e41A819A071a56a034A314D41a681A477B432A942B851b49A78B426B194I24
$$ 989 -541 1819 1071 -156 -1034 1314 441 -1681 1477 2432 1942 2851 -249 178 2426 2194 924
3210.9A916A729G85H97C776A102A462A581C977F36A185B100b16c214B19B247A141C48
$$ 1916 1729 785 897 3776 1102 1462 1581 3977 636 1185 2100 -216 -3214 219 2247 1141 348
3205.7I07d64a648b289b71C37a019a464d538a352f38g46b080b754I23b353e06A728
$$ 907 -464 -1648 -2289 -271 337 -1019 -1464 -4538 -1352 -638 -746 -2080 -2754 923 -2353 -506 1728
3200.4D24F85A996C874A869A514D705B201a182C322B594a1C577F596C903C04B195A194
$$ 424 685 1996 3874 1869 1514 4705 2201 -1182 3322 2594 -11 3577 6596 3903 304 2195 1194
3195.1A074e146b648F92e962b326c99G26c824A260C024E179A994C477A114a166a583
$$ 1074 -5146 -2648 692 -5962 -2326 -399 726 -3824 1260 3024 5179 1994 3477 1114 -1166 -1583
3190.2C209A212h60B849B906a983D19c22A419B047A658B328i30a549Ib52A291A67I36
$$ 3209 1212 -860 2849 2906 -1983 419 -322 1419 2047 1658 2328 -930 -1549 9 -252 1291 167 936
3184.6a264C02B533H78A508B169I1H18C067B004G161E647F39A720C476B878D27a024
$$ -1264 302 2533 878 1508 2169 91 818 3067 2004 7161 5647 639 1720 3476 2878 427 -1024
3179.3D43A694B939D909A387A184A406A707B660A374F1c521b386b602a641i1I28A980
$$ 443 1694 2939 4909 1387 1184 1406 1707 2660 1374 61 -3521 -2386 -2602 -1641 -91 928 1980
3174.1C748A944b590c473a968G94C139D206E259C720E120D300A574A198B580E385D247
$$ 3748 1944 -2590 -3473 -1968 794 3139 4206 5259 3720 5120 4300 1574 1198 2580 5385 4247
3169.1A148C8B409C687C790C299A93A169d29a203b981c472A194A814C579I47B560B081
$$ 1148 38 2409 3687 3790 3299 193 1169 -429 -1203 -2981 -3472 1194 1814 3579 947 2560 2081
3163.8C786D923C324D039D819A614B245B426A226D10A09B64b2a44A129a776c83A96
$$ 3786 4923 3324 4039 4819 1614 2245 2426 1226 410 109 264 -22 -144 1129 -1776 -383 196
3158.6h66A524E45a478a652f60E83A056B738f21A663D461F80a376a858b785A523G58
$$ -866 1524 545 -1478 -1652 -660 583 1056 2738 -621 1663 4461 680 -1376 -1858 -2785 1523 758
3153.3A078D81F51a173c08D563D939C428A537A565B246B913B66B310A817H48a326a057
$$ 1078 481 651 -1173 -308 4563 4939 3428 1537 1565 2246 2913 266 2310 1817 848 -1326 -1057
3148.1H04b683d786d479a756a253D58f6b34B401G1a178a026e251b499a011c025E64
$$ 804 -2683 -4786 -4479 -1756 -1253 458 -66 -234 2401 71 -1178 -1026 -5251 -2499 -1011 -3025 564
3142.8B474B558A104D94C217B038e19i63G44I94a6B281cE85a445b088d51G51a494g65
$$ 2474 2558 1104 494 3217 2038 -519 -963 744 994 -16 2281 -3 585 -1445 -2088 -451 751 -1494 -765
3137a081c1D19B631a883D34B152B090A955g0G81B596d37A170A583B268D929D365B278
$$ -1081 -31 419 2631 -1883 434 2152 2090 1955 -70 781 2596 -437 1170 1583 2268 4929 4365 2278
3131.4A765A474A268C364B18C45H37c50A183A739a982a244c399d598a061E36b189d91
$$ 1765 1474 1268 3364 218 345 837 -350 1183 1739 -1982 -1244 -3399 -4598 -1061 536 -2189 -491
3126.1c1I20a701A498a132b599B60A474A979B941C114A822B731C087A345E889D536
$$ -31 920 -1701 1498 -1132 -2599 260 1474 1979 2941 3114 1822 2731 3087 1345 5889 4536
3121.2C858C988A559D205B634H76a701C069b121b472a339f57F67A050d508b625c176
$$ 3858 3988 1559 4205 2634 876 -1701 3069 -2121 -2472 -1339 -657 667 1050 -4508 -2625 -3176
3116.2f248c978a465A14B334a290a647D49H21i87a660a9A911A782D764B349b26Dc38
$$ -6248 -3978 -1465 114 2334 -1290 -1647 449 821 -987 -1660 -19 1911 1782 4764 2349 -226 4 -338
3110.6A054B996B007H01h03B524I09d355c704A156a184A11b592c890b249c492b957
$$ 1054 2996 2007 801 -803 2524 909 -4355 -3704 1156 -1184 111 -2592 -3890 -2249 -3492 -2957
3105.7b774e89A439B929A261A851B831B354B470A3B064I88B246B622A87B009C011C918
$$ -2774 -589 1439 2929 1261 1851 2831 2354 2470 13 2064 988 2246 2622 187 2009 3011 3918
3100.4B453a266D6B021c70C59a493f52b66a410C33f78c769a046b63B555g48B80D66
$$ 2453 -1266 46 2021 -370 359 -1493 -652 -266 -1410 333 -678 -3769 -1046 -263 2555 -748 280 466
3094.9A533h64B689B276D542B348B88a539F93C751B209B740B324B608a889b218E80
$$ 1533 -864 2689 2276 4542 2348 288 -1539 693 3751 2209 2740 2324 2608 -1889 -2218 580
3089.9f95B225D657B239C119C283A439e74a241D1d01B121G73C014A01H23E19a294a317
$$ -695 2225 4657 2239 3119 3283 1439 -574 -1241 41 -401 2121 773 3014 101 823 519 -1294 -1317
3084.3b709I82b38a01I87A063a956a979b534c184c526c119a093a039A944A206E94G43
$$ -2709 982 -238 -101 987 1063 -1956 -1979 -2534 -3184 -3526 -3119 -1093 -1039 1944 1206 594 743
3079.1F26c27b497b498a157b74c478b359b224e104d648D78c346c166A278f04a562a479
$$ 626 -327 -2497 -2498 -1157 -274 -3478 -2359 -2224 -5104 -4648 478 -3346 -3166 1278 -604 -1562 -1479
3073.8b081I06f89A291G98A262H05a018c596c54G22B709B266B314c41I07a820b418
$$ -2081 906 -689 1291 798 1262 805 -1018 -3596 -354 722 2709 2266 2314 -341 907 -1820 -2418
3068.6d031a925e79d304e273d51c347c864h28c313b343a833C79A403B439D69a423C290
$$ -4031 -1925 -579 -4304 -5273 -451 -3347 -3864 -828 -3313 -2343 -1833 379 1403 2439 469 -1423 3290
3063.3C288A558C781A506b187a154A161A513d511f619i38a652c116b778E36a703a394
$$ 3288 1558 3781 1506 -2187 -1154 1161 1513 -4511 -6619 -938 -1652 -3116 -2778 536 -1703 -1394
3058.3a902A39A818A599A180A023B158b68b554b16B316E39b701a824h61b124B387E017
$$ -1902 139 1818 1599 1180 1023 2158 -268 -2554 -216 2316 539 -2701 -1824 -861 -2124 2387 5017
3053.1D116B097b19b024c146a440b055C80b219a68b194a21A820a328b733F07B3b106
$$ 4116 2097 -219 -2024 -3146 -1440 -2055 380 -2219 -168 -2194 -121 1820 -1328 -2733 607 23 -2106
3047.8e858b929a372a594G00b59b581d59b198F84c04A273D58A044A756d89g69B308
$$ -5858 -2929 -1372 -1594 700 -259 -2581 -459 -2198 684 -304 1273 458 1044 1756 -489 -769 2308
3042.5a074d042f631b846b363b138a513a899B56A346B74A137a372c283E8g08i31g65
$$ -1074 -4042 -6631 -2846 -2363 -2138 -1513 -1899 256 1346 274 1137 -1372 -3283 58 -708 -931 -765
3037.3F29f18a254EA113f72a047a149E88F74a156c98b942b091e067F01G6b486A042
$$ 629 -618 -1254 5 1113 -672 -1047 -1149 588 674 -1156 -398 -2942 -2091 -5067 601 76 -2486 1042
3031.7a020c066d357c660F48a631a860hF09D84c96a383i73c391f228e842E99B966B77
$$ -1020 -3066 -4357 -3660 648 -1631 -1860 -8 609 484 -396 -1383 -973 -3391 -6228 -5842 599 2966 277
3026.2A50b512I3C499E79A613B335C724A004C70A613A048A625C228B346a443B105D079
$$ 150 -2512 93 3499 579 1613 2335 3724 1004 370 1613 1048 1625 3228 2346 -1443 2105 4079
3020.9C01B55b55B758C031I08e77F23A200A419B308E29a750A175B209A52a168A630
$$ 301 255 -255 2758 3031 908 -577 623 1200 1419 2308 529 -1750 1175 2209 152 -1168 1630
3015.6B02a346b76C286A334E09a442b188f44B429C955B163C211B286H29a412E88A165
$$ 202 -1346 -276 3286 1334 509 -1442 -2188 -644 2429 3955 2163 3211 2286 829 -1412 588 1165
3010.4A63e89dA339A194g06I01a323f26I79a924c918h81C237A06h48a443A377A588
$$ 163 -589 -4 1339 1194 -706 901 -1323 -626 979 -1924 -3918 -881 3237 106 -848 -1443 1377 1588
3004.8C805A717a048a721d772b959A98A596A640B321A434A79b908b188b269i63b784
$$ 3805 1717 -1048 -1721 -4772 -2959 198 1596 1640 2321 1434 179 -2908 -2188 -2269 -963 -2784
2999.9b09a723i74B938A009a626a106h67I95i28e46A998A481C369e30b125a283A022
$$ -209 -1723 -974 2938 1009 -1626 -1106 -867 995 -928 -546 1998 1481 3369 -530 -2125 -1283 1022
2994.6b31A42b434c101b14A5c6B01b334f512c639d709C30G09A253A503G43A981B704
$$ -231 142 -2434 -3101 -214 15 -36 201 -2334 -6512 -3639 -4709 330 709 1253 1503 743 1981 2704
2989A513g06a097b229b282b817c085a546G7d5A93e1a476A266D005A889b511b928a858
$$ 1513 -706 -1097 -2229 -2282 -2817 -3085 -1546 77 -45 193 -51 -1476 1266 4005 1889 -2511 -2928 -1858
2983.5A111a326b556a949a956c566a924b69g71c608f24b70B867A729B406A209a93B888
$$ 1111 -1326 -2556 -1949 -1956 -3566 -1924 -269 -771 -3608 -624 -270 2867 1729 2406 1209 -193 2888
2978.2E93b294f47A693A483D013A581A346H52C908C739B598E286D858D522E96C014
$$ 593 -2294 -647 1693 1483 4013 1581 1346 852 3908 3739 2598 5286 4858 4522 596 3014
2973.3C756B539B599B875C916A512b000E93C01c814d75b621b24f46i49b49f53h83a006
$$ 3756 2539 2599 2875 3916 1512 -2000 593 301 -3814 -475 -2621 -224 -646 -949 -249 -653 -883 -1006
2967.7a741A226b253b434I19D89B327B720C88I6B71A025A436A093b024b894b849d840
$$ -1741 1226 -2253 -2434 919 489 2327 2720 388 96 271 1025 1436 1093 -2024 -2894 -2849 -4840
2962.4d756c824d16f87d072c493g07G10C840B834b84I93a204b713a623b056H06A636
$$ -4756 -3824 -416 -687 -4072 -3493 -707 710 3840 2834 -284 993 -1204 -2713 -1623 -2056 806 1636
2957.2C969C652H03a53I81b63c659b122b876d184c229A036b643b921i23c299b756a558
$$ 3969 3652 803 -153 981 -263 -3659 -2122 -2876 -4184 -3229 1036 -2643 -2921 -923 -3299 -2756 -1558
2951.9B19c04F86A033A403A033c74d314c873a783b409a744a274C9B792C26A309a246
$$ 219 -304 686 1033 1403 1033 -374 -4314 -3873 -1783 -2409 -1744 -1274 39 2792 326 1309 -1246
2946.7a112B025f39E58a466h49H79A557B178B238A98a298e78b804b64c043a486A131
$$ -1112 2025 -639 558 -1466 -849 879 1557 2178 2238 198 -1298 -578 -2804 -264 -3043 -1486 1131
2941.4C745CF83B301D371B148I71B656B41D7h03ca70I31A673A371A268B574a532A527
$$ 3745 3 683 2301 4371 2148 971 2656 241 47 -803 -3 -170 931 1673 1371 1268 2574 -1532 1527
2935.6B576B527A31I54G83a733b881G12e44d621b564a183d56c047C939D750i57B536
$$ 2576 2527 131 954 783 -1733 -2881 712 -544 -4621 -2564 -1183 -456 -3047 3939 4750 -957 2536
2930.3C791a078C81B92D78A344b61a042H01A039C43a136B952D441E88D910A977b254
$$ 3791 -1078 381 292 478 1344 -261 -1042 801 1039 343 -1136 2952 4441 588 4910 1977 -2254
2925h11B396A521a339e78b3c366c531A714C685A129B792A373a559a716a101a283F93
$$ -811 2396 1521 -1339 -578 -23 -3366 -3531 1714 3685 1129 2792 1373 -1559 -1716 -1101 -1283 693
2919.8a958A124C498B74a946b135h41G57a61B23f38C8b678b288c313c229c250d599
$$ -1958 1124 3498 274 -1946 -2135 -841 757 -161 223 -638 38 -2678 -2288 -3313 -3229 -3250 -4599
2914.5d113c68B034b81A81h1c24A024i4I0C403A424a38A118F49C057C338F49E71I15
$$ -4113 -368 2034 -281 181 -81 -324 1024 -94 90 3403 1424 -138 1118 649 3057 3338 649 571 915
2908.7d31C435a874d756e399b971B1A61g9d314i4A780a9A093D98A594B284A901f44
$$ -431 3435 -1874 -4756 -5399 -2971 21 161 -79 -4314 -94 1780 -19 1093 498 1594 2284 1901 -644
2903.1B698A459A89e41b571c191a303b997hC528D51i45a816b859d904I76A01A271C838
$$ 2698 1459 189 -541 -2571 -3191 -1303 -2997 -8 3528 451 -945 -1816 -2859 -4904 976 101 1271 3838
2897.6d82c395A953C26b982a554G45i45i91h74e44C41H43a158C83C05a806c430C78
$$ -482 -3395 1953 326 -2982 -1554 745 -945 -991 -874 -544 341 843 -1158 383 305 -1806 -3430 378
2892a215a334a064e13g50e63i9a968F1B938A894A248d01H64G20A924A456g40b320C22
$$ -1215 -1334 -1064 -513 -750 -563 -99 -1968 61 2938 1894 1248 -401 864 720 1924 1456 -740 -2320 322
2886.2C871D714B888a06A413B93A039C486B594A683b91B226a071a69F81A171A148B865
$$ 3871 4714 2888 -106 1413 293 1039 3486 2594 1683 -291 2226 -1071 -169 681 1171 1148 2865
2880.9A203B354A087A741B403I70A606A990C523A911B048C66A762B309B249B033a153
$$ 1203 2354 1087 1741 2403 970 1606 1990 3523 1911 2048 366 1762 2309 2249 2033 -1153
2875.9C204C569B067d51a198G12A033I55A58a579b769i51b373G29A565B651A490B91
$$ 3204 3569 2067 -451 -1198 712 1033 955 158 -1579 -2769 -951 -2373 729 1565 2651 1490 291
2870.7A625A697a259e33e38c84f88a767i59b820a049D66b284a806b341b88c186h33
$$ 1625 1697 -1259 -533 -538 -384 -688 -1767 -959 -2820 -1049 466 -2284 -1806 -2341 -288 -3186 -833
2865.4A756E451C369A020a378A365A196C518C320E484F862B743A528D428D756D618
$$ 1756 5451 3369 1020 -1378 1365 1196 3518 3320 5484 6862 2743 1528 4428 4756 4618
2860.7F213B718a53D054C253D72A43b26B040a273H69E46a739b722d03G81A119B10d2
$$ 6213 2718 -153 4054 3253 472 143 -226 2040 -1273 869 546 -1739 -2722 -403 781 1119 210 -42
2855.2I23B448H33d271h83F7a461c89B39B03A131A868A886A868a88c56a86B533G91
$$ 923 2448 833 -4271 -883 67 -1461 -389 239 203 1131 1868 1886 1868 -188 -356 -186 2533 791
2849.6F38E01H60G54a764a229c7c98B089a467b629c304d153b558b102A073b347a986
$$ 638 501 860 754 -1764 -1229 -37 -398 2089 -1467 -2629 -3304 -4153 -2558 -2102 1073 -2347 -1986
2844.4b19A474H85a879b841a576b786b404A69B560a91a242e98B99c6H26E89f01b770
$$ -219 1474 885 -1879 -2841 -1576 -2786 -2404 169 2560 -191 -1242 -598 299 -36 826 589 -601 -2770
2838.8I07B128C65C650C536A314i39A208A997C455g92b434F38A234F60A824B152A454
$$ 907 2128 365 3650 3536 1314 -939 1208 1997 3455 -792 -2434 638 1234 660 1824 2152 1454
2833.5A589B858D708A301f95A247A373A017b720a064h0a594F6C126B514A34B911B722
$$ 1589 2858 4708 1301 -695 1247 1373 1017 -2720 -1064 -80 -1594 66 3126 2514 134 2911 2722
2828.3C034I58a088c389D44A614A966E358B334H39G99D139C580B508a16B180b226a626
$$ 3034 958 -1088 -3389 444 1614 1966 5358 2334 839 799 4139 3580 2508 -116 2180 -2226 -1626
2823B024b257E62B14B326g18C441D724g3f81G62C38a005B443C311A600D890A380B688
$$ 2024 -2257 562 214 2326 -718 3441 4724 -73 -681 762 338 -1005 2443 3311 1600 4890 1380 2688
2817.5C563D365h26E504D359f13A711F192C678a369A984D09h2B998A352a047b685D400
$$ 3563 4365 -826 5504 4359 -613 1711 6192 3678 -1369 1984 409 -82 2998 1352 -1047 -2685 4400
2812.2F052B686a373A212A871F474D833D218C058C358C83a446c868b042d53A320e68
$$ 6052 2686 -1373 1212 1871 6474 4833 4218 3058 3358 383 -1446 -3868 -2042 -453 1320 -568
2807.2C60f07D27G78A420b089c908b82B87c041A9G17B473C223A819C61C30A23B948
$$ 360 -607 427 778 1420 -2089 -3908 -282 287 -3041 19 717 2473 3223 1819 361 330 123 2948
2801.7F08D94c65B057B643B096B30c64c533c373B06a27g8A001A239I29H50D494C216
$$ 608 494 -365 2057 2643 2096 230 -364 -3533 -3373 206 -127 -78 1001 1239 929 850 4494 3216
2796.1c678a375A422A64a38g36h61c966h64b26B436F69F94C576A761A498b41B385C524
$$ -3678 -1375 1422 164 -138 -736 -861 -3966 -864 -226 2436 669 694 3576 1761 1498 -241 2385 3524
2790.6B633B892a278a413a420a239b081b039f878d684c552c958a471A110i56g73c081
$$ 2633 2892 -1278 -1413 -1420 -1239 -2081 -2039 -6878 -4684 -3552 -3958 -1471 1110 -956 -773 -3081
2785.6c58B14a412A484D625A971a052A143A435D71A861F155B796A444g24b415A85A036
$$ -358 214 -1412 1484 4625 1971 -1052 1143 1435 471 1861 6155 2796 1444 -724 -2415 185 1036
2780.3I26A306f43a207b47A200C239A291B69A373c7A044A781E53a481h7A91B008G24
$$ 926 1306 -643 -1207 -247 1200 3239 1291 269 1373 -37 1044 1781 553 -1481 -87 191 2008 724
2774.8B50e44E3D83a80a681A923D724A158A157B411e3F58C833I4A354A488A066h22
$$ 250 -544 53 483 -180 -1681 1923 4724 1158 1157 2411 -53 658 3833 94 1354 1488 1066 -822
2769.2D75A756a599A552D050B626I61C1C338f95b69C236A203C7B821B002A597B297
$$ 475 1756 -1599 1552 4050 2626 961 31 3338 -695 -269 3236 1203 37 2821 2002 1597 2297
2764c91e08B059C108D308D043A28c192a116D337b3B372A614B875a433D99b979b608
$$ -391 -508 2059 3108 4308 4043 128 -3192 -1116 4337 -23 2372 1614 2875 -1433 499 -2979 -2608
2758.7G96a060b698G70E82a980c048a873A608a788a221H56A958G64B495a677D6B469
$$ 796 -1060 -2698 770 582 -1980 -3048 -1873 1608 -1788 -1221 856 1958 764 2495 -1677 46 2469
2753.4B870C634A162g1A34A461c14g26B118A56A683B712a413A602A070A499A202b176
$$ 2870 3634 1162 -71 134 1461 -314 -726 2118 156 1683 2712 -1413 1602 1070 1499 1202 -2176
2748.2H03G83E73B235C293E286F88c93B40B143C122b069a9B091G18B246b13B135a596
$$ 803 783 573 2235 3293 5286 688 -393 240 2143 3122 -2069 -19 2091 718 2246 -213 2135 -1596
2742.6a339b178h16c03a124B6A809E23A238A276a205b057A803A893A962D644A101B768
$$ -1339 -2178 -816 -303 -1124 26 1809 523 1238 1276 -1205 -2057 1803 1893 1962 4644 1101 2768
2737.4B700A154C591A887a532c016g71A983B121C3B678e66B082c13C03a23A061A518
$$ 2700 1154 3591 1887 -1532 -3016 -771 1983 2121 33 2678 -566 2082 -313 303 -123 1061 1518
2732.1E136G472D709A910D768C594C596D519A136f92F74i89A773A758A711f03a584
$$ 5136 7472 4709 1910 4768 3594 3596 4519 1136 -692 674 -989 1773 1758 1711 -603 -1584
2727.1g4I69E31b114d23I58b688f26f86a123A901A600A41C512D504A425B911F153D856
$$ -74 969 531 -2114 -423 958 -2688 -626 -686 -1123 1901 1600 141 3512 4504 1425 2911 6153 4856
2721.6D242A193A318A471B036C576A453A631A586B886D144E537C401C933B64A96E24
$$ 4242 1193 1318 1471 2036 3576 1453 1631 1586 2886 4144 5537 3401 3933 264 196 524
2716.6i35H28B493B836B241B808B134c64A515E034E519C050B875C024C504C64b286
$$ -935 828 2493 2836 2241 2808 2134 -364 1515 5034 5519 3050 2875 3024 3504 364 -2286
2711.6a168a489G36C40d98A010G87a047b364F66A304d5a023H78C451C179B184Ff51
$$ -1168 -1489 736 340 -498 1010 787 -1047 -2364 666 1304 -45 -1023 878 3451 3179 2184 6 -651
2706.1b189b64a628a053a083b406c578a336G93A881C48e5a95A583C357G82a691A552
$$ -2189 -264 -1628 -1053 -1083 -2406 -3578 -1336 793 1881 348 -55 -195 1583 3357 782 -1691 1552
2700.8A101a411b371I23B78b38h90A580C27d99d42b294B58D09f45a43C26a261A408
$$ 1101 -1411 -2371 923 278 -238 -890 1580 327 -499 -442 -2294 258 409 -645 -143 326 -1261 1408
2695.3F87c036c793b201a143A474C721A708C407a806b363A321H99A045A05A929C98
$$ 687 -3036 -3793 -2201 -1143 1474 3721 1708 3407 -1806 -2363 1321 899 1045 105 1929 398
2690.3B11D146a76b293b873A32A933H21C459H58h94A025a632a512A856B335d81c52
$$ 211 4146 -176 -2293 -2873 132 1933 821 3459 858 -894 1025 -1632 -1512 1856 2335 -481 -352
2685D785D090i1F79A608g6h01C69f13d252A434C271A994A964I26D49b958A248G009
$$ 4785 4090 -91 679 1608 -76 -801 369 -613 -4252 1434 3271 1994 1964 926 449 -2958 1248 7009
2679.5G297C346F902B887A908G82A858C564C929C514D698E759C175C070B689C659E827
$$ 7297 3346 6902 2887 1908 782 1858 3564 3929 3514 4698 5759 3175 3070 2689 3659 5827
2674.5D014C911B577A378A938C191b254b90A259D755G28A506b71d01a856E74A118E49
$$ 4014 3911 2577 1378 1938 3191 -2254 -290 1259 4755 728 1506 -271 -401 -1856 574 1118 549
2669.3A71Gi78E8A037C132d98h43a372c899a207F7A56A66B89B342B438H24B547B836
$$ 171 7 -978 58 1037 3132 -498 -843 -1372 -3899 -1207 67 156 166 289 2342 2438 824 2547 2836
2663.4B016d68b584a214c398d47C466D209B334i99g13a761C28b340b118d68B628A211
$$ 2016 -468 -2584 -1214 -3398 -447 3466 4209 2334 -999 -713 -1761 328 -2340 -2118 -468 2628 1211
2658.1A455h00B178A343C244B63B037B088F53A022H39f91a819i09C76c28F51B048B74
$$ 1455 -800 2178 1343 3244 263 2037 2088 653 1022 839 -691 -1819 -909 376 -328 651 2048 274
2652.6a272B83a150B451C368H49A756C469A613b9b30A600F84b180a656E61A018F99
$$ -1272 283 -1150 2451 3368 849 1756 3469 1613 -29 -230 1600 684 -2180 -1656 561 1018 699
2647.3a085a197a461C71A174A024a654a33b852b989d81b25i28h76b067A547B30B83
$$ -1085 -1197 -1461 371 1174 1024 -1654 -133 -2852 -2989 -481 -225 -928 -876 -2067 1547 230 283
2642.1B691B814A108b556b139c009c053b803b841a38a565a038d64a569b721c036d354
$$ 2691 2814 1108 -2556 -2139 -3009 -3053 -2803 -2841 -138 -1565 -1038 -464 -1569 -2721 -3036 -4354
2637.1d493b913a054C71g89a674e83b529c538c911I69b80a679b809b955g19e60A813
$$ -4493 -2913 -1054 371 -789 -1674 -583 -2529 -3538 -3911 969 -280 -1679 -2809 -2955 -719 -560 1813
2631.8h33a099a529a568b902a165F54C792D049b02A053A808E209E041F21C77a575B870
$$ -833 -1099 -1529 -1568 -2902 -1165 654 3792 4049 -202 1053 1808 5209 5041 621 377 -1575 2870
2626.6B334b844e459b620c493A11A61A052a222d319c759d162b106c06F69a504e26A281
$$ 2334 -2844 -5459 -2620 -3493 111 161 1052 -1222 -4319 -3759 -4162 -2106 -306 669 -1504 -526 1281
2621.3D054B255c186b624b356e64a33a666c146A080A284C408B872a752a073G8c334
$$ 4054 2255 -3186 -2624 -2356 -564 -133 -1666 -3146 1080 1284 3408 2872 -1752 -1073 78 -3334
2616.3a109b216c646e592c905a392b393B108A411A464f7A428C264C424g1A034c59D288
$$ -1109 -2216 -3646 -5592 -3905 -1392 -2393 2108 1411 1464 -67 1428 3264 3424 -71 1034 -359 4288
2611.1C630B849A03a08A884A124A397B796A226A227B946C068F376D363A777D653D489
$$ 3630 2849 103 -108 1884 1124 1397 2796 1226 1227 2946 3068 6376 4363 1777 4653 4489
2606.1F604D339C899B458F59B928c51F86c95g23D047B569I83A529A23F76A430B176
$$ 6604 4339 3899 2458 659 2928 -351 686 -395 -723 4047 2569 983 1529 123 676 1430 2176
2600.9C118E708D424A608A586B756C353C332E78D04H06d266a026G36f07G31a89F28
$$ 3118 5708 4424 1608 1586 2756 3353 3332 578 404 806 -4266 -1026 736 -607 731 -189 628
2595.6G58F93A70a766f36A049B514c46G24C88a208A159f49A981B800C661A638a444
$$ 758 693 170 -1766 -636 1049 2514 -346 724 388 -1208 1159 -649 1981 2800 3661 1638 -1444
2590.3E01i53a54H43b548b631a997e34A573a381e054c952E52B669B523B74b911B453
$$ 501 -953 -154 843 -2548 -2631 -1997 -534 1573 -1381 -5054 -3952 552 2669 2523 274 -2911 2453
2585.1D028b62A316C605C938A991E33b58i24a402A703A198a024A253B078G12a043A643
$$ 4028 -262 1316 3605 3938 1991 533 -258 -924 -1402 1703 1198 -1024 1253 2078 712 -1043 1643
2579.8C499C906I96G03C36D19a168c59a98A524A793A09A487a404D06a160A584e1g62
$$ 3499 3906 996 703 336 419 -1168 -359 -198 1524 1793 109 1487 -1404 406 -1160 1584 -51 -762
2574.3B04H56D79I63I90G4A39G61B359C496B522I29C531C473A458B188A21a529B229
$$ 204 856 479 963 990 74 139 761 2359 3496 2522 929 3531 3473 1458 2188 121 -1529 2229
2568.7A084b05D68B406E771A450B7b293g98A258h11e05a228A43b90B997D00A071A603
$$ 1084 -205 468 2406 5771 1450 27 -2293 -798 1258 -811 -505 -1228 143 -290 2997 400 1071 1603
2563.1a849a068a280c394c4I92A136b26d43a033a578b334c291a460a646Ic531a369
$$ -1849 -1068 -1280 -3394 -34 992 1136 -226 -443 -1033 -1578 -2334 -3291 -1460 -1646 9 -3531 -1369
2557.9i64e34c032a654b7a492a739h46F43H21a365a777b11E252A753g05b093a424A846
$$ -964 -534 -3032 -1654 -27 -1492 -1739 -846 643 821 -1365 -1777 -211 5252 1753 -705 -2093 -1424 1846
2552.3C984E023B068B496B822A007B854D207A50D05A32b83D45B819D749C11g42c345
$$ 3984 5023 2068 2496 2822 1007 2854 4207 150 405 132 -283 445 2819 4749 311 -742 -3345
2547.1d866a326B885a769a099d74C893D42B724C889h4d77i36B934B134D111C344B931
$$ -4866 -1326 2885 -1769 -1099 -474 3893 442 2724 3889 -84 -477 -936 2934 2134 4111 3344 2931
2541.8F328C935A322b131a411e178a626A321d74a013d95d56D56d98b923g36a395a922
$$ 6328 3935 1322 -2131 -1411 -5178 -1626 1321 -474 -1013 -495 -456 456 -498 -2923 -736 -1395 -1922
2536.5a204a151a189b991a039A117F35B93b264b559F52C123A90b399a278B19C966B856
$$ -1204 -1151 -1189 -2991 -1039 1117 635 293 -2264 -2559 652 3123 190 -2399 -1278 219 3966 2856
2531.3f33A847B306A239D123D373B073G51C482B395A240b39@B136D850D614C889D238
$$ -633 1847 2306 1239 4123 4373 2073 751 3482 2395 1240 -239 0 2136 4850 4614 3889 4238
2526B83B611B931A391H89a209B053D735D818D241C545G98A271D776B585A093a676i54
$$ 283 2611 2931 1391 889 -1209 2053 4735 4818 4241 3545 798 1271 4776 2585 1093 -1676 -954
2520.8C539D161C991D838C433A300A76e14A006a599b037h45A523B271I86a01g16C41
$$ 3539 4161 3991 4838 3433 1300 176 -514 1006 -1599 -2037 -845 1523 2271 986 -101 -716 341
2515.5B654c72i45A531D210C788B156B599A977I11H17c44A593D40B507F031A244D409
$$ 2654 -372 -945 1531 4210 3788 2156 2599 1977 911 817 -344 1593 440 2507 6031 1244 4409
2510.2E545D873D635C326A76B592D284A98g10b119d223A323A001B989B309A463d99
$$ 5545 4873 4635 3326 176 2592 4284 198 -710 -2119 -4223 1323 1001 2989 2309 1463 -499
2505.3i10B648F99i43a069A206A60A533a070C2B663B908C281e95D01E23B730C35B265
$$ -910 2648 699 -943 -1069 1206 160 1533 -1070 32 2663 2908 3281 -595 401 523 2730 335 2265
2499.7C281C425A519a93e40I37A848A065H64A499E510I37D21D74A141G28a145f85a611
$$ 3281 3425 1519 -193 -540 937 1848 1065 864 1499 5510 937 421 474 1141 728 -1145 -685 -1611
2494.2a5f6A484C234C313B282H56a601a779A39h08c841a053A82E07d27b981c563c344
$$ -15 -66 1484 3234 3313 2282 856 -1601 -1779 139 -808 -3841 -1053 182 507 -427 -2981 -3563 -3344
2488.6b499b707e834e026c629a424A023b160b58a337a823a292b227c436a258i39a744
$$ -2499 -2707 -5834 -5026 -3629 -1424 1023 -2160 -258 -1337 -1823 -1292 -2227 -3436 -1258 -939 -1744
2483.6d189b963i26d058c169B774A586B755A759b546c94H9c52d14a471a20b339a563
$$ -4189 -2963 -926 -4058 -3169 2774 1586 2755 1759 -2546 -394 89 -352 -414 -1471 -120 -2339 -1563
2478.4a466a658b444a518b838H89a92h29a226A096g64b268b268a073b056c146b225
$$ -1466 -1658 -2444 -1518 -2838 889 -192 -829 -1226 1096 -764 -2268 -2268 -1073 -2056 -3146 -2225
2473.4e443c669b129a428g51a776bi51h61C072B07c327d061e9A848D86A128C53a589
$$ -5443 -3669 -2129 -1428 -751 -1776 -2 -951 -861 3072 207 -3327 -4061 -59 1848 486 1128 353 -1589
2467.9A685F757B205C01A691B059C530C44A245D154F466G716H047H775G290H684G531
$$ 1685 6757 2205 301 1691 2059 3530 344 1245 4154 6466 7716 8047 8775 7290 8684 7531
2462.9E802I570F716H038F187E404D025C210C005D789C463A772C05A734B992C741F515
$$ 5802 9570 6716 8038 6187 5404 4025 3210 3005 4789 3463 1772 305 1734 2992 3741 6515
2457.9E794E115F549G396I961G639E699B244E253G754H541D103G135E710E384B918
$$ 5794 5115 6549 7396 9961 7639 5699 2244 5253 7754 8541 4103 7135 5710 5384 2918
2453.2A056a099A978B504B671C378E323F674A445F73G42i71B071B453c44b934b261
$$ 1056 -1099 1978 2504 2671 3378 5323 6674 1445 673 742 -971 2071 2453 -344 -2934 -2261
2448.3A993D549D088C856B073d11i29C15H51C920B721B23A762B155C949a093a534c907
$$ 1993 4549 4088 3856 2073 -411 -929 315 851 3920 2721 223 1762 2155 3949 -1093 -1534 -3907
2443G19G04E7a341b528a349b164e89i01h81d904e571b082B669D700C564F25b961c538
$$ 719 704 57 -1341 -2528 -1349 -2164 -589 -901 -881 -4904 -5571 -2082 2669 4700 3564 625 -2961 -3538
2437.4a782c281c628b398B600C717A234D54D145D948B631a528f50g26f8A08A53B574
$$ -1782 -3281 -3628 -2398 2600 3717 1234 454 4145 4948 2631 -1528 -650 -726 -68 108 153 2574
2432.2H26a416a301b630c325d668e133e894b621a214H62A380b904d043b942a038C73
$$ 826 -1416 -1301 -2630 -3325 -4668 -5133 -5894 -2621 -1214 862 1380 -2904 -4043 -2942 -1038 373
2427.2G14h03a15A718F39D432F029E093D711E511E609H096A1006A0549A5431A5351
$$ 714 -803 -115 1718 639 4432 6029 5093 4711 5511 5609 8096 11006 10549 15431 15351
2422.5A7183B3192C4082D0837D6663E1645E6085E1606D7332D3458D4050D0502C8390
$$ 17183 23192 34082 40837 46663 51645 56085 51606 47332 43458 44050 40502 38390
2418.7C0558B7598B0569A4096A3219A3689A2315H074A0006E682E499D369D154B197
$$ 30558 27598 20569 14096 13219 13689 12315 8074 10006 5682 5499 4369 4154 2197
2414.6B943D129A473E41C960C002C11A545a715b008f11C28A193B033B363C813C588
$$ 2943 4129 1473 541 3960 3002 311 1545 -1715 -2008 -611 328 1193 2033 2363 3813 3588
2409.7C054D058E636i84A387B929d63h84D874C403G340H588F616E403F491A1308A0748
$$ 3054 4058 5636 -984 1387 2929 -463 -884 4874 3403 7340 8588 6616 5403 6491 11308 10748
2404.7H137H618I222H073G886G756G269C346A908D641C098B833F039D580A318d31a180
$$ 8137 8618 9222 8073 7886 7756 7269 3346 1908 4641 3098 2833 6039 4580 1318 -431 -1180
2399.7a437a54f9b181G45c678e259b261c207b564a634A616A631E28A70B430a533g81
$$ -1437 -154 -69 -2181 745 -3678 -5259 -2261 -3207 -2564 -1634 1616 1631 528 170 2430 -1533 -781
2394.5E95B957C140B077A201a421b979b873c74E83B451B230C295B644I23A462A170
$$ 595 2957 3140 2077 1201 -1421 -2979 -2873 -374 583 2451 2230 3295 2644 923 1462 1170
2389.5A281B816D577D051C546B470E453H13b9D439F224C423D869E532B37b339d346
$$ 1281 2816 4577 4051 3546 2470 5453 813 -29 4439 6224 3423 4869 5532 237 -2339 -4346
2384.5a278d49I17A302A591B778C406A030A482B731F86b351b566a791b13A48b024c663
$$ -1278 -449 917 1302 1591 2778 3406 1030 1482 2731 686 -2351 -2566 -1791 -213 148 -2024 -3663
2379.3B249C510B746B792D273A878B674F9b63A243a276A364A63b885i16B809E307C713
$$ 2249 3510 2746 2792 4273 1878 2674 69 -263 1243 -1276 1364 163 -2885 -916 2809 5307 3713
2374A76B461C363B151F528F694B781C023C442H14a023a058e94i54A466a199A373B561
$$ 176 2461 3363 2151 6528 6694 2781 3023 3442 814 -1023 -1058 -594 -954 1466 -1199 1373 2561
2368.8E652C362a529a236a359B314h38e03a03a572a509A232A704d56D59a329A976B346
$$ 5652 3362 -1529 -1236 -1359 2314 -838 -503 -103 -1572 -1509 1232 1704 -456 459 -1329 1976 2346
2363.5C419a082A34I30B808D046C493B814D016F270C858F877I513A1932A0809A1833
$$ 3419 -1082 134 930 2808 4046 3493 2814 4016 6270 3858 6877 9513 11932 10809 11833
2358.8A7882B2069B9839D0989E0686E7811F0867E5153D7496C7435C0348B3260B0155
$$ 17882 22069 29839 40989 50686 57811 60867 55153 47496 37435 30348 23260 20155
2355A6436A2491A0010A1487H640I633I343A2413A4943A5463B2074B9313C0586B7769
$$ 16436 12491 10010 11487 8640 9633 9343 12413 14943 15463 22074 29313 30586 27769
2350.9B1946A6658I765G287F123B463i76A106B969D916C284G81B8a94b532g1D752D48
$$ 21946 16658 9765 7287 6123 2463 -976 1106 2969 4916 3284 781 28 -194 -2532 -71 4752 448
2345.7b429b306f02C993E125D951A789A628B996E166C448A105A06A186E871D644a333
$$ -2429 -2306 -602 3993 5125 4951 1789 1628 2996 5166 3448 1105 106 1186 5871 4644 -1333
2340.7a586B246A516a158c49a400d398a078A050B02e41B328A988d31b28A768B897A760
$$ -1586 2246 1516 -1158 -349 -1400 -4398 -1078 1050 202 -541 2328 1988 -431 -228 1768 2897 1760
2335.4a581e93e3C063B891C199A944D64C129A854b342h86C423B844a51F63A861A416
$$ -1581 -593 -53 3063 2891 3199 1944 464 3129 1854 -2342 -886 3423 2844 -151 663 1861 1416
2330.2a478E78c272a532d293b084b435e060f051f95A054e01b904b063g44e16b793e90
$$ -1478 578 -3272 -1532 -4293 -2084 -2435 -5060 -6051 -695 1054 -501 -2904 -2063 -744 -516 -2793 -590
2324.9i2A361B374F52B244b8A945C838F96b901c68A486A583A158B646E259E941G49
$$ -92 1361 2374 652 2244 -28 1945 3838 696 -2901 -368 1486 1583 1158 2646 5259 5941 749
2319.6D28A358a171A466A51a390a789b269h09a283b993c091c98a553a559A648g78d4
$$ 428 1358 -1171 1466 151 -1390 -1789 -2269 -809 -1283 -2993 -3091 -398 -1553 -1559 1648 -778 -44
2314.4C241A807D629D044F89b360f54i61h68f99b559a411a956B850B023A33b489c370
$$ 3241 1807 4629 4044 689 -2360 -654 -961 -868 -699 -2559 -1411 -1956 2850 2023 133 -2489 -3370
2309.1h70I71a610c271c059a778F82B10f31c243i491d594D288a176h252A485A721d265
$$ -870 971 -1610 -3271 -3059 -1778 682 210 -631 -3243 -9491 -4594 4288 -1176 -8252 1485 1721 -4265
2303.9e11H544I195B356A0335A3534D831I284A7981H857e33I611c087a1421g56G798
$$ -511 8544 9195 2356 10335 13534 4831 9284 17981 8857 -533 9611 -3087 -11421 -756 7798
2299.2h754d278C957a398e983A94B88f971d274A188c568b348B856A914I48h13I63B29
$$ -8754 -4278 3957 -1398 -5983 194 288 -6971 -4274 1188 -3568 -2348 2856 1914 948 -813 963 229
2293.9D787B138B651B160a0d94C04a333b938b373b649g85A891A525b136a612c364a086
$$ 4787 2138 2651 2160 -10 -494 304 -1333 -2938 -2373 -2649 -785 1891 1525 -2136 -1612 -3364 -1086
2288.7B11E43g89a605f84F25B762d92a338A80A798B238b319a290a704A106e64C233
$$ 211 543 -789 -1605 -684 625 2762 -492 -1338 180 1798 2238 -2319 -1290 -1704 1106 -564 3233
2283.4B796A891i6B568B657E68C895C794D59A691b914c622f078e973d734g576e688
$$ 2796 1891 -96 2568 2657 568 3895 3794 459 1691 -2914 -3622 -6078 -5973 -4734 -7576 -5688
2278.4i257i614a0281a0059e664d103e176c781d425c46G88A1380B2811A4253E600C246
$$ -9257 -9614 -10281 -10059 -5664 -4103 -5176 -3781 -4425 -346 788 11380 22811 14253 5600 3246
2273.8F751G468F002G648B641H56A105B712H71A696a148B094C4a421g29g49A267c160
$$ 6751 7468 6002 7648 2641 856 1105 2712 871 1696 -1148 2094 34 -1421 -729 -749 1267 -3160
2268.5a746a678b541d154d875c368I73a594B148d46I5B185F39A196a094A822D009D33
$$ -1746 -1678 -2541 -4154 -4875 -3368 973 -1594 2148 -446 95 2185 639 1196 -1094 1822 4009 433
2263.2B97G13A24d069h14G59C20a24d09c377h42a694I97a624b88A25B465A949F668
$$ 297 713 124 -4069 -814 759 320 -124 -409 -3377 -842 -1694 997 -1624 -288 125 2465 1949 6668
2257.7F986I887A3745A9442C0714C7033D9425E8449F1995E7593E0261C9515C2524B6634
$$ 6986 9887 13745 19442 30714 37033 49425 58449 61995 57593 50261 39515 32524 26634
2253.6B1310A4945A6331A3002G892H466I049H359F733E668E175B575D024C343B520
$$ 21310 14945 16331 13002 7892 8466 9049 8359 6733 5668 5175 2575 4024 3343 2520
2249.2D149B749b042d74a263a369a896A998B776C554B691B732A226B96A128B39C083
$$ 4149 2749 -2042 -474 -1263 -1369 -1896 1998 2776 3554 2691 2732 1226 296 1128 239 3083
2244.2B286A448D676B396E143A441B300B159A312A626A006A429C053B169B529g39e46
$$ 2286 1448 4676 2396 5143 1441 2300 2159 1312 1626 1006 1429 3053 2169 2529 -739 -546
2239.3a669a656A30G59A866D79e19D078E506H49I38A860C980B519B115A787B568C193
$$ -1669 -1656 130 759 1866 479 -519 4078 5506 849 938 1860 3980 2519 2115 1787 2568 3193
2234B223B379A041b304a676a70b530e877g716i353e001b911d728c921d812d984b376
$$ 2223 2379 1041 -2304 -1676 -170 -2530 -5877 -7716 -9353 -5001 -2911 -4728 -3921 -4812 -4984 -2376
2229a573a059e477d376e810b579d234b616B206A20d149b773g71C552C370C029B290
$$ -1573 -1059 -5477 -4376 -5810 -2579 -4234 -2616 2206 120 -4149 -2773 -771 3552 3370 3029 2290
2224.1f16f28d287c131a549c261b797b641a877g22b009c586e750e730e354a074A033
$$ -616 -628 -4287 -3131 -1549 -3261 -2797 -2641 -1877 -722 -2009 -3586 -5750 -5730 -5354 -1074 1033
2219.1a987d508b769a461A73b50d86B366a378b058a654c23f85a627d147c074a601B184
$$ -1987 -4508 -2769 -1461 173 -250 -486 2366 -1378 -2058 -1654 -323 -685 -1627 -4147 -3074 -1601 2184
2213.8b746b390A369I33A724a222b412a821C09e65C256B438h51D049E329C854E478
$$ -2746 -2390 1369 933 1724 -1222 -2412 -1821 309 -565 3256 2438 -851 4049 5329 3854 5478
2208.9G599G458B253B844E472F070C471E60a115A773A363E783G058G018B922B60c132
$$ 7599 7458 2253 2844 5472 6070 3471 560 -1115 1773 1363 5783 7058 7018 2922 260 -3132
2203.9a416E976H083C454a025A926C639E728E609H644I756E981I94E38A743A234C547
$$ -1416 5976 8083 3454 -1025 1926 3639 5728 5609 8644 9756 5981 994 538 1743 1234 3547
2198.9C212E064D655B323C381B593D112D604E279F359E982E316E693F946E191D263
$$ 3212 5064 4655 2323 3381 2593 4112 4604 5279 6359 5982 5316 5693 6946 5191 4263
2194.2C637F326H017F184G237H950A3789A5092B3607C0119D1506E1624E7974E6034
$$ 3637 6326 8017 6184 7237 8950 13789 15092 23607 30119 41506 51624 57974 56034
2190.2E0071D3664C9461C1125B0179A7636A2791B488A928D214F499F268I322A1982
$$ 50071 43664 39461 31125 20179 17636 12791 2488 1928 4214 6499 6268 9322 11982
2186.1A5739A8462B2749C1243C9691E1534E9261E3423D2445C3408B7988B0964A7210
$$ 15739 18462 22749 31243 39691 51534 59261 53423 42445 33408 27988 20964 17210
2182.3A5135I819A1179A4032A1007C665A745C571F456I082E557G456G694C958E741
$$ 15135 9819 11179 14032 11007 3665 1745 3571 6456 9082 5557 7456 7694 3958 5741
2177.9H367I878I813A1139A2763A4169A6570A8806A8611A9510B6719C3257C8708D7048
$$ 8367 9878 9813 11139 12763 14169 16570 18806 18611 19510 26719 33257 38708 47048
2173.8F2858H0853A10916A51093B11638C29048E61776A073680B431331C776638B461506
$$ 62858 80853 110916 151093 211638 329048 561776 1073680 2431331 3776638 2461506
2170.6A146693E62513C36641B28103A68746A35398A09354H6978G4559F6180F0807E4244
$$ 1146693 562513 336641 228103 168746 135398 109354 86978 74559 66180 60807 54244
2167.1E6696D6098D1443D0125C6380C6076C4102C2184C6014C9346D5955E4693E1777
$$ 56696 46098 41443 40125 36380 36076 34102 32184 36014 39346 45955 54693 51777
2163.3D3471C5547C0179B8995B4829B2902A7954A4579A2984A6181A5099A3371A4901
$$ 43471 35547 30179 28995 24829 22902 17954 14579 12984 16181 15099 13371 14901
2159.5A3577A3998A4124A2600A0909I643A0843A1632A0364A3116I681G353G901G894
$$ 13577 13998 14124 12600 10909 9643 10843 11632 10364 13116 9681 7353 7901 7894
2155.4I017H341A2171A4916A2518D493c70a611d573a0766i935e210A533B956D912C861
$$ 9017 8341 12171 14916 12518 4493 -370 -1611 -4573 -10766 -9935 -5210 1533 2956 4912 3861
2150.7B376A136B853D102E409D177B571B236B566E065C181A008A382i17d56B836H98
$$ 2376 1136 2853 4102 5409 4177 2571 2236 2566 5065 3181 1008 1382 -917 -456 2836 898
2145.7A0a493e131A886B823D060B970A511A585C018C922C130B041B337B648B874B666
$$ 10 -1493 -5131 1886 2823 4060 2970 1511 1585 3018 3922 3130 2041 2337 2648 2874 2666
2140.8A710B492C585D422G110H469A0447G779G711G906G888F302D790C262C626G16
$$ 1710 2492 3585 4422 7110 8469 10447 7779 7711 7906 7888 6302 4790 3262 3626 716
2136.1A704E569E599B078B468d96A406D93B594A213C003E237E675F604A2566A3850
$$ 1704 5569 5599 2078 2468 -496 1406 493 2594 1213 3003 5237 5675 6604 12566 13850
2131.4A5859B1607C5401E2671F6810F9878F2133E7927E8276F2794F0638E1868D2558
$$ 15859 21607 35401 52671 66810 69878 62133 57927 58276 62794 60638 51868 42558
2127.6C1580B1371A6268A2534I932I811F873F364G991G820H042C843C088E158F729
$$ 31580 21371 16268 12534 9932 9811 6873 6364 7991 7820 8042 3843 3088 5158 6729
2123.2E073G813I231H038F546D929F216I517H535C186D082E798G540D943A500C044
$$ 5073 7813 9231 8038 6546 4929 6216 9517 8535 3186 4082 5798 7540 4943 1500 3044
2118.5D229C503B639A576B62a564b238b081i58a113c100G96A689a105c834b302h19
$$ 4229 3503 2639 1576 262 -1564 -2238 -2081 -958 -1113 -3100 796 1689 -1105 -3834 -2302 -819
2113.6a89c4c48a806b791f99A698b44B009A869A834e7A708A023b84a482b587a446e99
$$ -189 -34 -348 -1806 -2791 -699 1698 -244 2009 1869 1834 -57 1708 1023 -284 -1482 -2587 -1446 -599
2108f73H31b42c679a970e266e700d864b803c96B81c333e539d100b750c899a808b263
$$ -673 831 -242 -3679 -1970 -5266 -5700 -4864 -2803 -396 281 -3333 -5539 -4100 -2750 -3899 -1808 -2263
2102.8c551g02b909b914c528e244c09a8a263d29c467e813b566f321f962c227c76c879
$$ -3551 -702 -2909 -2914 -3528 -5244 -309 -18 -1263 -429 -3467 -5813 -2566 -6321 -6962 -3227 -376 -3879
2097.5d774a733c101b884d48H69f21A514a967f62d689a691A26b542i16d839e577d298
$$ -4774 -1733 -3101 -2884 -448 869 -621 1514 -1967 -662 -4689 -1691 126 -2542 -916 -4839 -5577 -4298
2092.2c306b585c441c059c626c821b266c433a191a816c059g387h049d079b984e607
$$ -3306 -2585 -3441 -3059 -3626 -3821 -2266 -3433 -1191 -1816 -3059 -7387 -8049 -4079 -2984 -5607
2087.5d827b119c702c979d729a899b208a754a114F58c521b989b780c316a669a741e838
$$ -4827 -2119 -3702 -3979 -4729 -1899 -2208 -1754 -1114 658 -3521 -2989 -2780 -3316 -1669 -1741 -5838
2082.6d459d946c153c125a809b849a642a964d165a445b085c114df92B960B198B026
$$ -4459 -4946 -3153 -3125 -1809 -2849 -1642 -1964 -4165 -1445 -2085 -3114 -4 -692 2960 2198 2026
2077.6b554b409a321A75c251a631A198A225B764b28f24c224a778A45g33b61a621d978
$$ -2554 -2409 -1321 175 -3251 -1631 1198 1225 2764 -228 -624 -3224 -1778 145 -733 -261 -1621 -4978
2072.3D04H66c563a976B467G4c717a838b560b653b896a936A225I23A150H61b778a950
$$ 404 866 -3563 -1976 2467 74 -3717 -1838 -2560 -2653 -2896 -1936 1225 923 1150 861 -2778 -1950
2067.1c341a035A96F739A7566A2818C640C348d3c543c504b467D6A102a213b781b308
$$ -3341 -1035 196 6739 17566 12818 3640 3348 -43 -3543 -3504 -2467 46 1102 -1213 -2781 -2308
2062.1a495e03G49b891b838a09g64e3A320g7b603b039b334a918c673e934c022a018
$$ -1495 -503 749 -2891 -2838 -109 -764 -53 1320 -77 -2603 -2039 -2334 -1918 -3673 -5934 -3022 -1018
2056.9G73b709b603c438g1a571c016B89b658A220c28d43c843d219a288D84h21a668
$$ 773 -2709 -2603 -3438 -71 -1571 -3016 289 -2658 1220 -328 -443 -3843 -4219 -1288 484 -821 -1668
2051.6B48A137A231F18a448a773g61b284f074g600f321b678c142b401d252b076f76
$$ 248 1137 1231 618 -1448 -1773 -761 -2284 -6074 -7600 -6321 -2678 -3142 -2401 -4252 -2076 -676
2046.6i66g34a033a754b641g98a181c794f429D8F58b469A222a8i26e30a329a804d040
$$ -966 -734 -1033 -1754 -2641 -798 -1181 -3794 -6429 48 658 -2469 1222 -18 -926 -530 -1329 -1804 -4040
2041.1a055b348b954a388a204C63b770H83c317i287g138d226b783e929d391c783g366
$$ -1055 -2348 -2954 -1388 -1204 363 -2770 883 -3317 -9287 -7138 -4226 -2783 -5929 -4391 -3783 -7366
2036.1c977f10D2f63c034a326d126a823b223b446A33b928b373c398d897c499c513a540
$$ -3977 -610 42 -663 -3034 -1326 -4126 -1823 -2223 -2446 133 -2928 -2373 -3398 -4897 -3499 -3513 -1540
2030.8I49A222b864b57a288H68a05b184d008a749d96a316A326C598f90d001c117Db113
$$ 949 1222 -2864 -257 -1288 868 -105 -2184 -4008 -1749 -496 -1316 1326 3598 -690 -4001 -3117 4 -2113
2025.3c139f728e195d483d624e271h03b390b130b591b071a672b119e712d155f189c874
$$ -3139 -6728 -5195 -4483 -4624 -5271 -803 -2390 -2130 -2591 -2071 -1672 -2119 -5712 -4155 -6189 -3874
2020.3c329c705d021e042a936a039g98b248f699f374g740d156e940i013g313c504c121
$$ -3329 -3705 -4021 -5042 -1936 -1039 -798 -2248 -6699 -6374 -7740 -4156 -5940 -9013 -7313 -3504 -3121
2015.3d914f491i594g388e105e508g293e334e566g712i420g557a0704a1006h540f309
$$ -4914 -6491 -9594 -7388 -5105 -5508 -7293 -5334 -5566 -7712 -9420 -7557 -10704 -11006 -8540 -6309
2010.7e865e616g783f583e961d847d765e688h436f894e215f712g461a0791i918a0524
$$ -5865 -5616 -7783 -6583 -5961 -4847 -4765 -5688 -8436 -6894 -5215 -6712 -7461 -10791 -9918 -10524
2006a1366f973g503a1335i565h697e546c957c897e038g763f918e481f196c854c033
$$ -11366 -6973 -7503 -11335 -9565 -8697 -5546 -3957 -3897 -5038 -7763 -6918 -5481 -6196 -3854 -3033
2001.3f734i839a1924a0181f750a934a161c866b071f45c226F07d316e131c993b327
$$ -6734 -9839 -11924 -10181 -6750 -1934 -1161 -3866 -2071 -645 -3226 607 -4316 -5131 -3993 -2327
1996.6c678e792f624d989f123e898e456c682f689f408e806b032A285g42a736d308d319
$$ -3678 -5792 -6624 -4989 -6123 -5898 -5456 -3682 -6689 -6408 -5806 -2032 1285 -742 -1736 -4308 -4319
1991.7b332c326a906b244b151a624b706a068a488c089b892b193c651a656a255B486
$$ -2332 -3326 -1906 -2244 -2151 -1624 -2706 -1068 -1488 -3089 -2892 -2193 -3651 -1656 -1255 2486
1987I84a547B976A731I89B98B175B312A91d409c026d465d579d645b947A483A997a105
$$ 984 -1547 2976 1731 989 298 2175 2312 191 -4409 -3026 -4465 -4579 -4645 -2947 1483 1997 -1105
1981.7a696h0b241b46G27Ib371e385e899f085f685b255B208A29I2I40A941h58c473
$$ -1696 -80 -2241 -246 727 9 -2371 -5385 -5899 -6085 -6685 -2255 2208 129 92 940 1941 -858 -3473
1976.2H62a180a224c857b516a713A746a448b336a150i25a316c535a261c619c190d383
$$ 862 -1180 -1224 -3857 -2516 -1713 1746 -1448 -2336 -1150 -925 -1316 -3535 -1261 -3619 -3190 -4383
1971.2e529i484f860e667e364g496g621c926c342e006c668b781a478a843a584A801
$$ -5529 -9484 -6860 -5667 -5364 -7496 -7621 -3926 -3342 -5006 -3668 -2781 -1478 -1843 -1584 1801
1966.5C466A258A506A406b629e74a380A81d547b89C31H58E79A418F52A048A139F04
$$ 3466 1258 1506 1406 -2629 -574 -1380 181 -4547 -289 331 858 579 1418 652 1048 1139 604
1961.3F67A017A648a018b286A975A711G64d097c276a344g463c569a586a618e730f946
$$ 667 1017 1648 -1018 -2286 1975 1711 764 -4097 -3276 -1344 -7463 -3569 -1586 -1618 -5730 -6946
1956.3c332d209c469e389f603e551b309A584A869i92c794d709b058d39e726a904c76
$$ -3332 -4209 -3469 -5389 -6603 -5551 -2309 1584 1869 -992 -3794 -4709 -2058 -439 -5726 -1904 -376
1951.3c691f742d543g938h962g868d922e116e811e793d697a773b776b344i88b06b79
$$ -3691 -6742 -4543 -7938 -8962 -7868 -4922 -5116 -5811 -5793 -4697 -1773 -2776 -2344 -988 -206 -279
1946.4d595e566e666d181c913a602b59c424h415g627a0358a0942i968a1346a1229i066
$$ -4595 -5566 -5666 -4181 -3913 -1602 -259 -3424 -8415 -7627 -10358 -10942 -9968 -11346 -11229 -9066
1941.7g534c049c561e581g803h766h771a3354a2236h497g150g729e127d656f664f441
$$ -7534 -3049 -3561 -5581 -7803 -8766 -8771 -13354 -12236 -8497 -7150 -7729 -5127 -4656 -6664 -6441
1937g591h271a0884g598h309d829c090b484b50c075d073f019a1174c134b401c846b193
$$ -7591 -8271 -10884 -7598 -8309 -4829 -3090 -2484 -250 -3075 -4073 -6019 -11174 -3134 -2401 -3846 -2193
1932c01b84C854D799C721B063b202H893F663b096B539B016a395a244A126c584B69H303
$$ -301 -284 3854 4799 3721 2063 -2202 8893 6663 -2096 2539 2016 -1395 -1244 1126 -3584 269 8303
1926.8d785f873a703e5a69G387B3996C2898C9226E4484E5963C7414B0449A7052A8282
$$ -4785 -6873 -1703 -55 -169 7387 23996 32898 39226 54484 55963 37414 20449 17052 18282
1922.4A4066A0700I884I571A2217A5155A5955A3990A0404A2534I623I574F178B956
$$ 14066 10700 9884 9571 12217 15155 15955 13990 10404 12534 9623 9574 6178 2956
1918.3E403B819C986F215E571G345F411C174F863F798G491A1815A4130B5442C8623
$$ 5403 2819 3986 6215 5571 7345 6411 3174 6863 6798 7491 11815 14130 25442 38623
1913.9E2514F1564E8813D6766C1474B0778A8255A5779A9208A9960B0759B1125A8231
$$ 52514 61564 58813 46766 31474 20778 18255 15779 19208 19960 20759 21125 18231
1910.1A5919A3763A3555A1356G421A462a46B80H549B2288C9611D7050D7719D0968B9969
$$ 15919 13763 13555 11356 7421 1462 -146 280 8549 22288 39611 47050 47719 40968 29969
1905.7A5642I403F477G126D035F41C19D63C1f133c581a033a668c864b080a788d178
$$ 15642 9403 6477 7126 4035 641 319 463 31 -6133 -3581 -1033 -1668 -3864 -2080 -1788 -4178
1900.8b737a975d791c998d336d757c847f031e972g71C908E058G902A9418C3531D9285
$$ -2737 -1975 -4791 -3998 -4336 -4757 -3847 -6031 -5972 -771 3908 5058 7902 19418 33531 49285
1896.1E6396E3206D8077C1448A9142A1963F939A801ab839e571d621b855b676e789g758
$$ 56396 53206 48077 31448 19142 11963 6939 1801 -1 -2839 -5571 -4621 -2855 -2676 -5789 -7758
1891.4e464f898c664b280f264i322a1966a1149g750f721f750e234f059g817g134h032
$$ -5464 -6898 -3664 -2280 -6264 -9322 -11966 -11149 -7750 -6721 -6750 -5234 -6059 -7817 -7134 -8032
1886.7g524e554e798d923c279f564e011e235h377g494d389d657c008c365c654c098
$$ -7524 -5554 -5798 -4923 -3279 -6564 -5011 -5235 -8377 -7494 -4389 -4657 -3008 -3365 -3654 -3098
1882.1c934a041c516b455a659h37d406d987d843e684e38e66f47B717D446B865c153
$$ -3934 -1041 -3516 -2455 -1659 -837 -4406 -4987 -4843 -5684 -538 -566 -647 2717 4446 2865 -3153
1877.1a953a851A315b1b63f6a223c442b642b081b532c67b012a220c344b198c263f292
$$ -1953 -1851 1315 -21 -263 -66 -1223 -3442 -2642 -2081 -2532 -367 -2012 -1220 -3344 -2198 -3263 -6292
1871.8g341f605d199c548e113h158a2364e302f941h197d827b705c356g124h918e865
$$ -7341 -6605 -4199 -3548 -5113 -8158 -12364 -5302 -6941 -8197 -4827 -2705 -3356 -7124 -8918 -5865
1867.1g009e490f616e367f929g479g193e665d993c241c943f404c748c661c257d271
$$ -7009 -5490 -6616 -5367 -6929 -7479 -7193 -5665 -4993 -3241 -3943 -6404 -3748 -3661 -3257 -4271
1862.5e731e929c897c314c206f42a851c808a933d173d021c465e479e768e098e159d591
$$ -5731 -5929 -3897 -3314 -3206 -642 -1851 -3808 -1933 -4173 -4021 -3465 -5479 -5768 -5098 -5159 -4591
1857.5f130c416c263c243a518c660a203a004e383d108e508c263C436A589c867b071
$$ -6130 -3416 -3263 -3243 -1518 -3660 -1203 -1004 -5383 -4108 -5508 -3263 3436 1589 -3867 -2071
1852.8A89i49c235c053b058E43A481G80c873a553a759a602A930A0863B3028C2100C6128
$$ 189 -949 -3235 -3053 -2058 543 1481 780 -3873 -1553 -1759 -1602 1930 10863 23028 32100 36128
1847.9C9511D2091D0513C4333C0988C1624C5894D0272D5476D7389D6454D2894C5079
$$ 39511 42091 40513 34333 30988 31624 35894 40272 45476 47389 46454 42894 35079
1844.1B6799A8253F443I31a534a448B21i81E52b500a058E81d19C936E336I618A3459
$$ 26799 18253 6443 931 -1534 -1448 221 -981 552 -2500 -1058 581 -419 3936 5336 9618 13459
1839.1A2595B3218C4038D6289E5576E3919E3066D8897D0274C6201C6864D4771D9549
$$ 12595 23218 34038 46289 55576 53919 53066 48897 40274 36201 36864 44771 49549
1835.3E4584E9118E3998D2834B7546A6729F698D677b795A993h21b565B44H73C719D714
$$ 54584 59118 53998 42834 27546 16729 6698 4677 -2795 1993 -821 -2565 244 873 3719 4714
1830.6a179a576a422A506D87b596b467G99H73B394E80e896f396f461d989d450a43A91
$$ -1179 -1576 -1422 1506 487 -2596 -2467 799 873 2394 580 -5896 -6396 -6461 -4989 -4450 -143 191
1825.3c504f268b618i51e328i308e823b903a898b57d569c308f634a196a784c444c962
$$ -3504 -6268 -2618 -951 -5328 -9308 -5823 -2903 -1898 -257 -4569 -3308 -6634 -1196 -1784 -3444 -3962
1820.4a776b874h50D1a271a438h90d356b296e666b379a446f394b064c544C128B634
$$ -1776 -2874 -850 41 -1271 -1438 -890 -4356 -2296 -5666 -2379 -1446 -6394 -2064 -3544 3128 2634
1815.4F69a104d826c029b275h19E407b316d702A114b093B80D624B258e368e471d86
$$ 669 -1104 -4826 -3029 -2275 -819 5407 -2316 -4702 1114 -2093 280 4624 2258 -5368 -5471 -486
1810.4e014d631e342c774a403b348b188b772e719d078h373a2662e896g113f486a0476
$$ -5014 -4631 -5342 -3774 -1403 -2348 -2188 -2772 -5719 -4078 -8373 -12662 -5896 -7113 -6486 -10476
1805.8a3082a1934a5156a4248a9065a6548a2796h106c548f941g531f579h094h997a427
$$ -13082 -11934 -15156 -14248 -19065 -16548 -12796 -8106 -3548 -6941 -7531 -6579 -8094 -8997 -1427
1801.4c808b271d25a233h341a0610a2421h106c882b108A274A078e48e38D58b588a784
$$ -3808 -2271 -425 -1233 -8341 -10610 -12421 -8106 -3882 -2108 1274 1078 -548 -538 458 -2588 -1784
1796.4a948b558a462b995A829C540C846F492D186d953f138g651d233f728a7754b4667
$$ -1948 -2558 -1462 -2995 1829 3540 3846 6492 4186 -4953 -6138 -7651 -4233 -6728 -17754 -24667
1791.7a2169e590a6171a4702g913a2094a307b3149C1213A3046a585A0364A7676H12
$$ -12169 -5590 -16171 -14702 -7913 -12094 -1307 -23149 31213 13046 -1585 10364 17676 812
1787.6I793A8376F667A6900B8794D5227H9878A30778I1252D4306B1703A2778B636B701
$$ 9793 18376 6667 16900 28794 45227 89878 130778 91252 44306 21703 12778 2636 2701
1783.5b268E372F9A0323I649H328C026B014B235f8d877c032a388b164D714B139D145
$$ -2268 5372 69 10323 9649 8328 3026 2014 2235 -68 -4877 -3032 -1388 -2164 4714 2139 4145
1778.6C353F198E839E560H011H206I406A1579A4119A4900B3562E0704A09960A22377
$$ 3353 6198 5839 5560 8011 8206 9406 11579 14119 14900 23562 50704 109960 122377
1774.5H0650D0274B1416G339E617A298A621D588D838e2H36a86B078D796G150G772A4707
$$ 80650 40274 21416 7339 5617 1298 1621 4588 4838 -52 836 -186 2078 4796 7150 7772 14707
1769.5A8851B7336D4122H5444A42742A18434F3884C4654B2502A2682H083D506E490
$$ 18851 27336 44122 85444 142742 118434 63884 34654 22502 12682 8083 4506 5490
1765.7F726G591E133B303B282H34D856C147A010i73b653B616G825G403I838D889F471
$$ 6726 7591 5133 2303 2282 834 4856 3147 1010 -973 -2653 2616 7825 7403 9838 4889 6471
1760.7H031E384C711D364G491H769A2059A9004C0400E6596A16168A60807A14947E8099
$$ 8031 5384 3711 4364 7491 8769 12059 19004 30400 56596 116168 160807 114947 58099
1756.7C2289B1203A2864A0416A3166A2483A3596A9048A8701A8188A6160A2034I031
$$ 32289 21203 12864 10416 13166 12483 13596 19048 18701 18188 16160 12034 9031
1752.9H897I288A3896B0029A8275B0979A5394A0379G314C303E399F190D211C671D604
$$ 8897 9288 13896 20029 18275 20979 15394 10379 7314 3303 5399 6190 4211 3671 4604
1748.5F559G768F873A7081A8417A7449A6939A6491A4874A4182A5379A9079B6688C3058
$$ 6559 7768 6873 17081 18417 17449 16939 16491 14874 14182 15379 19079 26688 33058
1744.4C9053D2181C8401C3576B6451B3973B2808B3838B8985C3314C4902C1869B5133
$$ 39053 42181 38401 33576 26451 23973 22808 23838 28985 33314 34902 31869 25133
1740.6A7733G938D870C370H952I249E553A449E487H189A0791A7361B3130B6317B1425
$$ 17733 7938 4870 3370 8952 9249 5553 1449 5487 8189 10791 17361 23130 26317 21425
1736.2A5004A0539I796H066A4273A3869A8721B4390C1083C2999B8811B1234A7202A3393
$$ 15004 10539 9796 8066 14273 13869 18721 24390 31083 32999 28811 21234 17202 13393
1732.1H908I123I438F729A1070A2383H539H849A1534A2969A0598A0028A8011B1890
$$ 8908 9123 9438 6729 11070 12383 8539 8849 11534 12969 10598 10028 18011 21890
1728C1657D1708D9247E6151F3988F4814F6867F9373G0064G2493G4873G6588G9678H1130
$$ 31657 41708 49247 56151 63988 64814 66867 69373 70064 72493 74873 76588 79678 81130
1723.9G8731H2491H3231G9443F4652E6157E0993D4242C6149C0784C1613C0799C4026
$$ 78731 82491 83231 79443 64652 56157 50993 44242 36149 30784 31613 30799 34026
1720.1C2806C2341C2358C0714B8451C3496D0386D0964D8321E5383E7328E8288E9227
$$ 32806 32341 32358 30714 28451 33496 40386 40964 48321 55383 57328 58288 59227
1716.3F6479G4320H4194H1987G8398F8424F5650F2664F1668F5154G1721H3778H2244
$$ 66479 74320 84194 81987 78398 68424 65650 62664 61668 65154 71721 83778 82244
1712.5G0546F1730E5133D7767C8170C5119C5423D0364C9979C4111C2858B6773B7485
$$ 70546 61730 55133 47767 38170 35119 35423 40364 39979 34111 32858 26773 27485
1708.7C3132C8153C4548C2168C7960D6960D7580E1971F2759F7523F7992G3931F8567
$$ 33132 38153 34548 32168 37960 46960 47580 51971 62759 67523 67992 73931 68567
1704.9E4629C6429B5488B6988B4863B5736B6336C0554C5497C9187D1709D8562D9642
$$ 54629 36429 25488 26988 24863 25736 26336 30554 35497 39187 41709 48562 49642
1701.1E6601F9217I0066I8518A03871A10023A19350A24611A45217A74958A79851A72300
$$ 56601 69217 90066 98518 103871 110023 119350 124611 145217 174958 179851 172300
1697.6A69884A77252A84506A85839A86274A89441B02476B08558B02623A98144A92420
$$ 169884 177252 184506 185839 186274 189441 202476 208558 202623 198144 192420
1694.4A87373A84874A84254A83748A85278A86422A78570A73658A71766A77653A74248
$$ 187373 184874 184254 183748 185278 186422 178570 173658 171766 177653 174248
1691.2A62259A51523A45537A38468A32780A29796A25196A13343A07542A11891A20549
$$ 162259 151523 145537 138468 132780 129796 125196 113343 107542 111891 120549
1688A13275I6969H4288G4228F5343E7804E6614E8724E1519D7486D5032D2559C8321
$$ 113275 96969 84288 74228 65343 57804 56614 58724 51519 47486 45032 42559 38321
1684.2C4805B9200B5784B3599A9981A9446B0631A4301A6324A5758A5155A1119A5283
$$ 34805 29200 25784 23599 19981 19446 20631 14301 16324 15758 15155 11119 15283
1680.4A6551A3994A2784A0221A3327A8153A7183A5939A4766A1813A1691A4459A4816
$$ 16551 13994 12784 10221 13327 18153 17183 15939 14766 11813 11691 14459 14816
1676.6A4008A1930I141A2979A4581A5862A9972A8493A9248B1656A8547A6518A5256
$$ 14008 11930 9141 12979 14581 15862 19972 18493 19248 21656 18547 16518 15256
1672.8A9106A9908A7192B1190B2397B5306B6340B5367B1161B6054B3269B1915A8756
$$ 19106 19908 17192 21190 22397 25306 26340 25367 21161 26054 23269 21915 18756
1669A7249A9602B0643B2234B2698B1859B3086A9431A9581B1647B7161B8614B7181B6492
$$ 17249 19602 20643 22234 22698 21859 23086 19431 19581 21647 27161 28614 27181 26492
1664.9B8551B8308B9287B6641B4307B7151B6746C0294C1237B8792B9146B6649B7269
$$ 28551 28308 29287 26641 24307 27151 26746 30294 31237 28792 29146 26649 27269
1661.1B7678B9138B9958B7491B7255B9456B5545B2387B7654B7364B5402B6879B7783
$$ 27678 29138 29958 27491 27255 29456 25545 22387 27654 27364 25402 26879 27783
1657.3B7589B9930C4146C2113B9152B8257C0259C1092C3059C4299B9446C4414C4368
$$ 27589 29930 34146 32113 29152 28257 30259 31092 33059 34299 29446 34414 34368
1653.5C6545C8129C6861D2069D3654C9180C7674C6096D1964D0156D1309D4543D5714
$$ 36545 38129 36861 42069 43654 39180 37674 36096 41964 40156 41309 44543 45714
1649.7D6771D7181D7114D5754D7354E1568E3204E4589E4708E8711F4251F6953F6114
$$ 46771 47181 47114 45754 47354 51568 53204 54589 54708 58711 64251 66953 66114
1645.9F7941G0056G5155G6792G9894H5745H7542I1899I4951A04544A09305A11614A14830
$$ 67941 70056 75155 76792 79894 85745 87542 91899 94951 104544 109305 111614 114830
1642.1A21463A26815A30621A32733A40915A45335A45864A48993A50952A55796A52335
$$ 121463 126815 130621 132733 140915 145335 145864 148993 150952 155796 152335
1638.8A51558A51283A54169A49489A44076A37769A43040A47313A45012A37064A38411
$$ 151558 151283 154169 149489 144076 137769 143040 147313 145012 137064 138411
1635.6A44919A46171A45960A43249A44671A44608A36936A36069A42401A48103A44669
$$ 144919 146171 145960 143249 144671 144608 136936 136069 142401 148103 144669
1632.4A45547A62826A72688A76498A85781B03958B29446B50678B69991B96931C33064
$$ 145547 162826 172688 176498 185781 203958 229446 250678 269991 296931 333064
1629.2C75339D26148D83634E51731F33173G34859H62626A033029A250496A561379B048953
$$ 375339 426148 483634 551731 633173 734859 862626 1033029 1250496 1561379 2048953
1626B712746C280238C664254D156093E203328F779132H214588I113356I929122A1254324
$$ 2712746 3280238 3664254 4156093 5203328 6779132 8214588 9113356 9929122 11254324
1623.1A2976255A4810393A6443305A7850933A8817081A9402956B0856095B3296215
$$ 12976255 14810393 16443305 17850933 18817081 19402956 20856095 23296215
1620.7B5535250B5610280B4408785B4565088B6318780B7732310B7490100B7026620
$$ 25535250 25610280 24408785 24565088 26318780 27732310 27490100 27026620
1618.4B7598953B8309265B8553535B8677085B9341660B9721723B8713725B7237335
$$ 27598953 28309265 28553535 28677085 29341660 29721723 28713725 27237335
1616B6599660B6557643B5134788B2830885B1534158B1036375A9752245A7611326A6066594
$$ 26599660 26557643 25134788 22830885 21534158 21036375 19752245 17611326 16066594
1613.4A5450548A4722963A2956328A1044579I887463I141804G960552F559767E551271
$$ 15450548 14722963 12956328 11044579 9887463 9141804 7960552 6559767 5551271
1610.8D928283D366402C705737C083043B602883B251107A997372A810238A656466A518421
$$ 4928283 4366402 3705737 3083043 2602883 2251107 1997372 1810238 1656466 1518421
1607.9A401753A299134A207738A131548A063063I99217I42214H95539H44494H00377
$$ 1401753 1299134 1207738 1131548 1063063 999217 942214 895539 844494 800377
1604.9G61191G20619F84224F54427F23738E88077E54546E29376E05318D80977D53631
$$ 761191 720619 684224 654427 623738 588077 554546 529376 505318 480977 453631
1601.7D38100D27549D01284C71173C46599C27458C09031B83239B61912B46004B30407
$$ 438100 427549 401284 371173 346599 327458 309031 283239 261912 246004 230407
1598.5B09229A94254A89196A79186A68381A55119A49523A50257A40393A26733A22496
$$ 209229 194254 189196 179186 168381 155119 149523 150257 140393 126733 122496
1595.3A27236A20081A11549A06801A09326A11565A05599I9728I7664I9825I7327I3679
$$ 127236 120081 111549 106801 109326 111565 105599 99728 97664 99825 97327 93679
1591.8I2529I1366I3896I4363I0939I2654I1529H9364H6802H4119H1517G8917G7364
$$ 92529 91366 93896 94363 90939 92654 91529 89364 86802 84119 81517 78917 77364
1588G5808H0169G6784G4521G0587G1371G1982G0525G2331G2367F9920F9211F8577F8786
$$ 75808 80169 76784 74521 70587 71371 71982 70525 72331 72367 69920 69211 68577 68786
1583.9F6788F7961G2624G3306G2791G1579G2364G0870G4841G8164G5348G7914H5096
$$ 66788 67961 72624 73306 72791 71579 72364 70870 74841 78164 75348 77914 85096
1580.1I5136A03311A14693A28461A43516A50266A56066A52338A53911A42033A26378
$$ 95136 103311 114693 128461 143516 150266 156066 152338 153911 142033 126378
1576.9A08651I1515H1393G4013F7313F5581F3564F4423F3429F1584F4127F8089G3852
$$ 108651 91515 81393 74013 67313 65581 63564 64423 63429 61584 64127 68089 73852
1573.1I7919A52499B00943A66214A25442A25059A77696A87115A24817G5348E1743D0343
$$ 97919 152499 200943 166214 125442 125059 177696 187115 124817 75348 51743 40343
1569.6C2481C1134B9243B4966B1581B0236A7001A6149A6305A7617A8001A5684A1941
$$ 32481 31134 29243 24966 21581 20236 17001 16149 16305 17617 18001 15684 11941
1565.8A1851A5211A7083A8871A8008A7684A7791A7598B3694B4203B4413B6837C2596
$$ 11851 15211 17083 18871 18008 17684 17791 17598 23694 24203 24413 26837 32596
1562D3128E6562G2957G9698H4923H4499H3875G6351F6784E1202C5933B8625B5121B6632
$$ 43128 56562 72957 79698 84923 84499 83875 76351 66784 51202 35933 28625 25121 26632
1557.9B5518B5087B5838B6970C1870D0891D9296F4775A03553A58659A50784A12989
$$ 25518 25087 25838 26970 31870 40891 49296 64775 103553 158659 150784 112989
1554.4A04678A42108A76593A37878I0130F4596E5415D9062D8549D7981D2511D1369
$$ 104678 142108 176593 137878 90130 64596 55415 49062 48549 47981 42511 41369
1550.9C7204C7236C8021C8782C8986D2751D0154D4258D8756E6581F2553F5468G0537
$$ 37204 37236 38021 38782 38986 42751 40154 44258 48756 56581 62553 65468 70537
1547.1H2784I9845A13659A15228A24233A42705A68059A81953A81088A79945A92160
$$ 82784 99845 113659 115228 124233 142705 168059 181953 181088 179945 192160
1543.8B12357B24583B19669B10615B12246B24960B31081B22706B15442B14751B20283
$$ 212357 224583 219669 210615 212246 224960 231081 222706 215442 214751 220283
1540.6B17327B10314B09922B18217B26379B19326B17378B27344B36278B30198B19994
$$ 217327 210314 209922 218217 226379 219326 217378 227344 236278 230198 219994
1537.4B14779B15245B16416B11258A99958A84941A66927A61189A54762A36786A17720
$$ 214779 215245 216416 211258 199958 184941 166927 161189 154762 136786 117720
1534.2I9570I0168H2406G6679F6057F2918F1911F2581F0426E8694F0300F5373F9256
$$ 99570 90168 82406 76679 66057 62918 61911 62581 60426 58694 60300 65373 69256
1530.4G1184G3252G5989G9911H3298H0089G8664G6429G9353G4018F7586F6697F2554
$$ 71184 73252 75989 79911 83298 80089 78664 76429 79353 74018 67586 66697 62554
1526.6E6308D7565D3284C9054C4108C0745B9168C4654C6751C3799C1725C3484C8003
$$ 56308 47565 43284 39054 34108 30745 29168 34654 36751 33799 31725 33484 38003
1522.8D5124D7519E4236G3486A18789A89064A81967A33078A17021A48476A89332A53086
$$ 45124 47519 54236 73486 118789 189064 181967 133078 117021 148476 189332 153086
1519.3A02461H4905G3759G2581G7770H2532H7518I1611H9043G8761G1708F4034E7816
$$ 102461 84905 73759 72581 77770 82532 87518 91611 89043 78761 71708 64034 57816
1515.5D7423C6093C1496B7833B6721B4046B1933A8994B4199B6760B7506C2311C5371
$$ 47423 36093 31496 27833 26721 24046 21933 18994 24199 26760 27506 32311 35371
1511.7D0983E5727G7692A25725A78864A58211A25369A27869A75105B03487A68186A35769
$$ 40983 55727 77692 125725 178864 158211 125369 127869 175105 203487 168186 135769
1508.2A17491A04359A05995A09685A04303I8211I7518A04134I5688H2145G3499F9863
$$ 117491 104359 105995 109685 104303 98211 97518 104134 95688 82145 73499 69863
1504.7E6326D4731D3907D3614D3714E0018E8711F6192G8554H8481I9274A05484A16299
$$ 56326 44731 43907 43614 43714 50018 58711 66192 78554 88481 99274 105484 116299
1500.9A30180A47941A59947A56733A49172A34728A24679A16374A09581A08524A05029
$$ 130180 147941 159947 156733 149172 134728 124679 116374 109581 108524 105029
1497.7A13229A27063A30583A33472A27594A28455A25191A17387A10026A02445I7212
$$ 113229 127063 130583 133472 127594 128455 125191 117387 110026 102445 97212
1494.4I9676A05158I9521H5379G7766H2403H9326H5765I3025H9674H1964H5952A01268
$$ 99676 105158 99521 85379 77766 82403 89326 85765 93025 89674 81964 85952 101268
1490.6A09107A03801A02573A12220A34774A73239B24059B73396C29304C99349E43177
$$ 109107 103801 102573 112220 134774 173239 224059 273396 329304 399349 543177
1487.4F89659G39803G38388H17319H67431G85251G31792F56245E22982D04879C45558
$$ 689659 739803 738388 817319 867431 785251 731792 656245 522982 404879 345558
1484.2B68844A86489A37694A13726I6978H1921G1441F3826F3897F2196E6398D8921
$$ 268844 186489 137694 113726 96978 81921 71441 63826 63897 62196 56398 48921
1480.7D1234C9911D6619E0283E1641E2436E8111F9181H3659H6587H7414I7500I5966
$$ 41234 39911 46619 50283 51641 52436 58111 69181 83659 86587 87414 97500 95966
1476.9I4958I9694A00260I1843I8058A01178H7915H0886G3554F3183F2867F8298F4430
$$ 94958 99694 100260 91843 98058 101178 87915 80886 73554 63183 62867 68298 64430
1473.1D8969D0332C6423C4599C3436C1003B9730C0039C4574C2486C2219C0668C3473
$$ 48969 40332 36423 34599 33436 31003 29730 30039 34574 32486 32219 30668 33473
1469.3C4589C7570D4336E4861G4313G7841H0466H5579H8445H0746H0417H8904H5006
$$ 34589 37570 44336 54861 74313 77841 80466 85579 88445 80746 80417 88904 85006
1465.5H2596H8163H8873G7404G0278F9458G1097F7618F5116F1232E6269E0796D9459
$$ 82596 88163 88873 77404 70278 69458 71097 67618 65116 61232 56269 50796 49459
1461.7D7228D9396E0061D3839D6048E3537E9021F5115F2661F5889E9777E6659E8674
$$ 47228 49396 50061 43839 46048 53537 59021 65115 62661 65889 59777 56659 58674
1457.9E3243D7230D7174D3359C8689C4367C3663C5335D1388D5667D7063D9292D7371
$$ 53243 47230 47174 43359 38689 34367 33663 35335 41388 45667 47063 49292 47371
1454.1E1219E1397E7580E9757E9264E3033D7593E0583E5283F1288E8016E4689E3000
$$ 51219 51397 57580 59757 59264 53033 47593 50583 55283 61288 58016 54689 53000
1450.3E7973F8014F6708F4380F0792F8140F9777F6381F5918F3577F6884F6081G1864
$$ 57973 68014 66708 64380 60792 68140 69777 66381 65918 63577 66884 66081 71864
1446.5G3226F9460G0477G0973G3108G1659G6120G5807G6039G8133H2326H7400I7153
$$ 73226 69460 70477 70973 73108 71659 76120 75807 76039 78133 82326 87400 97153
1442.7I6289A01466A04788A11614A17963A23669A31188A30557A29896A34351A41904
$$ 96289 101466 104788 111614 117963 123669 131188 130557 129896 134351 141904
1439.5A37683A34727A33718A34966A42365A58563A70442A70048A85331B13033B39220
$$ 137683 134727 133718 134966 142365 158563 170442 170048 185331 213033 239220
1436.3B54146B68323B82468B98885C20638C28189C32010C25285C23439C26274C31779
$$ 254146 268323 282468 298885 320638 328189 332010 325285 323439 326274 331779
1433.1C33112C21693C26124C43856C52521C41094C53812C83528D05006D32531D70494
$$ 333112 321693 326124 343856 352521 341094 353812 383528 405006 432531 470494
1429.8E24881F09264F72680F63609F89529G64268G00806E96939E46559E07874C72689
$$ 524881 609264 672680 663609 689529 764268 700806 596939 546559 507874 372689
1426.6B82759B63021A91921A38849A68714B25087B38841B70683C39399C90496D31058
$$ 282759 263021 191921 138849 168714 225087 238841 270683 339399 390496 431058
1423.4D82419E13788E21865E72098F24643F62903F89734G43584H01173H38461H85906
$$ 482419 513788 521865 572098 624643 662903 689734 743584 801173 838461 885906
1420.2I24256I56817I95001A055300A119569A176763A238334A318308A438915A594261
$$ 924256 956817 995001 1055300 1119569 1176763 1238334 1318308 1438915 1594261
1417.3A764677A985248B239809B514103B844611C323670C880728D475746E329281F581918
$$ 1764677 1985248 2239809 2514103 2844611 3323670 3880728 4475746 5329281 6581918
1414.4G992738I492394A0961810A2476680A5398055B0309339B8722818C9391325E0229915
$$ 7992738 9492394 10961810 12476680 15398055 20309339 28722818 39391325 50229915
1411.7F0603275G2395745I9687310A25840180A30003600A31224630A45683420A49770910
$$ 60603275 72395745 99687310 125840180 130003600 131224630 145683420 149770910
1409.4A34499790A29566200A16615630I2642760G1514530F1532050D7488765C2394105
$$ 134499790 129566200 116615630 92642760 71514530 61532050 47488765 32394105
1407B3102695A8241870A4736658A2134219A0426043I339210H436871G557641F830835
$$ 23102695 18241870 14736658 12134219 10426043 9339210 8436871 7557641 6830835
1404.4F288240E788651E369534E035125D675870D345152D099435C899741C699858C516761
$$ 6288240 5788651 5369534 5035125 4675870 4345152 4099435 3899741 3699858 3516761
1401.5C363238C192330B997881B832051B698620B558373B402382B270663B177249B070048
$$ 3363238 3192330 2997881 2832051 2698620 2558373 2402382 2270663 2177249 2070048
1398.6A974536A886128A812835A733838A668404A617368A558040A487591A435378A408160
$$ 1974536 1886128 1812835 1733838 1668404 1617368 1558040 1487591 1435378 1408160
1395.6A367893A316768A271894A223400A164306A143909A080726I32688H32711G63726
$$ 1367893 1316768 1271894 1223400 1164306 1143909 1080726 932688 832711 763726
1392.7F39908D24849C57119C09623B15746A44371A69032A92422A84208B43007C06329
$$ 639908 424849 357119 309623 215746 144371 169032 192422 184208 243007 306329
1389.5C28759C50534C58709C55883C48434C44299C20201C04651B97050B82633B61469
$$ 328759 350534 358709 355883 348434 344299 320201 304651 297050 282633 261469
1386.3B54399B52621B42474B25318B05728A99799A99762A98163A91341A89821A94121
$$ 254399 252621 242474 225318 205728 199799 199762 198163 191341 189821 194121
1383.1A99899B02826B13151B17938B14415B08591B11539B10381B04991A98074A91908
$$ 199899 202826 213151 217938 214415 208591 211539 210381 204991 198074 191908
1379.9A85519A77499A73171A74934A77172A75728A63958A63008A62521A59449A55678
$$ 185519 177499 173171 174934 177172 175728 163958 163008 162521 159449 155678
1376.6A56664A49661A47019A41573A35586A34656A30393A26382A26290A22240A22029
$$ 156664 149661 147019 141573 135586 134656 130393 126382 126290 122240 122029
1373.4A24173A22739A26831A30726A39561A45019A60520A81006A90691B03066B20160
$$ 124173 122739 126831 130726 139561 145019 160520 181006 190691 203066 220160
1370.2B39323B34122B35453B33753B16991B02796A93521A75599A58103A42450A26901
$$ 239323 234122 235453 233753 216991 202796 193521 175599 158103 142450 126901
1367A14578A06624I7653H7543G9086G4504G2951G0286F8174F9192F8603E9691E3174
$$ 114578 106624 97653 87543 79086 74504 72951 70286 68174 69192 68603 59691 53174
1363.2E2484E1412D7779D4196C7216B8161B2096A8644A8910B1083B4358B4728B9709
$$ 52484 51412 47779 44196 37216 28161 22096 18644 18910 21083 24358 24728 29709
1359.4C6567D2860D8208D9469E2511E3076E4037D9645D5338C9468C7369C6294C3144
$$ 36567 42860 48208 49469 52511 53076 54037 49645 45338 39468 37369 36294 33144
1355.6C5551C0916C0328C0959B9943C0964C4324D0039D2166D5589D5386D4185D5683
$$ 35551 30916 30328 30959 29943 30964 34324 40039 42166 45589 45386 44185 45683
1351.8D2636D4715D3986D3299D3576D7348D9571E0806E1247E1599E0163E0712D9719
$$ 42636 44715 43986 43299 43576 47348 49571 50806 51247 51599 50163 50712 49719
1348E1159D8679D7256D3401D0373D1946D5033D2248C6770C4109C1336B6834B7866B9625
$$ 51159 48679 47256 43401 40373 41946 45033 42248 36770 34109 31336 26834 27866 29625
1343.9B9333B6230B5621B7761B8496C1458C1534C3555B9119B6863B9729C3310C3691
$$ 29333 26230 25621 27761 28496 31458 31534 33555 29119 26863 29729 33310 33691
1340.1C0338B9716B9967C5526C8281C8135D0980D0954D1478D2849E0779E7582E8494
$$ 30338 29716 29967 35526 38281 38135 40980 40954 41478 42849 50779 57582 58494
1336.3F6051G8534H3871I3545A06899A38031A84040B47503C10334C65341D63772F45285
$$ 66051 78534 83871 93545 106899 138031 184040 247503 310334 365341 463772 645285
1332.8G42421G63019H18543H93669H36963G73836G27380F03658D63621C76916C08871
$$ 742421 763019 818543 893669 836963 773836 727380 603658 463621 376916 308871
1329.6B21662A58411A25360A03873H4896G1234F0788E6518E4254D9393D5549D1255
$$ 221662 158411 125360 103873 84896 71234 60788 56518 54254 49393 45549 41255
1326.1C7693C4458C5793C8603C9428C2601B9406C0862C2409C2478C1854C0099B8776
$$ 37693 34458 35793 38603 39428 32601 29406 30862 32409 32478 31854 30099 28776
1322.3B3631B3123B5041B6599B7281B4177B2245A9284B0963B3086B2082A8617A6304
$$ 23631 23123 25041 26599 27281 24177 22245 19284 20963 23086 22082 18617 16304
1318.5A8017B2419B0673A6864A9744A8473A8395A5374A5171A6776A5002A5146A0625
$$ 18017 22419 20673 16864 19744 18473 18395 15374 15171 16776 15002 15146 10625
1314.7A1659A3591A4294A2652A0298I498H080I933A0029A2468A3881A0860A0020A5339
$$ 11659 13591 14294 12652 10298 9498 8080 9933 10029 12468 13881 10860 10020 15339
1310.6A6478A5519A7472B0785B0749B2008B1571B1317B3448B1891B4219B6266B5686
$$ 16478 15519 17472 20785 20749 22008 21571 21317 23448 21891 24219 26266 25686
1306.8B5532B8349C0961B9735C1754C1166C3426C5907C6423C8098D0898C8451C7572
$$ 25532 28349 30961 29735 31754 31166 33426 35907 36423 38098 40898 38451 37572
1303C7324C5376C7011C6201C2075C3839C2726C5323C2578C1278B7853B6690B7755B3656
$$ 37324 35376 37011 36201 32075 33839 32726 35323 32578 31278 27853 26690 27755 23656
1298.9A9045A9097B1080A8223A4969A5339A7959A9672A6469A5319A2932A1763A0373
$$ 19045 19097 21080 18223 14969 15339 17959 19672 16469 15319 12932 11763 10373
1295.1H780G819G486G003H373H076G758E076G819H358H111A0178A0042H836G801D836
$$ 8780 7819 7486 7003 8373 8076 7758 5076 7819 8358 8111 10178 10042 8836 7801 4836
1290.4G421H210G816H750G743G218G303I594I234H950D711F153F945D662D703G403
$$ 7421 8210 7816 8750 7743 7218 7303 9594 9234 8950 4711 6153 6945 4662 4703 7403
1285.7I386A0649H936E661A872D306E056D851D365G647F424E126D161D538E717D376
$$ 9386 10649 8936 5661 1872 4306 5056 4851 4365 7647 6424 5126 4161 4538 5717 4376
1281.1A199D631F393F094E789B134A51A484G225E827D470E239E353A520D6C208B493
$$ 1199 4631 6393 6094 5789 2134 151 1484 7225 5827 4470 5239 5353 1520 46 3208 2493
1276.1A933A709D156D816C708D304C170B189A961A095H5C349C653E636B373E116F077
$$ 1933 1709 4156 4816 3708 4304 3170 2189 1961 1095 85 3349 3653 5636 2373 5116 6077
1271.1B010F89E09C17C953D807D159D935C098E295D121E114A065A329A999a048B944
$$ 2010 689 509 317 3953 4807 4159 4935 3098 5295 4121 5114 1065 1329 1999 -1048 2944
1266.1D952i93A264D754G331C778B40G54B888B903C417D670I86C51B659I59F88A366
$$ 4952 -993 1264 4754 7331 3778 240 754 2888 2903 3417 4670 986 351 2659 959 688 1366
1260.9A426E47E11A499D38A214G175F466D825F408F578H434E850D718C063B043D198
$$ 1426 547 511 1499 438 1214 7175 6466 4825 6408 6578 8434 5850 4718 3063 2043 4198
1255.9C017C307C308D003B378B502B334C674C988E383G305G562G751G191C795D616
$$ 3017 3307 3308 4003 2378 2502 2334 3674 3988 5383 7305 7562 7751 7191 3795 4616
1251.2F288D086D041G300G636E466D640C724E379E089D764D825D011E305D136A055
$$ 6288 4086 4041 7300 7636 5466 4640 3724 5379 5089 4764 4825 4011 5305 4136 1055
1246.6B848D60E15A783A561D428A837g06H00B109H24a129b71A406f92c518i55A846
$$ 2848 460 515 1783 1561 4428 1837 -706 800 2109 824 -1129 -271 1406 -692 -3518 -955 1846
1241.3C114i79A333C639F039D668B530b14c31a211a253a422A479B159B534E385E068
$$ 3114 -979 1333 3639 6039 4668 2530 -214 -331 -1211 -1253 -1422 1479 2159 2534 5385 5068
1236.3B354B682B78B024g2A753a702b551c704a038h4D28d888d238c258e370f649d849
$$ 2354 2682 278 2024 -72 1753 -1702 -2551 -3704 -1038 -84 428 -4888 -4238 -3258 -5370 -6649 -4849
1231.1d064d736e944g276d314c144b824d963e356f141d876c123a771c836c776d382
$$ -4064 -4736 -5944 -7276 -4314 -3144 -2824 -4963 -5356 -6141 -4876 -3123 -1771 -3836 -3776 -4382
1226.4a507b834a006B349B273B43H22a914c161i94A106e51h8B18g80a129c083a641
$$ -1507 -2834 -1006 2349 2273 243 822 -1914 -3161 -994 1106 -551 -88 218 -780 -1129 -3083 -1641
1221.1b868b994f984e939c123c972c951b301b584A008A195A818a458h89C04a956g053
$$ -2868 -2994 -6984 -5939 -3123 -3972 -3951 -2301 -2584 1008 1195 1818 -1458 -889 304 -1956 -7053
1216.2e754i432g124c836c804h056f821d688e545h611f074c156c918e046h794f726
$$ -5754 -9432 -7124 -3836 -3804 -8056 -6821 -4688 -5545 -8611 -6074 -3156 -3918 -5046 -8794 -6726
1211.5e804e619b814a524d676d646d184f771g836g169g234e939a764b336c369d004
$$ -5804 -5619 -2814 -1524 -4676 -4646 -4184 -6771 -7836 -7169 -7234 -5939 -1764 -2336 -3369 -4004
1206.8f035f771g079h766f964d274d665d075d468f176b101a241b941d589c532d741
$$ -6035 -6771 -7079 -8766 -6964 -4274 -4665 -4075 -4468 -6176 -2101 -1241 -2941 -4589 -3532 -4741
1202.1a922a733e006e988f818c393e121g708e996e573e551d558b148e732e841c479
$$ -1922 -1733 -5006 -5988 -6818 -3393 -5121 -7708 -5996 -5573 -5551 -4558 -2148 -5732 -5841 -3479
1197.5c948f347f803e773a724e224e916f133h504g845g464c683i96e586g481e792e040
$$ -3948 -6347 -6803 -5773 -1724 -5224 -5916 -6133 -8504 -7845 -7464 -3683 -996 -5586 -7481 -5792 -5040
1192.5g73C12a319a046e463h293g482h695e914c692a163c577c44d648e788h061f562
$$ -773 312 -1319 -1046 -5463 -8293 -7482 -8695 -5914 -3692 -1163 -3577 -344 -4648 -5788 -8061 -6562
1187.5d532i98g800f959d888c678e460e856c811d174e496c168h92e76c927c188f298
$$ -4532 -998 -7800 -6959 -4888 -3678 -5460 -5856 -3811 -4174 -5496 -3168 -892 -576 -3927 -3188 -6298
1182.5f973f560f288d916d907b287c169f153e634f522f059d400d948f474g822g187
$$ -6973 -6560 -6288 -4916 -4907 -2287 -3169 -6153 -5634 -6522 -6059 -4400 -4948 -6474 -7822 -7187
1177.9d193c427c453h486g808e752d034c081f182g291i282g201e369e313d991e973
$$ -4193 -3427 -3453 -8486 -7808 -5752 -4034 -3081 -6182 -7291 -9282 -7201 -5369 -5313 -4991 -5973
1173.2g766h511h802c685c223d957f081e841f321a0621h778e381d164c482a776a083
$$ -7766 -8511 -8802 -3685 -3223 -4957 -6081 -5841 -6321 -10621 -8778 -5381 -4164 -3482 -1776 -1083
1168.5a363c934b713b683f83c496c264b16c526A8D11b683b129d678f68h68a428C891
$$ -1363 -3934 -2713 -2683 -683 -3496 -3264 -216 -3526 18 411 -2683 -2129 -4678 -668 -868 -1428 3891
1163.3B075a253D1e26E97i07B392C359F1C270B093I2D93e88a133GG10A18b254a556
$$ 2075 -1253 41 -526 597 -907 2392 3359 61 3270 2093 92 493 -588 -1133 7 710 118 -2254 -1556
1157.4i44A633D061D516e10a299c558c498a807C852B618G79F59c13c248C61B213a869
$$ -944 1633 4061 4516 -510 -1299 -3558 -3498 -1807 3852 2618 779 659 -313 -3248 361 2213 -1869
1152.1D76E81A811C829E621D013E22b824c401e074a241I6b375a252g263h798i789a0118
$$ 476 581 1811 3829 5621 4013 522 -2824 -3401 -5074 -1241 96 -2375 -1252 -7263 -8798 -9789 -10118
1146.9i070f808d229b61d753d946i048a1673a1603f307d774c878c829f308b992b9D526
$$ -9070 -6808 -4229 -261 -4753 -4946 -9048 -11673 -11603 -6307 -4774 -3878 -3829 -6308 -2992 -29 4526
1141.9D763A030b053c426c599a121A197B004E69b137e859e325f163e672c655b207b839
$$ 4763 1030 -2053 -3426 -3599 -1121 1197 2004 569 -2137 -5859 -5325 -6163 -5672 -3655 -2207 -2839
1136.9d325c983g836g248f138d593a824c969d169i016e377d539c772c654b468e608
$$ -4325 -3983 -7836 -7248 -6138 -4593 -1824 -3969 -4169 -9016 -5377 -4539 -3772 -3654 -2468 -5608
1132.3g001g456c617G23F698A2866H144A515A139g88A48b199d556d915e141b049d244
$$ -7001 -7456 -3617 723 6698 12866 8144 1515 1139 -788 148 -2199 -4556 -4915 -5141 -2049 -4244
1127.3c009d834c183g69a183g378a0822h937g211e362c859f714e749f314a0051h555
$$ -3009 -4834 -3183 -769 -1183 -7378 -10822 -8937 -7211 -5362 -3859 -6714 -5749 -6314 -10051 -8555
1122.6a1433i463e276g346g647a0156a5761a2529a3134a3889a1858e984f263g044e993
$$ -11433 -9463 -5276 -7346 -7647 -10156 -15761 -12529 -13134 -13889 -11858 -5984 -6263 -7044 -5993
1118.2i399a1726a0576h636d199f116g762a1794a1015a3268a4000a1621a2558a0635
$$ -9399 -11726 -10576 -8636 -4199 -6116 -7762 -11794 -11015 -13268 -14000 -11621 -12558 -10635
1114.1i360a3899a4209a7219a3376a2210a3448a0828a2130i066i229i878a0562a1791
$$ -9360 -13899 -14209 -17219 -13376 -12210 -13448 -10828 -12130 -9066 -9229 -9878 -10562 -11791
1110.1a5331a4320a2753a2934a5978a6576a5380a6438a4279a2048a0902a1386a2010
$$ -15331 -14320 -12753 -12934 -15978 -16576 -15380 -16438 -14279 -12048 -10902 -11386 -12010
1106.3i536h984f510g467h789f841h273a2053a4444a4651a3803a3256i828a1148g972
$$ -9536 -8984 -6510 -7467 -8789 -6841 -8273 -12053 -14444 -14651 -13803 -13256 -9828 -11148 -7972
1101.9h632i598h038a0998e739b987c701f671f960g522h567d932e050g084h978a1856
$$ -8632 -9598 -8038 -10998 -5739 -2987 -3701 -6671 -6960 -7522 -8567 -4932 -5050 -7084 -8978 -11856
1097.2e401a407D64C122C213C312F309A2509B0112B1501B6021B7085B1159A5325A5841
$$ -5401 -1407 464 3122 3213 3312 6309 12509 20112 21501 26021 27085 21159 15325 15841
1092.8A7779A7181A6245A4157A0546H740F888H961A0367A3873A1379A6201A9765A9906
$$ 17779 17181 16245 14157 10546 8740 6888 8961 10367 13873 11379 16201 19765 19906
1088.7B4894C6066D1403D6501D8773D7543D1511C2463C0688B7043B8533B5137B0589
$$ 24894 36066 41403 46501 48773 47543 41511 32463 30688 27043 28533 25137 20589
1084.9A8498A2059A0404A1050I584A3331A3352A5884A6461A8693B1259B4259B6316
$$ 18498 12059 10404 11050 9584 13331 13352 15884 16461 18693 21259 24259 26316
1081.1C0546B8486B3814B0635A3788H563A1502A5354A1697I468D507H05c346a1804
$$ 30546 28486 23814 20635 13788 8563 11502 15354 11697 9468 4507 805 -3346 -11804
1077a2297h683f756g680g353e356g684i315a3953a2069h308f728i18D183D353D46b016
$$ -12297 -8683 -6756 -7680 -7353 -5356 -7684 -9315 -13953 -12069 -8308 -6728 -918 4183 4353 446 -2016
1072.1d800c826f214b649g38B362C829b715e418g839i960f431g492f482h861f282g844
$$ -4800 -3826 -6214 -2649 -738 2362 3829 -2715 -5418 -7839 -9960 -6431 -7492 -6482 -8861 -6282 -7844
1067.1g544a0675a2308a4574a2909i173g205g910i884a1527a5712a6166a2474a0689
$$ -7544 -10675 -12308 -14574 -12909 -9173 -7205 -7910 -9884 -11527 -15712 -16166 -12474 -10689
1063a0704g369i808i188i198i793g374c135b758A228b630d219f860g835g604a1869
$$ -10704 -7369 -9808 -9188 -9198 -9793 -7374 -3135 -2758 1228 -2630 -4219 -6860 -7835 -7604 -11869
1058.3a3263i879g360d874A842b893e941a0553a3580a2439a0776h550b338d648d949
$$ -13263 -9879 -7360 -4874 1842 -2893 -5941 -10553 -13580 -12439 -10776 -8550 -2338 -4648 -4949
1053.9i291a0246a0875a3276a0150e668b757g874a0716a6839a9258a8213a4204a0389
$$ -9291 -10246 -10875 -13276 -10150 -5668 -2757 -7874 -10716 -16839 -19258 -18213 -14204 -10389
1049.8a0292f569b104d715i071h149g013e748d166f381a0194d198d716a592c819e297
$$ -10292 -6569 -2104 -4715 -9071 -8149 -7013 -5748 -4166 -6381 -10194 -4198 -4716 -1592 -3819 -5297
1045.2h858a0010i513a2016a5653i788e533e643d029d555g236a1524a3859a3113h786
$$ -8858 -10010 -9513 -12016 -15653 -9788 -5533 -5643 -4029 -4555 -7236 -11524 -13859 -13113 -8786
1040.8f893c79A993D284G667H158E448a7D66A1304A2030I596C254A554E251G759I033
$$ -6893 -379 1993 4284 7667 8158 5448 -17 466 11304 12030 9596 3254 1554 5251 7759 9033
1035.8A1843b340i289a8929b1125a4056a4429a5679a7562b1454a0873h618a2471a5699
$$ 11843 -2340 -9289 -18929 -21125 -14056 -14429 -15679 -17562 -21454 -10873 -8618 -12471 -15699
1031.7a9374a0401h08F676H393A911B111A941a677F86A78B978C991E760E161C254E5
$$ -19374 -10401 -808 6676 8393 1911 2111 1941 -1677 686 178 2978 3991 5760 5161 3254 55
1026.7a631b567d98c646f518f119h496a2116a1296e946c907f308f712a1717a4792a8090
$$ -1631 -2567 -498 -3646 -6518 -6119 -8496 -12116 -11296 -5946 -3907 -6308 -6712 -11717 -14792 -18090
1022.1a9356a3395a1169e747d386c731b728B164D173C656A747G38h66B929I385A1974
$$ -19356 -13395 -11169 -5747 -4386 -3731 -2728 2164 4173 3656 1747 738 -866 2929 9385 11974
1017.4I589E113a338i298a1163g394i493a2113a2246i989d703E48C550G521G334D184
$$ 9589 5113 -1338 -9298 -11163 -7394 -9493 -12113 -12246 -9989 -4703 548 3550 7521 7334 4184
1012.7A321c770c079b212d810d114c663e606h424a6476a7799a9027a9800a5458a4053
$$ 1321 -3770 -3079 -2212 -4810 -4114 -3663 -5606 -8424 -16476 -17799 -19027 -19800 -15458 -14053
1008.3a3685a7083b2951a9381a7936b2182b0214b0268a3758e974B28B815E491H012
$$ -13685 -17083 -22951 -19381 -17936 -22182 -20214 -20268 -13758 -5974 228 2815 5491 8012
1004.2E923F219A1114A1888A2573A1340A1154F068A439a483f76b624b474d105h702
$$ 5923 6219 11114 11888 12573 11340 11154 6068 1439 -1483 -676 -2624 -2474 -4105 -8702
999.8a0383i919i228h597g160g987h723i879a0298a1581i295i399g626f108d081e62
$$ -10383 -9919 -9228 -8597 -7160 -7987 -8723 -9879 -10298 -11581 -9295 -9399 -7626 -6108 -4081 -562
995.2b677f248f248c121d349b638b808f826h378h848e118g014h858a4264a4767a1157
$$ -2677 -6248 -6248 -3121 -4349 -2638 -2808 -6826 -8378 -8848 -5118 -7014 -8858 -14264 -14767 -11157
990.5a2446a3294a3715a4591a3649a1523h822h648a1944a4696a4016i702a0305h912
$$ -12446 -13294 -13715 -14591 -13649 -11523 -8822 -8648 -11944 -14696 -14016 -9702 -10305 -8912
986.4a0594a3094a0856a0400a2199a2611a3859a1198a5027g812d874e875g000f977
$$ -10594 -13094 -10856 -10400 -12199 -12611 -13859 -11198 -15027 -7812 -4874 -5875 -7000 -6977
982.3g946h278a2339a2826a2251f168d955a798d492a1169a2926a0984a0283h526g319
$$ -7946 -8278 -12339 -12826 -12251 -6168 -4955 -1798 -4492 -11169 -12926 -10984 -10283 -8526 -7319
977.9g790d730f608g809g880a2040a6262a3673a1335a3360i880i366a0424a1858a4116
$$ -7790 -4730 -6608 -7809 -7880 -12040 -16262 -13673 -11335 -13360 -9880 -9366 -10424 -11858 -14116
973.5a7039a7676a9410a6879a3058a1724a0466a5081a8674a7293a4756a1496a1257
$$ -17039 -17676 -19410 -16879 -13058 -11724 -10466 -15081 -18674 -17293 -14756 -11496 -11257
969.7a3763a2190a0779h332a1586a1385a1421a0187a0963a0469a0174a0191a1562a1868
$$ -13763 -12190 -10779 -8332 -11586 -11385 -11421 -10187 -10963 -10469 -10174 -10191 -11562 -11868
965.6i811a0208i744a0923a0548h087i555e365d779d408e633g858g931c342b003c539
$$ -9811 -10208 -9744 -10923 -10548 -8087 -9555 -5365 -4779 -4408 -5633 -7858 -7931 -3342 -2003 -3539
961h483f458f174e186d801a049a148c253c137e072f673c763b820a325a583b300b370
$$ -8483 -6458 -6174 -5186 -4801 -1049 -1148 -3253 -3137 -5072 -6673 -3763 -2820 -1325 -1583 -2300 -2370
956d608f029h520a0289i615h909e062e83d093d871g459a1597a0323i355e155e491d346
$$ -4608 -6029 -8520 -10289 -9615 -8909 -5062 -583 -4093 -4871 -7459 -11597 -10323 -9355 -5155 -5491 -4346
951d884c004d701f994h281a1124h491g325h176e371e446f241i243a0749a0079a2949
$$ -4884 -3004 -4701 -6994 -8281 -11124 -8491 -7325 -8176 -5371 -5446 -6241 -9243 -10749 -10079 -12949
946.4a1253i434a0189a0446a0916a0501i477i868h620a1697a3149a2224a0807a3861
$$ -11253 -9434 -10189 -10446 -10916 -10501 -9477 -9868 -8620 -11697 -13149 -12224 -10807 -13861
942.3a2424a1049a1839g784h392a1571a1246a3850a2649h030h444a0409a0255i081
$$ -12424 -11049 -11839 -7784 -8392 -11571 -11246 -13850 -12649 -8030 -8444 -10409 -10255 -9081
938.2a1065i290h809h358i268a0510g608i801a2702a2164i995f068d786g513a1333
$$ -11065 -9290 -8809 -8358 -9268 -10510 -7608 -9801 -12702 -12164 -9995 -6068 -4786 -7513 -11333
933.8i741d425d153f974e416i240f092b051G21a573a190f061f270g610f289a403a316
$$ -9741 -4425 -4153 -6974 -5416 -9240 -6092 -2051 721 -1573 -1190 -6061 -6270 -7610 -6289 -1403 -1316
928.8A24i33b115B477c571e618c915a732a407d034d034d289c973e291g673f084g714
$$ 124 -933 -2115 2477 -3571 -5618 -3915 -1732 -1407 -4034 -4034 -4289 -3973 -5291 -7673 -6084 -7714
923.8g729a0160i512g711f796a620b31D069C453A449D339C088C211D428F262E551A214
$$ -7729 -10160 -9512 -7711 -6796 -1620 -231 4069 3453 1449 4339 3088 3211 4428 6262 5551 1214
918.9d16i97f368g354f924f153e354h441e017A74e321a0631i288a0977i191f85A2719
$$ -416 -997 -6368 -7354 -6924 -6153 -5354 -8441 -5017 174 -5321 -10631 -9288 -10977 -9191 -685 12719
913.9B0809B5923C1636C2812C6505D1475E3279F0303E8733E4329D5536C6804C0234
$$ 20809 25923 31636 32812 36505 41475 53279 60303 58733 54329 45536 36804 30234
910.1B5601B4779B4248A8454A6469H013a420e818h038a4260a4814h143f723e494f154
$$ 25601 24779 24248 18454 16469 8013 -1420 -5818 -8038 -14260 -14814 -8143 -6723 -5494 -6154
905.7f758d456c959f369a0098f562a730b483e474e274d765b130f415g743d772f549
$$ -6758 -4456 -3959 -6369 -10098 -6562 -1730 -2483 -5474 -5274 -4765 -2130 -6415 -7743 -4772 -6549
901i915a4687a3622a2815a2943h180g333a7039b1456a9597a4698a0843f123D96I383
$$ -9915 -14687 -13622 -12815 -12943 -8180 -7333 -17039 -21456 -19597 -14698 -10843 -6123 496 9383
896.7A5261B6383C0719C3034B5074E696E349E447F381a18E201A0589D589E934A908
$$ 15261 26383 30719 33034 25074 5696 5349 5447 6381 -118 5201 10589 4589 5934 1908
892.3C406C185A3306A5668H298A6829A5384B252c107g955b2433b1586a4430a3154a5624
$$ 3406 3185 13306 15668 8298 16829 15384 2252 -3107 -7955 -22433 -21586 -14430 -13154 -15624
887.9a6769a3155a2605a2416a5176a5131a7078a5360i118d359c018f328g982f481e558
$$ -16769 -13155 -12605 -12416 -15176 -15131 -17078 -15360 -9118 -4359 -3018 -6328 -7982 -6481 -5558
883.5i201h534h638i926i784e523d233e943i981i108g620g503g168c013c671c773b848
$$ -9201 -8534 -8638 -9926 -9784 -5523 -4233 -5943 -9981 -9108 -7620 -7503 -7168 -3013 -3671 -3773 -2848
878.5h02A743c99d30a588g482f311c785d388c809f944h09B139E703A226e694g090i726
$$ -802 1743 -399 -430 -1588 -7482 -6311 -3785 -4388 -3809 -6944 -809 2139 5703 1226 -5694 -7090 -9726
873.3a2138i384f310d659a51e33c504d138d242b608b469d643c187a924D37d708e453
$$ -12138 -9384 -6310 -4659 -151 -533 -3504 -4138 -4242 -2608 -2469 -4643 -3187 -1924 437 -4708 -5453
868.3e351d254f790f088e939e988h808d392b785e415a655b655f23a638c075e097g821
$$ -5351 -4254 -6790 -6088 -5939 -5988 -8808 -4392 -2785 -5415 -1655 -2655 -623 -1638 -3075 -5097 -7821
863.3g714e364b936a803e521h321e161c222b844d427b443a527c686e661g074d209A66
$$ -7714 -5364 -2936 -1803 -5521 -8321 -5161 -3222 -2844 -4427 -2443 -1527 -3686 -5661 -7074 -4209 166
858.4a395d79a848b129d813g664g823a0136a0010g763f579h085f075g113d803c289
$$ -1395 -479 -1848 -2129 -4813 -7664 -7823 -10136 -10010 -7763 -6579 -8085 -6075 -7113 -4803 -3289
853.7a954a058d173f652d329d616b489C48A154g23d887f89c058e523c636d451e634
$$ -1954 -1058 -4173 -6652 -4329 -4616 -2489 348 1154 -723 -4887 -689 -3058 -5523 -3636 -4451 -5634
848.7f865f912g097e453f381a448b190E00b336c002g96d571f090g438e834e854e321
$$ -6865 -6912 -7097 -5453 -6381 -1448 -2190 500 -2336 -3002 -796 -4571 -6090 -7438 -5834 -5854 -5321
843.8d510d044c408b458e568h023e364f701d198g89d174d811b824c389b554c758b342
$$ -4510 -4044 -3408 -2458 -5568 -8023 -5364 -6701 -4198 -789 -4174 -4811 -2824 -3389 -2554 -3758 -2342
838.8D24AG91d95c81a499D103A604B16a706C192C898I769F583B004I98B193B545B688
$$ 424 1 791 -495 -381 -1499 4103 1604 216 -1706 3192 3898 9769 6583 2004 998 2193 2545 2688
833.2B031B961F083A0927H933H557H854I078H741A0562A0653A0493A3525A3370A1308
$$ 2031 2961 6083 10927 8933 8557 8854 9078 8741 10562 10653 10493 13525 13370 11308
828.8A2254A1468A0946F480G243A1242A2742H192F669A0297A4196A3201A5265A5160
$$ 12254 11468 10946 6480 7243 11242 12742 8192 6669 10297 14196 13201 15265 15160
824.8A3398A2461I165I750A1646A1146A4791A3633H531A0073H500A0239I871H109A0662
$$ 13398 12461 9165 9750 11646 11146 14791 13633 8531 10073 8500 10239 9871 8109 10662
820.4I736A3116A5901A2393A1923A1560A3413A1660A0901A0866I286G979H303A2955
$$ 9736 13116 15901 12393 11923 11560 13413 11660 10901 10866 9286 7979 8303 12955
816.3A1340D131C398D879E159E358G141H008E588E048F870I554H807G250E829H771
$$ 11340 4131 3398 4879 5159 5358 7141 8008 5588 5048 6870 9554 8807 7250 5829 8771
811.6G366G999I973G436I698A1073A1057A2874A3656A3475A0151I968H229I784A1709
$$ 7366 7999 9973 7436 9698 11073 11057 12874 13656 13475 10151 9968 8229 9784 11709
807.2A1716A0540A4233A9649A6892A7611A5573A2889A6075A8379A8869B2679B6311
$$ 11716 10540 14233 19649 16892 17611 15573 12889 16075 18379 18869 22679 26311
803.4B6536B5659B5752B9600B8014B6361B5231B2465B7089B8356B8234B8794B5898
$$ 26536 25659 25752 29600 28014 26361 25231 22465 27089 28356 28234 28794 25898
799.6B2462B2700B1183B0511A9683B2503B0872B2476B3412B3751B2724B3405B6874
$$ 22462 22700 21183 20511 19683 22503 20872 22476 23412 23751 22724 23405 26874
795.8B9929C0129B6480B5848B6043B3309B4156B4111B3738B3709B2616B4903B0610
$$ 29929 30129 26480 25848 26043 23309 24156 24111 23738 23709 22616 24903 20610
792B0739B0696B0209A9127B0558A9110A6927A6938A6664A7433B0423A9254A8172A9538
$$ 20739 20696 20209 19127 20558 19110 16927 16938 16664 17433 20423 19254 18172 19538
787.9B3650B2053B0248B2144B0853B1108B2020A9088A7389A4095A1113A3716A3665
$$ 23650 22053 20248 22144 20853 21108 22020 19088 17389 14095 11113 13716 13665
784.1A3051A4002A5303A7451A9464A6472A3371A0626A3864A2936A1114A2078A1486
$$ 13051 14002 15303 17451 19464 16472 13371 10626 13864 12936 11114 12078 11486
780.3A3363A0971A0663A1612A2737A4379A4108A2916A4741A5969A6062A7978A4300
$$ 13363 10971 10663 11612 12737 14379 14108 12916 14741 15969 16062 17978 14300
776.5A3210A4149A3677A2273H539H264H969I621G142A1262A0331G018F756D408F793
$$ 13210 14149 13677 12273 8539 8264 8969 9621 7142 11262 10331 7018 6756 4408 6793
772.1G931I924I189H710I576F538F428H691G454G022I604A0985I721A0793I676H737
$$ 7931 9924 9189 8710 9576 6538 6428 8691 7454 7022 9604 10985 9721 10793 9676 8737
767.5A2799A6189A5384A5086A6475A8021A8397B2549B7135B9454B4164A8601A8277
$$ 12799 16189 15384 15086 16475 18021 18397 22549 27135 29454 24164 18601 18277
763.7A5828A4545A4160A7433A7319A6717B0034A9949B0217B1504B5438B5796B5275
$$ 15828 14545 14160 17433 17319 16717 20034 19949 20217 21504 25438 25796 25275
759.9B5632B3521B4939B4411A9466A8273B1819B1089B4503B4594B4653B3178B2169
$$ 25632 23521 24939 24411 19466 18273 21819 21089 24503 24594 24653 23178 22169
756.1B1878B2036B0287A9825B1263B2954B1489B1271B0204A7436B1256B2243B3837
$$ 21878 22036 20287 19825 21263 22954 21489 21271 20204 17436 21256 22243 23837
752.3B2761B3678B5428B1308B1452B3865B2688A7981A7035A5904A6809A7687A8603
$$ 22761 23678 25428 21308 21452 23865 22688 17981 17035 15904 16809 17687 18603
748.5B0317A8579B0976B2445B1801B2005B4102B5759B3761B5778B5713B6652B9759
$$ 20317 18579 20976 22445 21801 22005 24102 25759 23761 25778 25713 26652 29759
744.7B7860B6701C4140C4924C4386C4129C6638C7803D2016D4563D9828D9972E2044
$$ 27860 26701 34140 34924 34386 34129 36638 37803 42016 44563 49828 49972 52044
740.9E0369D6456D3616D2446D2938D6000D6108D7071E0321E3707E7924F1385F4398
$$ 50369 46456 43616 42446 42938 46000 46108 47071 50321 53707 57924 61385 64398
737.1F4705F3141E5405E3096E0788D5604D3271D0829C7593D2428D4722D7130E3194
$$ 64705 63141 55405 53096 50788 45604 43271 40829 37593 42428 44722 47130 53194
733.3E4873E2913E3929E0354D9071D7298D0763D0124D1348D1284D3701D1447D2009
$$ 54873 52913 53929 50354 49071 47298 40763 40124 41348 41284 43701 41447 42009
729.5D7927D7028D7850E0493E2631E5789F0127E9694F7586F8901F9316F9180G0133
$$ 47927 47028 47850 50493 52631 55789 60127 59694 67586 68901 69316 69180 70133
725.7F5164E8367E7963E8647F0939F5433G2366H2832H9268I5144A02459A05074A02665
$$ 65164 58367 57963 58647 60939 65433 72366 82832 89268 95144 102459 105074 102665
721.9I7289I1669H4473H0312G6943G1808G0989G4516G3094G6484H1383H9994I1016
$$ 97289 91669 84473 80312 76943 71808 70989 74516 73094 76484 81383 89994 91016
718.1I1806I3379I3818I3376H5248H2841H1956G6719H1687H1794G8835G9886G9958
$$ 91806 93379 93818 93376 85248 82841 81956 76719 81687 81794 78835 79886 79958
714.3G7106G5579G2376G1115G4463G6069G3203F9628F8255F7283F6671G0982F9824
$$ 77106 75579 72376 71115 74463 76069 73203 69628 68255 67283 66671 70982 69824
710.5G1632F8936G2019G7370H7154I1520I1740I4631I6883I8988A00138A03201A04698
$$ 71632 68936 72019 77370 87154 91520 91740 94631 96883 98988 100138 103201 104698
706.7A04992A04287A09629A15867A18026A25054A33766A42701A42143A42446A43673
$$ 104992 104287 109629 115867 118026 125054 133766 142701 142143 142446 143673
703.4A53840A65080A64289A66077A60314A58415A54436A56746A63433A66909A70634
$$ 153840 165080 164289 166077 160314 158415 154436 156746 163433 166909 170634
700.2A74378A75913A77344A77329A77524A82374A90251A97223A96586A96176B00811
$$ 174378 175913 177344 177329 177524 182374 190251 197223 196586 196176 200811
697B08145B16133B27823B36728B41903B46451B49494B52979B55694B58559B61652B64052
$$ 208145 216133 227823 236728 241903 246451 249494 252979 255694 258559 261652 264052
693.5B69071B68395B71984B89414C19050C47716C60157C49129C21836B93581B77144
$$ 269071 268395 271984 289414 319050 347716 360157 349129 321836 293581 277144
690.3B68777B64873B65367B66346B63784B62632B62343B60623B59500B49844B45286
$$ 268777 264873 265367 266346 263784 262632 262343 260623 259500 249844 245286
687.1B41734B43891B45596B53718B60926B65723B66639B63463B61564B60837B62817
$$ 241734 243891 245596 253718 260926 265723 266639 263463 261564 260837 262817
683.9B72858B77944B87156B94355C02280C10314C13232C14905C12801C07183C03432
$$ 272858 277944 287156 294355 302280 310314 313232 314905 312801 307183 303432
680.6C01698C00494C06354C10079C16324C18329C17561C20596C22138C21398C20933
$$ 301698 300494 306354 310079 316324 318329 317561 320596 322138 321398 320933
677.4C22967C16775C09448C08450C05782B97081B95703B93539B92559B92198B89668
$$ 322967 316775 309448 308450 305782 297081 295703 293539 292559 292198 289668
674.2B88179B85187B88388B90718B97307B95527B97338B94337B90185B84206B85113
$$ 288179 285187 288388 290718 297307 295527 297338 294337 290185 284206 285113
671B85518B86421B85450B82290B81667B93025C04906C21741C34127C39548C39413C39067
$$ 285518 286421 285450 282290 281667 293025 304906 321741 334127 339548 339413 339067
667.5C42170C45039C46053C45911C47334C48469C57080C67695C80807C89584C95514
$$ 342170 345039 346053 345911 347334 348469 357080 367695 380807 389584 395514
664.3C96656C96076D00005D00324D00616D16133D42011D70505D97746E20909E29293
$$ 396656 396076 400005 400324 400616 416133 442011 470505 497746 520909 529293
661.1E38274E50669E58810E55234E44936E36654E27349E17389E02543D91579D90013
$$ 538274 550669 558810 555234 544936 536654 527349 517389 502543 491579 490013
657.8D94814E08718E24896E37193E43087E48614E55677E63341E70996E73994E81330
$$ 494814 508718 524896 537193 543087 548614 555677 563341 570996 573994 581330
654.6E87244E89344E96173F06498F14865F18059F28123F36466F51406F60636F70646
$$ 587244 589344 596173 606498 614865 618059 628123 636466 651406 660636 670646
651.4F81084F99596G20919G53984H00677H47199H97177I56350A028020A115401A218894
$$ 681084 699596 720919 753984 800677 847199 897177 956350 1028020 1115401 1218894
648.2A367944A599334A945041B429206B999269C565320D063351D415769D541744D425969
$$ 1367944 1599334 1945041 2429206 2999269 3565320 4063351 4415769 4541744 4425969
645.3D190259C982924C974735D229081D673364E191698E678770F053644F312323F540295
$$ 4190259 3982924 3974735 4229081 4673364 5191698 5678770 6053644 6312323 6540295
642.3F810640G136259G451478G681081G675762G385062F910698F480735F333397F584374
$$ 6810640 7136259 7451478 7681081 7675762 7385062 6910698 6480735 6333397 6584374
639.4G140655G787251H320208H550505H373689G918226G440100G046569F910220G083659
$$ 7140655 7787251 8320208 8550505 8373689 7918226 7440100 7046569 6910220 7083659
636.5G473029H135638I054368A0034240A0896331A1878259A3299405A4963395A6699838
$$ 7473029 8135638 9054368 10034240 10896331 11878259 13299405 14963395 16699838
633.9A8548090A9890100B0420965B1207975B2767513B4624888B6570385B8879530C1246393
$$ 18548090 19890100 20420965 21207975 22767513 24624888 26570385 28879530 31246393
631.2C3218445C4629190C5169948C4797038C3628348C2157970C0854493B9920083B8771950
$$ 33218445 34629190 35169948 34797038 33628348 32157970 30854493 29920083 28771950
628.6B7204520B5767990B4888048B4102453B3181868B2524080B1939845B0746370A8923466
$$ 27204520 25767990 24888048 24102453 23181868 22524080 21939845 20746370 18923466
626A7181658A5561438A4096270A3334725A3396728A4146098A5242970A6453553A7764793
$$ 17181658 15561438 14096270 13334725 13396728 14146098 15242970 16453553 17764793
623.3A8823305A9321918A9218590A8424008A7180098A6643328A7250726A8395300A9738015
$$ 18823305 19321918 19218590 18424008 17180098 16643328 17250726 18395300 19738015
620.7B1017325B2187600B2995038B3756260B4454293B4286165B3758840B4503383B6509845
$$ 21017325 22187600 22995038 23756260 24454293 24286165 23758840 24503383 26509845
618.1B7750415B7654193B6475413B5691345B6813630B8943643C0438580C0943415C0863633
$$ 27750415 27654193 26475413 25691345 26813630 28943643 30438580 30943415 30863633
615.5C0538335C0386885C0116393B9324775B8276340B7165148B6845203B8860790C1235435
$$ 30538335 30386885 30116393 29324775 28276340 27165148 26845203 28860790 31235435
612.8C0892728B8723748B7875955B8727343C0176645B9703015B7044635B4335725B2724893
$$ 30892728 28723748 27875955 28727343 30176645 29703015 27044635 24335725 22724893
610.2B2364740B2611583B1745538A9709720A8866189A9752940B0195564A9818404A9495095
$$ 22364740 22611583 21745538 19709720 18866189 19752940 20195564 19818404 19495095
607.6A9356975A9225433A9464600B0005960A9397328A7599060A6303625A5301475A4402546
$$ 19356975 19225433 19464600 20005960 19397328 17599060 16303625 15301475 14402546
604.9A4040290A3985865A3665204A2990604A2317198A2316483A2747863A2627953A2440640
$$ 14040290 13985865 13665204 12990604 12317198 12316483 12747863 12627953 12440640
602.3A3053436A3268558A2430520A2357550A3339780A3486441A2874230A3146878A3773093
$$ 13053436 13268558 12430520 12357550 13339780 13486441 12874230 13146878 13773093
599.7A3702068A3380888A3612773A4136939A4419423A4300449A4770565A5964725A6485673
$$ 13702068 13380888 13612773 14136939 14419423 14300449 14770565 15964725 16485673
597A6569933A7314775A8444011A8898393A9444945B0822898B1839603B2092955B2487203
$$ 16569933 17314775 18444011 18898393 19444945 20822898 21839603 22092955 22487203
594.4B3797638B4797630B4281055B3299805B2803010B2330865B1888078B1429003B1185848
$$ 23797638 24797630 24281055 23299805 22803010 22330865 21888078 21429003 21185848
591.8B1339268B1750385B2169300B2084043B1882585B1748285B1434048B1389525B1694773
$$ 21339268 21750385 22169300 22084043 21882585 21748285 21434048 21389525 21694773
589.1B2590530B3557788B4763680B6036583B6427063B5627320B4719580B4447683B4423560
$$ 22590530 23557788 24763680 26036583 26427063 25627320 24719580 24447683 24423560
586.5B5088170B5405435B6039725B5881565B4107370B1173470A8515995A7025123A6118710
$$ 25088170 25405435 26039725 25881565 24107370 21173470 18515995 17025123 16118710
583.9A5829129A5755755A5394390A4567069A3381698A2419076A2301103A3312343A4651833
$$ 15829129 15755755 15394390 14567069 13381698 12419076 12301103 13312343 14651833
581.3A4754396A4413690A4269709A3962078A4107840A5055501A5956120A5644015A4900470
$$ 14754396 14413690 14269709 13962078 14107840 15055501 15956120 15644015 14900470
578.6A4572909A4053340A3379065A2970265A3380735A3856753A3951238A4064055A3896683
$$ 14572909 14053340 13379065 12970265 13380735 13856753 13951238 14064055 13896683
576A3357086A3038178A3469106A4719511A5703580A5732093A5349945A4659763A3938643
$$ 13357086 13038178 13469106 14719511 15703580 15732093 15349945 14659763 13938643
573.4A3826428A4603700A6064535A7265790A7282794A6624550A6042851A6009708A7085505
$$ 13826428 14603700 16064535 17265790 17282794 16624550 16042851 16009708 17085505
570.7A9095878B0464808A9442169A7344714A5696340A4670521A4596608A5857845A7672670
$$ 19095878 20464808 19442169 17344714 15696340 14670521 14596608 15857845 17672670
568.1A7596163A5150664A2688490A1406570A0589618A0200516A1154348A2768085A2576900
$$ 17596163 15150664 12688490 11406570 10589618 10200516 11154348 12768085 12576900
565.5A0714418I188579H648368H300486G980614G999591H138179G548897F502881E972335
$$ 10714418 9188579 8648368 8300486 7980614 7999591 8138179 7548897 6502881 5972335
562.5F080496F343756F415699F197025E765376E141927D569006D308113D415067D816108
$$ 6080496 6343756 6415699 6197025 5765376 5141927 4569006 4308113 4415067 4816108
559.6E214066E289036E111811D703679D383857D347991D499456D731513E149623E759871
$$ 5214066 5289036 5111811 4703679 4383857 4347991 4499456 4731513 5149623 5759871
556.7F127233F022383E920607F028701F078584E883386E776353E926917E899393E619740
$$ 6127233 6022383 5920607 6028701 6078584 5883386 5776353 5926917 5899393 5619740
553.8E596898E872022E870699E573830E301151E158254D973143D855564E005307E238856
$$ 5596898 5872022 5870699 5573830 5301151 5158254 4973143 4855564 5005307 5238856
550.9E470336E873215F537499G791100H986991H670511G580414F988920G487625I375921
$$ 5470336 5873215 6537499 7791100 8986991 8670511 7580414 6988920 7487625 9375921
547.9A2040546A3889885A5173648A5051365A2725745A0072106H941534I779328A1972686
$$ 12040546 13889885 15173648 15051365 12725745 10072106 8941534 9779328 11972686
545.3A3698915A4300913A4844419A5036175A3885329A1721473A0104596A0007948A1296268
$$ 13698915 14300913 14844419 15036175 13885329 11721473 10104596 10007948 11296268
542.7A2756985A3676655A4054648A4269310A3424335A0988115H984423H581494I660280
$$ 12756985 13676655 14054648 14269310 13424335 10988115 8984423 8581494 9660280
540A1580546A2514368A1709310A0624583I427644H058002G213899G531054I399678
$$ 11580546 12514368 11709310 10624583 9427644 8058002 7213899 7531054 9399678
537.4A2689548A4837710A3595955A0900648I229663H958977A0069887A2710003A6283760
$$ 12689548 14837710 13595955 10900648 9229663 8958977 10069887 12710003 16283760
534.8A9129290A9296136A6713498A3427588A1654050A2024040A4169020A6874808A8257943
$$ 19129290 19296136 16713498 13427588 11654050 12024040 14169020 16874808 18257943
532.1A8627125A8784160A7506269A4607411A2356143A1930706A3040125A5239525A7667363
$$ 18627125 18784160 17506269 14607411 12356143 11930706 13040125 15239525 17667363
529.5A9241883A9008135A7404470A4999424A2435804A1036558A1498683A3858015A6695328
$$ 19241883 19008135 17404470 14999424 12435804 11036558 11498683 13858015 16695328
526.9A6914033A4647308A2472238A0689663H962136G893059G950054H970236I762259
$$ 16914033 14647308 12472238 10689663 8962136 7893059 7950054 8970236 9762259
524.3I081834G601576F613156F336972F459885F852532G554746H613436A0068451A1801930
$$ 9081834 7601576 6613156 6336972 6459885 6852532 7554746 8613436 10068451 11801930
521.3A3717620A6173913B0078636B5234195C1762158D1409500E7495190H7614070A39343050
$$ 13717620 16173913 20078636 25234195 31762158 41409500 57495190 87614070 139343050
518.7A79291640A87110840A94135320B45901420B74937980B46531240A99890740A85725280
$$ 179291640 187110840 194135320 245901420 274937980 246531240 199890740 185725280
516.4A81484520A50194880A00446120F4829555D5528770C5181918B9300915B4901428
$$ 181484520 150194880 100446120 64829555 45528770 35181918 29300915 24901428
514B1007265A8072585A6192160A4567343A2817951A1304725A0191112I291157H517829
$$ 21007265 18072585 16192160 14567343 12817951 11304725 10191112 9291157 8517829
511.4G902471G416725G013325F665498F354984F071245E783844E482022E183475D935538
$$ 7902471 7416725 7013325 6665498 6354984 6071245 5783844 5482022 5183475 4935538
508.5D779934D669864D524735D335833D193719D105744D004471C865057C743569C718750
$$ 4779934 4669864 4524735 4335833 4193719 4105744 4004471 3865057 3743569 3718750
505.5C713435C681813C666416C714396C782878C901762D037511D094666D060888D075652
$$ 3713435 3681813 3666416 3714396 3782878 3901762 4037511 4094666 4060888 4075652
502.6D157358D245913D247861D138223D015996D038116D184619D183791D139827D475604
$$ 4157358 4245913 4247861 4138223 4015996 4038116 4184619 4183791 4139827 4475604
499.7E090260E751669F498906G745266I561626A1848355A5185355B0817589C0153530
$$ 5090260 5751669 6498906 7745266 9561626 11848355 15185355 20817589 30153530
497.1D0164603D6095235E4328360F9722925H7040240A01213720A11736190A22681740
$$ 40164603 46095235 54328360 69722925 87040240 101213720 111736190 122681740
494.7A36157320A43941410A47265830A51510530A54694390A54120390A47620140A41763600
$$ 136157320 143941410 147265830 151510530 154694390 154120390 147620140 141763600
492.4A38055520A31469170A20114120A08207460I4457050G9436825F6142305E5137100
$$ 138055520 131469170 120114120 108207460 94457050 79436825 66142305 55137100
490.1D6510500C7559778B9227870B3125068A9095180A6351005A4323575A2749795A1479950
$$ 46510500 37559778 29227870 23125068 19095180 16351005 14323575 12749795 11479950
487.4A0419158I528259H784051H145937G597159G113704F689240F325731F010673E724349
$$ 10419158 9528259 8784051 8145937 7597159 7113704 6689240 6325731 6010673 5724349
484.5E471237E260193E070884D890151D705333D545281D428079D353144D295376D229652
$$ 5471237 5260193 5070884 4890151 4705333 4545281 4428079 4353144 4295376 4229652
481.6D180152D154659D132591D095996D003768C873218C737463C615168C504488C359128
$$ 4180152 4154659 4132591 4095996 4003768 3873218 3737463 3615168 3504488 3359128
478.7C210466C110845C026166B888831B729227B586986B461028B302784B121129A938356
$$ 3210466 3110845 3026166 2888831 2729227 2586986 2461028 2302784 2121129 1938356
475.7A793148A659638A527109A418038A351357A302744A216587A123427A077609A078771
$$ 1793148 1659638 1527109 1418038 1351357 1302744 1216587 1123427 1077609 1078771
472.8A084376A094553A096849A079383A065691A059847A049849A023875I98022I67808
$$ 1084376 1094553 1096849 1079383 1065691 1059847 1049849 1023875 998022 967808
469.9I44579I31440I19726I28237I65304A004665A010074I81012I34706I01983H95701
$$ 944579 931440 919726 928237 965304 1004665 1010074 981012 934706 901983 895701
466.7H92544H79949H73098H88314I17643I64013A030256A119534A224603A317192A374483
$$ 892544 879949 873098 888314 917643 964013 1030256 1119534 1224603 1317192 1374483
463.5A444868A624920A960248B484084C251571D240045E615506G663430A0004280A0329185
$$ 1444868 1624920 1960248 2484084 3251571 4240045 5615506 7663430 10004280 10329185
460.5I269696G469589E511243D107806C389378C042170B736091B463204B311753B287793
$$ 9269696 7469589 5511243 4107806 3389378 3042170 2736091 2463204 2311753 2287793
457.6B344664B495035B780726C234608C959846E044498F769426I675931A2511075A2383908
$$ 2344664 2495035 2780726 3234608 3959846 5044498 6769426 9675931 12511075 12383908
454.7A0477469H569158G168425F347390F138816F366862F403303E945009E415455E173446
$$ 10477469 8569158 7168425 6347390 6138816 6366862 6403303 5945009 5415455 5173446
451.8E310291E802989F759801H613403A1576049A5339999A7718528A7550388A6042923
$$ 5310291 5802989 6759801 8613403 11576049 15339999 17718528 17550388 16042923
449.1A4239095A3441798A4143631A3778590A1695600I380829G460004F161121E462068
$$ 14239095 13441798 14143631 13778590 11695600 9380829 7460004 6161121 5462068
446.5E259691E384625E674389F197425G212118H836391A1085208A4201135A6383813
$$ 5259691 5384625 5674389 6197425 7212118 8836391 11085208 14201135 16383813
443.9A7085484A7023736A5626990A4497910A4670035A3604168A0980849H353591F501273
$$ 17085484 17023736 15626990 14497910 14670035 13604168 10980849 8353591 6501273
441.2E399928D783361D499593D493878D723666E235269F132222G377548H837751A0880880
$$ 5399928 4783361 4499593 4493878 4723666 5235269 6132222 7377548 8837751 10880880
438.3A2510100A2882819A3854038A5800245A6068885A3948405A1326255I167418G645926
$$ 12510100 12882819 13854038 15800245 16068885 13948405 11326255 9167418 7645926
435.7F725192E882130E119481D673364D591928D764210E165130E849973G058241I225028
$$ 6725192 5882130 5119481 4673364 4591928 4764210 5165130 5849973 7058241 9225028
432.8A2487045A4577575A4029139A4017423A5064403A5342465A4349340A1966995I193921
$$ 12487045 14577575 14029139 14017423 15064403 15342465 14349340 11966995 9193921
430.1G189909F000284E064922D375466C921143C586709C280369C031456B935248B961901
$$ 7189909 6000284 5064922 4375466 3921143 3586709 3280369 3031456 2935248 2961901
427.2C068315C227973C469388C906918D865201F238176F268793E158274D504431D101549
$$ 3068315 3227973 3469388 3906918 4865201 6238176 6268793 5158274 4504431 4101549
424.3C438337B811367B363941B051781A822457A671506A605114A606544A664651A765674
$$ 3438337 2811367 2363941 2051781 1822457 1671506 1605114 1606544 1664651 1765674
421.4A911534B155034B622028C576543E382090G126978F318385D294241C003644B512996
$$ 1911534 2155034 2622028 3576543 5382090 7126978 6318385 4294241 3003644 2512996
418.4B153518A796860A508956A274969A081008I38588H52704H10582G88071G62784
$$ 2153518 1796860 1508956 1274969 1081008 938588 852704 810582 788071 762784
415.5G10829F39261E86687E58486E31444D99294D76383D67726D58412D56606D60703
$$ 710829 639261 586687 558486 531444 499294 476383 467726 458412 456606 460703
412.3D70209D81819D79769D64276D44613D22891D12273D02334C96056C91493C92277
$$ 470209 481819 479769 464276 444613 422891 412273 402334 396056 391493 392277
409.1C84694C75327C58820C48444C46936C56441C45327C33088C32977C33015C30965
$$ 384694 375327 358820 348444 346936 356441 345327 333088 332977 333015 330965
405.9C32738C39267C42759C46098C47965C45602C36877C35066C43044C52953C47573
$$ 332738 339267 342759 346098 347965 345602 336877 335066 343044 352953 347573
402.7C23984B97319B81269B67640B60147B59599B70244B86493B98260C10777C41851
$$ 323984 297319 281269 267640 260147 259599 270244 286493 298260 310777 341851
399.4C95480D86104F26718F68293E74240D92397D56279D29838D03748C94007C89141
$$ 395480 486104 626718 668293 574240 492397 456279 429838 403748 394007 389141
396.2C78266C71856C76538C92178D48675E52446F67741F89721F14888E46796E63758
$$ 378266 371856 376538 392178 448675 552446 667741 689721 614888 546796 563758
393F45623F77373F20357E46077E01305D69013D48045D37035D44761D90692E96007G75182
$$ 645623 677373 620357 546077 501305 469013 448045 437035 444761 490692 596007 775182
389.5I13984H79533G18399E75146E09867D94213D90317D96571E44327F40306G73401
$$ 913984 879533 718399 575146 509867 494213 490317 496571 544327 640306 773401
386.3G74398F44671E35335D92190D70358D43646D19408D05088C96899C93846D03148
$$ 774398 644671 535335 492190 470358 443646 419408 405088 396899 393846 403148
383.1D20620D45877D83696E54453G05855A039969A632785A935790A528704A028686
$$ 420620 445877 483696 554453 705855 1039969 1632785 1935790 1528704 1028686
380.1G46685F29148E98486E88593E62155E01343D33728C77944C42857C23166C11001
$$ 746685 629148 598486 588593 562155 501343 433728 377944 342857 323166 311001
376.9C02332B87849B81834B70096B58299B61016B74476B76853B73264B72649B82686
$$ 302332 287849 281834 270096 258299 261016 274476 276853 273264 272649 282686
373.7B76745B75140B82104C19511C64613C17309B61977B42031B41900B30371B17034
$$ 276745 275140 282104 319511 364613 317309 261977 242031 241900 230371 217034
370.5B20968B31461B45073B64345B83559B77000B51011B42301B44864B45532B30993
$$ 220968 231461 245073 264345 283559 277000 251011 242301 244864 245532 230993
367.3B12200A98644A91984A97153B16526B71488B92181B35904A87781A67166A58644
$$ 212200 198644 191984 197153 216526 271488 292181 235904 187781 167166 158644
364.1A55089A49505A48499A54167A59841A74256A76170A68260A59366A59116A58064
$$ 155089 149505 148499 154167 159841 174256 176170 168260 159366 159116 158064
360.9A53963A52518A48748A42749A45618A49519A49389A47832A47318A48231A50255
$$ 153963 152518 148748 142749 145618 149519 149389 147832 147318 148231 150255
357.6A53407A55651A64123A77933A93407A93411A98537B20831B51076B62234B44189
$$ 153407 155651 164123 177933 193407 193411 198537 220831 251076 262234 244189
354.4B09956A76078A53421A39274A33811A28499A22154A20567A24249A34611A48517
$$ 209956 176078 153421 139274 133811 128499 122154 120567 124249 134611 148517
351.2A64158A90765B17098B45356B49858B33446A94485A60207A36968A16724A04496
$$ 164158 190765 217098 245356 249858 233446 194485 160207 136968 116724 104496
348I9531I8535I9063A00944I6676I2555H7878H9020H8072H9986I1805I0589H8481H8915
$$ 99531 98535 99063 100944 96676 92555 87878 89020 88072 89986 91805 90589 88481 88915
343.9I1982I4063I5888A02704A04207A08951A08978I9771I0298H3284H4448H6289H7261
$$ 91982 94063 95888 102704 104207 108951 108978 99771 90298 83284 84448 86289 87261
340.1H9169I3413I0433H6342H4463G9742G6819G9079G5981G5072G3108G3201G1629
$$ 89169 93413 90433 86342 84463 79742 76819 79079 75981 75072 73108 73201 71629
336.3G2814G1069G0702G3491G3999G3178G5969G1426G0801G0193G0928G0898G3696
$$ 72814 71069 70702 73491 73999 73178 75969 71426 70801 70193 70928 70898 73696
332.5G2813F8526F8139F9714F7992F9433G2271G0501F9681F6563F8133F5453G0603
$$ 72813 68526 68139 69714 67992 69433 72271 70501 69681 66563 68133 65453 70603
328.7F7506F7373F7600F9880F4282F4643F7316G2189H6333A00646A15734A22039A10545
$$ 67506 67373 67600 69880 64282 64643 67316 72189 86333 100646 115734 122039 110545
324.9I1395H0421G1588F9193F8892G1177G0738F8263F3509F2456F3068F2247E9630
$$ 91395 80421 71588 69193 68892 71177 70738 68263 63509 62456 63068 62247 59630
321.1E8641E6883E9584F1131F5132F7721G0776G0764F8637F6044F9388F9887G4956
$$ 58641 56883 59584 61131 65132 67721 70776 70764 68637 66044 69388 69887 74956
317.3G7089G3616G2726F8802F7587F5627F9061G4052H4228H8014H2393G8439G1877
$$ 77089 73616 72726 68802 67587 65627 69061 74052 84228 88014 82393 78439 71877
313.5F3297E9621F0934F5349F9451G2106G6640H5148I8931A10474A06596A00071I1549
$$ 63297 59621 60934 65349 69451 72106 76640 85148 98931 110474 106596 100071 91549
309.7I5759A07933A13023I6421G8964G4051G3637G9504H5655A07758A39174A63759
$$ 95759 107933 113023 96421 78964 74051 73637 79504 85655 107758 139174 163759
306.2A72686A60619A36201A19721A17139A26181A29963A37136A47115A44137A20425
$$ 172686 160619 136201 119721 117139 126181 129963 137136 147115 144137 120425
303I9394H6916H2483H0123G5881G3339G0043G9039I2939A04848A12388A13821A13833
$$ 99394 86916 82483 80123 75881 73339 70043 79039 92939 104848 112388 113821 113833
299.2A29968A68808B52666C96025D15584B99809B09717A86368B03630B14716A96293
$$ 129968 168808 252666 396025 415584 299809 209717 186368 203630 214716 196293
296A76214A49096A22094A02441I1146H8309I3869A10174A14439A15142A19991A26570
$$ 176214 149096 122094 102441 91146 88309 93869 110174 114439 115142 119991 126570
292.4A34306A56811B31803C68823C97806B81423A88318A47592A30459A16044A06138
$$ 134306 156811 231803 368823 397806 281423 188318 147592 130459 116044 106138
289.2A00008I3224H6397H1026G7418G8981H4001A01984A21419A31421A22686A05468
$$ 100008 93224 86397 81026 77418 78981 84001 101984 121419 131421 122686 105468
285.7I1265H0286G1356F7284F1370F1778F1370F4316F1364F3895F6289F3726F8001
$$ 91265 80286 71356 67284 61370 61778 61370 64316 61364 63895 66289 63726 68001
281.9G4643H0927H0299H4060I4458A03996A19935A26605A23547A24558A41877A90488
$$ 74643 80927 80299 84060 94458 103996 119935 126605 123547 124558 141877 190488
278.4B99044D87314F14772E26409C53586B42908B05018A78047A42832A19788A09779
$$ 299044 487314 614772 526409 353586 242908 205018 178047 142832 119788 109779
275.2A06567A08434A12169A20300A40672A62490A75664A75027A82069B10993B74744
$$ 106567 108434 112169 120300 140672 162490 175664 175027 182069 210993 274744
272D06460F62654A000019A141377I27399F09716D07482C19631B64276B16423A91206
$$ 406460 662654 1000019 1141377 927399 609716 407482 319631 264276 216423 191206
268.8A77057A66295A59889A62053A82394B12278B23524B08386A88906A88798B05078
$$ 177057 166295 159889 162053 182394 212278 223524 208386 188906 188798 205078
265.6B55486C57654D92979F39346F74878E28238C52179B46136A92293A61809A40216
$$ 255486 357654 492979 639346 674878 528238 352179 246136 192293 161809 140216
262.3A30473A19233A12709A07152A09854A22772A45700A56151A41734A24800A10986
$$ 130473 119233 112709 107152 109854 122772 145700 156151 141734 124800 110986
259.1A11894A22684A43249A62216A77552A82374A73372A51384A33859A18078A00473
$$ 111894 122684 143249 162216 177552 182374 173372 151384 133859 118078 100473
255.9H8475H2172G3488F9746F9885G0553G2288G4533G8551G8105G1623F3646F8149
$$ 88475 82172 73488 69746 69885 70553 72288 74533 78551 78105 71623 63646 68149
252.1H5653A09258A45528A73372A77627A59854A32596A16237A09235A00034H6261G2914
$$ 85653 109258 145528 173372 177627 159854 132596 116237 109235 100034 86261 72914
248.6F2157E6710E0068D7971D6573D2676C9944C8738C6251D0196E0667E5279E3061
$$ 62157 56710 50068 47971 46573 42676 39944 38738 36251 40196 50667 55279 53061
244.8D5852C8368C7147C5023C3949C0663B8794B9582C1139B9165C0661B8655B9689
$$ 45852 38368 37147 35023 33949 30663 28794 29582 31139 29165 30661 28655 29689
241B9593B8913B7799C1669C5889C3379C1264B8297B8310B7336B5667B7965C1716C0201
$$ 29593 28913 27799 31669 35889 33379 31264 28297 28310 27336 25667 27965 31716 30201
236.9B7118B8714B8288B7841B5120B4321B6499B4383B3425B3069B0964B1394B1528
$$ 27118 28714 28288 27841 25120 24321 26499 24383 23425 23069 20964 21394 21528
233.1B0763B0666B2672B4628B6009B5364B3484B4020B7661B5175B4789C2485D1155
$$ 20763 20666 22672 24628 26009 25364 23484 24020 27661 25175 24789 32485 41155
229.3F1453I6173A17141I7686F1291D0699C3251B6387B3626B2884B4276B7024B5366
$$ 61453 96173 117141 97686 61291 40699 33251 26387 23626 22884 24276 27024 25366
225.5B3240B4806B2631B0769B2603B2950B4384B0333B1355B4303B8465D1443D6663
$$ 23240 24806 22631 20769 22603 22950 24384 20333 21355 24303 28465 41443 46663
221.7C7628C0333B6709B5888B5161B4153B0338B2552B2414B2146B5223B7219B5849
$$ 37628 30333 26709 25888 25161 24153 20338 22552 22414 22146 25223 27219 25849
217.9B2674B3096B5809B6146C1366D0359D9143E6873F4998F7184E3699C8040B8903
$$ 22674 23096 25809 26146 31366 40359 49143 56873 64998 67184 53699 38040 28903
214.1B4703B5204B5543B8462C1158B9838B9276B4181A7498A5118A6669A2693A2405
$$ 24703 25204 25543 28462 31158 29838 29276 24181 17498 15118 16669 12693 12405
210.3A2729A3591A1824A1193I008A2571A5883A7670A5309A4956A4591A3043A3510A2691
$$ 12729 13591 11824 11193 9008 12571 15883 17670 15309 14956 14591 13043 13510 12691
206.2A3556A3226A6943A8253B2474B1067A9410B0218A5810A2681A1878A0697I318I784
$$ 13556 13226 16943 18253 22474 21067 19410 20218 15810 12681 11878 10697 9318 9784
202.1A0601A4214A2595A5427A5747A3682A1042I506E655D336G551A1377A2307I172
$$ 10601 14214 12595 15427 15747 13682 11042 9506 5655 4336 7551 11377 12307 9172
198A2919A4287A3419A3887A6418A6390B0516B3215B8724C1995C4439C7715C3627B3291
$$ 12919 14287 13419 13887 16418 16390 20516 23215 28724 31995 34439 37715 33627 23291
193.9B3958A8309A6462A9079A5211A7054A6766A3777A4193A6413A5931A9699B3858
$$ 23958 18309 16462 19079 15211 17054 16766 13777 14193 16413 15931 19699 23858
190.1B8007C0169B7888B4142B4697B4113B1859B2404A7678A9412B0483A5934A0983
$$ 28007 30169 27888 24142 24697 24113 21859 22404 17678 19412 20483 15934 10983
186.3A0993A2355A0771E980F033I872A4419A2464A1993A3857A0533A4986A4667A3064
$$ 10993 12355 10771 5980 6033 9872 14419 12464 11993 13857 10533 14986 14667 13064
182.2A5116A5106A4080A4926A7313A9972A8121A7331I874G411F593D242E998I771A0515
$$ 15116 15106 14080 14926 17313 19972 18121 17331 9874 7411 6593 4242 5998 9771 10515
177.9A1108A0654H186H824D156G296G425G656E239G452G002E791A0081A4684A4950
$$ 11108 10654 8186 8824 4156 7296 7425 7656 5239 7452 7002 5791 10081 14684 14950
173.5A3625A4496A7078A6776A5856A3820A1024A2578A0988H790A1636A0681A1631I008
$$ 13625 14496 17078 16776 15856 13820 11024 12578 10988 8790 11636 10681 11631 9008
169.4G694G035H315A0366F587A0076A1257H262A0467A0033A3293A3421F711F939E716
$$ 7694 7035 8315 10366 6587 10076 11257 8262 10467 10033 13293 13421 6711 6939 5716
165F893H170F566H483H882H684G551A1972A1570A1098F769D560E960H083H679A0092
$$ 6893 8170 6566 8483 8882 8684 7551 11972 11570 11098 6769 4560 5960 8083 8679 10092
160.3A0634A1370H420G914H438D249B556F910A0278I279F649G586I513I786A1961A3076
$$ 10634 11370 8420 7914 8438 4249 2556 6910 10278 9279 6649 7586 9513 9786 11961 13076
155.6A0733G544G224F549E793E832A0108A1886A3513A6091A0622A0383I918I714E900
$$ 10733 7544 7224 6549 5793 5832 10108 11886 13513 16091 10622 10383 9918 9714 5900
151.3G819D474C441F984I096H809I854A0553H649F129G058B73H29E599H226H919G859
$$ 7819 4474 3441 6984 9096 8809 9854 10553 8649 6129 7058 273 829 5599 8226 8919 7859
146.3A0133H771G059A1780A3959D946b522E707G622C275A363F059E101h48C986I843
$$ 10133 8771 7059 11780 13959 4946 -2522 5707 7622 3275 1363 6059 5101 -848 3986 9843
141.6B598e086g74G424H379E588E441E597D791A0580A2806A1183C959G108F633E509
$$ 2598 -5086 -774 7424 8379 5588 5441 5597 4791 10580 12806 11183 3959 7108 6633 5509
136.9A0233A1670A2113A2548A3006A1831H904E439B85b480C813F793E534H401I661
$$ 10233 11670 12113 12548 13006 11831 8904 5439 285 -2480 3813 6793 5534 8401 9661
132.6F748H097G939F725E261C492D689H756A0821A2490A2367A0668I388F223F289H215
$$ 6748 8097 7939 6725 5261 3492 4689 8756 10821 12490 12367 10668 9388 6223 6289 8215
127.9A0815A1774A0098H611G645F864D788B964B390A401A641B518E968F688I453A6872
$$ 10815 11774 10098 8611 7645 6864 4788 2964 2390 1401 1641 2518 5968 6688 9453 16872
123.2A5241A3244A0425G806H761I056A1017A0720A2136A1820I798I769H073C985h08
$$ 15241 13244 10425 7806 8761 9056 11017 10720 12136 11820 9798 9769 8073 3985 -808
118.8b253B24A203I79h53A143C055A396A980a864a721a33a093b357b85A066a056e756
$$ -2253 224 1203 979 -853 1143 3055 1396 1980 -1864 -1721 -133 -1093 -2357 -285 1066 -1056 -5756
113.6f431f001d674c943a646A614a326g116e835c695a468c906a879A124b415h086h197
$$ -6431 -6001 -4674 -3943 -1646 1614 -1326 -7116 -5835 -3695 -1468 -3906 -1879 1124 -2415 -8086 -8197
108.6e969c860c52a336a306b506d344c949H21c88A334b84E794C398I59B85B83A304
$$ -5969 -3860 -352 -1336 -1306 -2506 -4344 -3949 821 -388 1334 -284 5794 3398 959 285 283 1304
103.3aB481B888D614C766B551b881d343b806A837B781G167E283E255E144D759C266
$$ -1 2481 2888 4614 3766 2551 -2881 -4343 -2806 1837 2781 7167 5283 5255 5144 4759 3266
98.4D767D417G573H296H757F812F550E665D226A392A576A448A069H92a374a343a736
$$ 4767 4417 7573 8296 8757 6812 6550 5665 4226 1392 1576 1448 1069 892 -1374 -1343 -1736
93.4A826G03A635a454g761h654e524e197b856c624e056f156a139b538c124c543g858
$$ 1826 703 1635 -1454 -7761 -8654 -5524 -5197 -2856 -3624 -5056 -6156 -1139 -2538 -3124 -3543 -7858
88.4f401d183E3a368a654b890d314d039e436e798e664f394d259d494e990d851c481
$$ -6401 -4183 53 -1368 -1654 -2890 -4314 -4039 -5436 -5798 -5664 -6394 -4259 -4494 -5990 -4851 -3481
83.4d336f120d796d116b281b169a284C873C274B756A132C781c12a631e098g893g250
$$ -4336 -6120 -4796 -4116 -2281 -2169 -1284 3873 3274 2756 1132 3781 -312 -1631 -5098 -7893 -7250
78.5c104C436H237C562a784i259a1858h176e579g58c75B790A158b131e661d078b636
$$ -3104 3436 8237 3562 -1784 -9259 -11858 -8176 -5579 -758 -375 2790 1158 -2131 -5661 -4078 -2636
73.5a865i3D844C453C468A988a712E42C121E008G129F376G43G26D559D014G413D278
$$ -1865 -93 4844 3453 3468 1988 -1712 542 3121 5008 7129 6376 743 726 4559 4014 7413 4278
68.2E38d981f304d151A711F384I436G036A886h15h72i15b491i56C278D924H614A0826
$$ 538 -4981 -6304 -4151 1711 6384 9436 7036 1886 -815 -872 -915 -2491 -956 3278 4924 8614 10826
63H571E522B421B678C345F234I766I376I478A0873A4546B1315C2189E3953H6029A11691
$$ 8571 5522 2421 2678 3345 6234 9766 9376 9478 10873 14546 21315 32189 53953 86029 111691
58.3A07905G6803D7850B6073A4074F585C59H31D545H251I898A1198I114D408C123F11
$$ 107905 76803 47850 26073 14074 6585 359 831 4545 8251 9898 11198 9114 4408 3123 611
53.6B93D499G353B503B7a464f744f520d514c299H19A668B684b407a825C511I763A1943
$$ 293 4499 7353 2503 27 -1464 -6744 -6520 -4514 -3299 819 1668 2684 -2407 -1825 3511 9763 11943
48.4H986a339e826f068c085a004E34B353C087B026A786F82C011D182G631D768B61d278
$$ 8986 -1339 -5826 -6068 -3085 -1004 534 2353 3087 2026 1786 682 3011 4182 7631 4768 261 -4278
43.1e221a247D906I037G016A453b473f028b848a331b544D721E243G683G004F472D713
$$ -5221 -1247 4906 9037 7016 1453 -2473 -6028 -2848 -1331 -2544 4721 5243 7683 7004 6472 4713
38.1H885G881F739E576D856H533A5968A6354I806H729B912D643H676A3745A1683E579
$$ 8885 7881 6739 5576 4856 8533 15968 16354 9806 8729 2912 4643 8676 13745 11683 5579
33.5i3c837e448g098c44D36c197c751c391c366b786B237D245b393d400a204D511F254
$$ -93 -3837 -5448 -7098 -344 436 -3197 -3751 -3391 -3366 -2786 2237 4245 -2393 -4400 -1204 4511 6254
28.2H954A3593I969F448G053D726C889E264A2144A9041A8293A6176A0288A3550B0969
$$ 8954 13593 9969 6448 7053 4726 3889 5264 12144 19041 18293 16176 10288 13550 20969
23.8B0526B4522C0310B7565B4129A8788A9201B4119B3298B6761B2220A5861B3313C1793
$$ 20526 24522 30310 27565 24129 18788 19201 24119 23298 26761 22220 15861 23313 31793
19.7B6504B9501B4236E6073A03513I9728G0585D5798D1989a2802f6895f0809c6729
$$ 26504 29501 24236 56073 103513 99728 70585 45798 41989 -12802 -66895 -60809 -36729
15.9a9854a2299h930a7319a6428I28I432D453a264e418f153E259A2264A9686B0216
$$ -19854 -12299 -8930 -17319 -16428 928 9432 4453 -1264 -5418 -6153 5259 12264 19686 20216
11.5C0691C8067C4612B4883B2836B8689C0256B4521B0521A8335B0567A7798A5156A3808
$$ 30691 38067 34612 24883 22836 28689 30256 24521 20521 18335 20567 17798 15156 13808
7.4A3284B0204C1051D2032E2576G0785I1334A06481A22175A46445A91456B45517C27785
$$ 13284 20204 31051 42032 52576 70785 91334 106481 122175 146445 191456 245517 327785
3.6E12140I11229I94903G84919G18175H11298A049860A459885B138987C319479E389484
$$ 512140 911229 994903 784919 718175 811298 1049860 1459885 2138987 3319479 5389484
0.4A0007996B2446933B9722343A8004198H385096D501953B923651B015061A458218
$$ 10007996 22446933 29722343 18004198 8385096 4501953 2923651 2015061 1458218
-2.2A156761I87216I13274A016018A280795A034252G30065E65046D57047C84396C42562
$$ 1156761 987216 913274 1016018 1280795 1034252 730065 565046 457047 384396 342562
-5.4C20297C00174B79014B61391B34686B18120B14108B15063B14083B10993B02473
$$ 320297 300174 279014 261391 234686 218120 214108 215063 214083 210993 202473
-8.6A86056A82136A70190A58973A37727A20006A08947A10472A08819A07452A03131
$$ 186056 182136 170190 158973 137727 120006 108947 110472 108819 107452 103131
-11.8A08703A03949I5210H4334H0224H3513H5804H5440H3713G1046G2849G1898F2857
$$ 108703 103949 95210 84334 80224 83513 85804 85440 83713 71046 72849 71898 62857
-15.6E7195E1406E4233G2383I3258H9445A3518e719b6351d9701h6134f0883B620B9691
$$ 57195 51406 54233 72383 93258 89445 13518 -5719 -26351 -49701 -86134 -60883 2620 29691
-19.7C6283C4098B7506C0539B1285A3494A8364B6566B5945A8627A7691B5096B8161
$$ 36283 34098 27506 30539 21285 13494 18364 26566 25945 18627 17691 25096 28161
-23.5B1965A4461A2219A1126A0903A3137A2486C464g463a0439e207B908I98G89E342
$$ 21965 14461 12219 11126 10903 13137 12486 3464 -7463 -10439 -5207 2908 998 789 5342
-27.9I248A1032A0301I364F869F100A0998A3969A3747A4538A2928H364A3641A5358
$$ 9248 11032 10301 9364 6869 6100 10998 13969 13747 14538 12928 8364 13641 15358
-32A5127A1193A3947A1636I379A1056A1569I896H251E456A338c606A874D151F601E939
$$ 15127 11193 13947 11636 9379 11056 11569 9896 8251 5456 1338 -3606 1874 4151 6601 5939
-36.7A0103D161c04d424a507C578F371G679A0097A4421B4013A9147B0225A9203A8004
$$ 10103 4161 -304 -4424 -1507 3578 6371 7679 10097 14421 24013 19147 20225 19203 18004
-41.1A6974A9323A5083A4848A1688H841B541A103C079C043E036G951E657B780d28b968
$$ 16974 19323 15083 14848 11688 8841 2541 1103 3079 3043 5036 7951 5657 2780 -428 -2968
-45.8b214A649E009E541B738b876h624d234D70b293c054i341a2409a2633i536e219
$$ -2214 1649 5009 5541 2738 -2876 -8624 -4234 470 -2293 -3054 -9341 -12409 -12633 -9536 -5219
-50.4e92A041A388b807e181g193d734A304H569H303F840e08e433i804i748e912a241
$$ -592 1041 1388 -2807 -5181 -7193 -4734 1304 8569 8303 6840 -508 -5433 -9804 -9748 -5912 -1241
-55.4D381C784E564Fe241e164h02E070D969B393D111I596B7571F2546A01866A13768
$$ 4381 3784 5564 6 -5241 -5164 -802 5070 4969 2393 4111 9596 27571 62546 101866 113768
-60.1H4489D5314B0918A0504H771H379E344B639b516C157I628H944E112B517a603b674
$$ 84489 45314 20918 10504 8771 8379 5344 2639 -2516 3157 9628 8944 5112 2517 -1603 -2674
-64.8b504D63a211b005e61B743I964A1709E926B983A083A515E826D016B291A506d49
$$ -2504 463 -1211 -2005 -561 2743 9964 11709 5926 2983 1083 1515 5826 4016 2291 1506 -449
-69.7b528e245g387g339d957f708e471i156h188a948a83A769D701B063h44b86B21I79
$$ -2528 -5245 -7387 -7339 -4957 -6708 -5471 -9156 -8188 -1948 -183 1769 4701 2063 -844 -286 221 979
-75B736C345F518E223B362b428e656e845A54E156H082E401G461D491C340B653D673
$$ 2736 3345 6518 5223 2362 -2428 -5656 -5845 154 5156 8082 5401 7461 4491 3340 2653 4673
-80C75C414b114d493d551b346a953a826d635c761d398c826D9c276b919a641F263E585
$$ 375 3414 -2114 -4493 -4551 -2346 -1953 -1826 -4635 -3761 -4398 -3826 49 -3276 -2919 -1641 6263 5585
-85.2C846G846A0981F446E985B484B816F439A0558H140B20d367b307g03A808C473A411
$$ 3846 7846 10981 6446 5985 2484 2816 6439 10558 8140 220 -4367 -2307 -703 1808 3473 1411
-90.2a989a774B452C178B979B023i4a717a366H51C356F25b29b557a563a366B058E615
$$ -1989 -1774 2452 3178 2979 2023 -94 -1717 -1366 851 3356 625 -229 -2557 -1563 -1366 2058 5615
-95.5B434i80A779E104F103E681E768E369C422B912D496C716H45c35a349F87G63C446
$$ 2434 -980 1779 5104 6103 5681 5768 5369 3422 2912 4496 3716 845 -335 -1349 687 763 3446
-100.7I91H12D78A795G273I089F468F494E893B32C3A868D309F207D536D856E807C139
$$ 991 812 478 1795 7273 9089 6468 6494 5893 232 33 1868 4309 6207 4536 4856 5807 3139
-106b12a332d706e507d899c24F287F774E166C661B595G634H874A1425A1298F829C554
$$ -212 -1332 -4706 -5507 -4899 -324 6287 6774 5166 3661 2595 7634 8874 11425 11298 6829 3554
-110.9A681e33A308B853E963E401D293B635b356d790a737a674c938c558b824a654b890
$$ 1681 -533 1308 2853 5963 5401 4293 2635 -2356 -4790 -1737 -1674 -3938 -3558 -2824 -1654 -2890
-115.9d731c728d337e429b094C39D079A47G23A819c629I04A890B114i35i9C866F048
$$ -4731 -3728 -4337 -5429 -2094 339 4079 147 723 1819 -3629 904 1890 2114 -935 -99 3866 6048
-121.2E396F289A051d427b524C50d74A51d0f46a344e552b016I76B173E60a991c496
$$ 5396 6289 1051 -4427 -2524 350 -474 151 -40 -646 -1344 -5552 -2016 976 2173 560 -1991 -3496
-126.4b981a055F63a898b468c178f103f233f089d806a373a33e42c247d396e458g645
$$ -2981 -1055 663 -1898 -2468 -3178 -6103 -6233 -6089 -4806 -1373 -133 -542 -3247 -4396 -5458 -7645
-131.4h754f900f275c792A71a669d335f359b404a836e501g358d891c097I9g51g36c463
$$ -8754 -6900 -6275 -3792 171 -1669 -4335 -6359 -2404 -1836 -5501 -7358 -4891 -3097 99 -751 -736 -3463
-136.7f573g039h033g002f756e428d347d181f126i215h734h460e351c644c623d481
$$ -6573 -7039 -8033 -7002 -6756 -5428 -4347 -4181 -6126 -9215 -8734 -8460 -5351 -3644 -3623 -4481
-141.3d161f316b579d97B96C18c953e638e345c128c546g23a693e83b395f247g077h714
$$ -4161 -6316 -2579 -497 296 318 -3953 -5638 -5345 -3128 -3546 -723 -1693 -583 -2395 -6247 -7077 -8714
-146.6e711c106c575a310c746c890b894d596b606c693b878a138c525a946a068h75a163
$$ -5711 -3106 -3575 -1310 -3746 -3890 -2894 -4596 -2606 -3693 -2878 -1138 -3525 -1946 -1068 -875 -1163
-151.6f31d134c124b636c343c671b999e199d874f036e724e231a57a248b513b996d786
$$ -631 -4134 -3124 -2636 -3343 -3671 -2999 -5199 -4874 -6036 -5724 -5231 -157 -1248 -2513 -2996 -4786
-156.5c669e991c378a534b450c126e263g861e688c579H7C8c5a753a308i4b877b576
$$ -3669 -5991 -3378 -1534 -2450 -3126 -5263 -7861 -5688 -3579 87 38 -35 -1753 -1308 -94 -2877 -2576
-161.8b040b694b583b223d38a233b087a214B189f21A198b449a325B69c22a438d96g95
$$ -2040 -2694 -2583 -2223 -438 -1233 -2087 -1214 2189 -621 1198 -2449 -1325 269 -322 -1438 -496 -795
-167.1b151d740b831a069b681d166f418c105c074c386f343d265b497d733h479f251
$$ -2151 -4740 -2831 -1069 -2681 -4166 -6418 -3105 -3074 -3386 -6343 -4265 -2497 -4733 -8479 -6251
-171.7i882h023g853d423f089e258f289f082d693b283b748b436c093a951d438d154
$$ -9882 -8023 -7853 -4423 -6089 -5258 -6289 -6082 -4693 -2283 -2748 -2436 -3093 -1951 -4438 -4154
-176.4b845c968c453b618b44b523a704c156d999f077c189a485f68c179d165d109c715
$$ -2845 -3968 -3453 -2618 -244 -2523 -1704 -3156 -4999 -6077 -3189 -1485 -668 -3179 -4165 -4109 -3715
-181.4e138f964f229f415f973d903b113a707c106b088b657b572d096e286g175e465
$$ -5138 -6964 -6229 -6415 -6973 -4903 -2113 -1707 -3106 -2088 -2657 -2572 -4096 -5286 -7175 -5465
-186.1e642f956f634e684i331e077c781f617a1064a3023a0159h858f278g356i086f047
$$ -5642 -6956 -6634 -5684 -9331 -5077 -3781 -6617 -11064 -13023 -10159 -8858 -6278 -7356 -9086 -6047
-190.7g634f670e813d754d116a824A779C068a725b373d122d683c683e246a518a707
$$ -7634 -6670 -5813 -4754 -4116 -1824 1779 3068 -1725 -2373 -4122 -4683 -3683 -5246 -1518 -1707
-195.4c517a282a204c44d88a683b073A26b674i24A631a059b487f173c783a541a413
$$ -3517 -1282 -1204 -344 -488 -1683 -2073 126 -2674 -924 1631 -1059 -2487 -6173 -3783 -1541 -1413
-200.4d316c146d593d102H28c471d605d688e655d475e294d729e380d174e881f943d484
$$ -4316 -3146 -4593 -4102 828 -3471 -4605 -4688 -5655 -4475 -5294 -4729 -5380 -4174 -5881 -6943 -4484
-205.4e236h028h938g050f375g828d336e840e781a578a556f043e524g221c957b504
$$ -5236 -8028 -8938 -7050 -6375 -7828 -4336 -5840 -5781 -1578 -1556 -6043 -5524 -7221 -3957 -2504
-210c139c206d713a350b846c612c964e669g853d005b180c40A81b738a794b388b767
$$ -3139 -3206 -4713 -1350 -2846 -3612 -3964 -5669 -7853 -4005 -2180 -340 181 -2738 -1794 -2388 -2767
-215D09a023c903b861c464a823f49c067b66b852b983g323h359e069b918c076C33i36
$$ 409 -1023 -3903 -2861 -3464 -1823 -649 -3067 -266 -2852 -2983 -7323 -8359 -5069 -2918 -3076 333 -936
-220.3e479f267f684g861g346b661c522d590d704d061e259e291h121h208f364d899
$$ -5479 -6267 -6684 -7861 -7346 -2661 -3522 -4590 -4704 -4061 -5259 -5291 -8121 -8208 -6364 -4899
-224.9c693d944a348c192d735d675e441c309c507e364c906a444a274b060a813c709
$$ -3693 -4944 -1348 -3192 -4735 -4675 -5441 -3309 -3507 -5364 -3906 -1444 -1274 -2060 -1813 -3709
-229.6d858e071c003c131e331f967d142e238c509a779a453a273h77d154e818b776c433
$$ -4858 -5071 -3003 -3131 -5331 -6967 -4142 -5238 -3509 -1779 -1453 -1273 -877 -4154 -5818 -2776 -3433
-234.6c806b939d337d485g899e398f351i151e638b254B808b908d486d716f914d232
$$ -3806 -2939 -4337 -4485 -7899 -5398 -6351 -9151 -5638 -2254 2808 -2908 -4486 -4716 -6914 -4232
-239.3b236b819c183a674f053g495f794d231f701f683b807c171a889b296H41b064I46
$$ -2236 -2819 -3183 -1674 -6053 -7495 -6794 -4231 -6701 -6683 -2807 -3171 -1889 -2296 841 -2064 946
-244.2b316d221d242d016a35a597d602d586c637e048g04a984c796c181b953b027b476
$$ -2316 -4221 -4242 -4016 -135 -1597 -4602 -4586 -3637 -5048 -704 -1984 -3796 -3181 -2953 -2027 -2476
-249.2d357d043b868d669d963d181c137c739b314e388e111e524f222f23A383B257A759
$$ -4357 -4043 -2868 -4669 -4963 -4181 -3137 -3739 -2314 -5388 -5111 -5524 -6222 -623 1383 2257 1759
-254.2a794c635d568e016c747a984a788D08b213a962a936b884a454b749a977e993h729
$$ -1794 -3635 -4568 -5016 -3747 -1984 -1788 408 -2213 -1962 -1936 -2884 -1454 -2749 -1977 -5993 -8729
-259.1f766e789b729a841b486c998e915c576a534b82a731e428c044h51d317e255c086
$$ -6766 -5789 -2729 -1841 -2486 -3998 -5915 -3576 -1534 -282 -1731 -5428 -3044 -851 -4317 -5255 -3086
-264.1b238a636h88a19c999e652e397b956d948c649b204a516e391i001f131b163B95
$$ -2238 -1636 -888 -119 -3999 -5652 -5397 -2956 -4948 -3649 -2204 -1516 -5391 -9001 -6131 -2163 295
-269.1a448e049f960f738d659e198d534e878i682e633b540a395b746b511c106C34b224
$$ -1448 -5049 -6960 -6738 -4659 -5198 -4534 -5878 -9682 -5633 -2540 -1395 -2746 -2511 -3106 334 -2224
-274.1b823b682c384e914b192a546a673c933d519d419b298b823d61e321f806d154e315
$$ -2823 -2682 -3384 -5914 -2192 -1546 -1673 -3933 -4519 -4419 -2298 -2823 -461 -5321 -6806 -4154 -5315
-279d049c044f107f656f979e156e771a028c394d256c214c403b856g27g81e378b788
$$ -4049 -3044 -6107 -6656 -6979 -5156 -5771 -1028 -3394 -4256 -3214 -3403 -2856 -727 -781 -5378 -2788
-284c028F2E46c95b060d781b602a589g01i82b306b085a998B13c422d897d074c033a188
$$ -3028 62 546 -395 -2060 -4781 -2602 -1589 -701 -982 -2306 -2085 -1998 213 -3422 -4897 -4074 -3033 -1188
-289.5G08c491d233a633D012D627D25d52b973A199F63c416d831a688c48h60b07H14
$$ 708 -3491 -4233 -1633 4012 4627 425 -452 -2973 1199 663 -3416 -4831 -1688 -348 -860 -207 814
-294.8c590d894e253e819c060a09c30B198D178B463a723Ha00A449a754a456c238c952
$$ -3590 -4894 -5253 -5819 -3060 -109 -330 2198 4178 2463 -1723 8 -100 1449 -1754 -1456 -3238 -3952
-300.1d425e661f780i788h006f262b362e326d834f391e053c283h28I42A304A413b246
$$ -4425 -5661 -6780 -9788 -8006 -6262 -2362 -5326 -4834 -6391 -5053 -3283 -828 942 1304 1413 -2246
-305a178d39a614c066b18a078B254a136h86d006b113b249d378d346b65a56c608d266
$$ -1178 -439 -1614 -3066 -218 -1078 2254 -1136 -886 -4006 -2113 -2249 -4378 -4346 -265 -156 -3608 -4266
-310.3e959f305d618c464d879f205b945a520d103e985h023g964e580d527c419g10A491
$$ -5959 -6305 -4618 -3464 -4879 -6205 -2945 -1520 -4103 -5985 -8023 -7964 -5580 -4527 -3419 -710 1491
-315.3A869h95c74A862A41A26b136c701c134d310e53b53b74a819b590d520i94a781
$$ 1869 -895 -374 1862 141 126 -2136 -3701 -3134 -4310 -553 -253 -274 -1819 -2590 -4520 -994 -1781
-320.5b031a294a509A487c484d741e079d885f608f850f958c149b908a499A579b231
$$ -2031 -1294 -1509 1487 -3484 -4741 -5079 -4885 -6608 -6850 -6958 -3149 -2908 -1499 1579 -2231
-325.2c041f38c23a775h76b983c859F6B501B229C191B853A883d48g91a066a676d933
$$ -3041 -638 -323 -1775 -876 -2983 -3859 66 2501 2229 3191 2853 1883 -448 -791 -1066 -1676 -4933
-330.5f231e210b466h09c606e254a481d814a864F34H81a304a163C496A114A727A028
$$ -6231 -5210 -2466 -809 -3606 -5254 -1481 -4814 -1864 634 881 -1304 -1163 3496 1114 1727 1028
-335.4A828D249C034iC853f83A559A36a44b567b066A89C393D639C534B596I11g88b039
$$ 1828 4249 3034 -9 3853 -683 1559 136 -144 -2567 -2066 189 3393 4639 3534 2596 911 -788 -2039
-341a483a421a491a46e76a105c161e689c886b437b430b810e08A536D51H13A954A765
$$ -1483 -1421 -1491 -146 -576 -1105 -3161 -5689 -3886 -2437 -2430 -2810 -508 1536 451 813 1954 1765
-346.3C946C654D224C114B478b88B517C640E74f510d911c364g148a0320g857f501g879
$$ 3946 3654 4224 3114 2478 -288 2517 3640 574 -6510 -4911 -3364 -7148 -10320 -7857 -6501 -7879
-351.2a3253a2460f214g576i830f799D79a468g17C804E669C463A76a39B666A270a017
$$ -13253 -12460 -6214 -7576 -9830 -6799 479 -1468 -717 3804 5669 3463 176 -139 2666 1270 -1017
-356.2b81A079a369b855b151a935b094a610b905i16i89b655b080a968F32A82a56a959
$$ -281 1079 -1369 -2855 -2151 -1935 -2094 -1610 -2905 -916 -989 -2655 -2080 -1968 632 182 -156 -1959
-361.5c145a635C91a114a962A941E574D298h39d270e343c784b801h32a129A227C984
$$ -3145 -1635 391 -1114 -1962 1941 5574 4298 -839 -4270 -5343 -3784 -2801 -832 -1129 1227 3984
-366.4E834E691B368a843g186f021f523g350b070a8h28B650I459B994f793e936d943
$$ 5834 5691 2368 -1843 -7186 -6021 -6523 -7350 -2070 -18 -828 2650 9459 2994 -6793 -5936 -4943
-371.4a8973b6179a8391b1498c1124i460A3023G093C93B2778B5836B6516B6492C4396
$$ -18973 -26179 -18391 -21498 -31124 -9460 13023 7093 393 22778 25836 26516 26492 34396
-375.5A5191c913a969B788a2769a8579a4156b3319b5486a1924E424C051f039A413G383
$$ 15191 -3913 -1969 2788 -12769 -18579 -14156 -23319 -25486 -11924 5424 3051 -6039 1413 7383
-379.9A0764F049g1a301c637b053B176f11h06B734F113D858B181b18E38A249a104a816
$$ 10764 6049 -71 -1301 -3637 -2053 2176 -611 -806 2734 6113 4858 2181 -218 538 1249 -1104 -1816
-385.1b250a936b19A05c923a373c31e00C301B153B973H37C016B738F056F223E581B326
$$ -2250 -1936 -219 105 -3923 -1373 -331 -500 3301 2153 2973 837 3016 2738 6056 6223 5581 2326
-390.4G24b186b254b43C175c10d155g031b268c884a27a579a791f086f584e958c152
$$ 724 -2186 -2254 -243 3175 -310 -4155 -7031 -2268 -3884 -127 -1579 -1791 -6086 -6584 -5958 -3152
-395.4b21a029A79C735H392H822I849F809I225G723A4253B0274A8477A5058A4236A3534
$$ -221 -1029 179 3735 8392 8822 9849 6809 9225 7723 14253 20274 18477 15058 14236 13534
-400A3377A3365A0188C616D341C501A800E283A981F00a54c255c356e146b355A068A666
$$ 13377 13365 10188 3616 4341 3501 1800 5283 1981 600 -154 -3255 -3356 -5146 -2355 1068 1666
-405B50A806F39A629b514c599e181d796B521D950B480A519H88i34d723a514a798d061
$$ 250 1806 639 1629 -2514 -3599 -5181 -4796 2521 4950 2480 1519 888 -934 -4723 -1514 -1798 -4061
-410.3g28e7c417d075E22B48i05C006D75h82c883e291b819f55b542b688b85E50b835
$$ -728 -57 -3417 -4075 522 248 -905 3006 475 -882 -3883 -5291 -2819 -655 -2542 -2688 -285 550 -2835
-415.8f33A666C1F42I33B060C058C758D038B092D404D229D464d84F80A623B88B931
$$ -633 1666 31 642 933 2060 3058 3758 4038 2092 4404 4229 4464 -484 680 1623 288 2931
-421.1A910a409a374F31f01a229A176a84i48b580B587D978A296b693b133C281A659
$$ 1910 -1409 -1374 631 -601 -1229 1176 -184 -948 -2580 2587 4978 1296 -2693 -2133 3281 1659
-426.1B567D816C308A876a403A454D326C438D097C431D614D173E124G719G869E863
$$ 2567 4816 3308 1876 -1403 1454 4326 3438 4097 3431 4614 4173 5124 7719 7869 5863
-430.7F371F628E573C579D433F371G733C491C849E737C918B391A284F032E034E031
$$ 6371 6628 5573 3579 4433 6371 7733 3491 3849 5737 3918 2391 1284 6032 5034 5031
-435.4D334D938C499E037E369C673C500C761D823C552F519H146G056A517H22A724D194
$$ 4334 4938 3499 5037 5369 3673 3500 3761 4823 3552 6519 8146 7056 1517 822 1724 4194
-440.4F370G308D372D029B188A984B705D299A528a139C239E88C9C78C393A833A693
$$ 6370 7308 4372 4029 2188 1984 2705 4299 1528 -1139 3239 588 39 378 3393 1833 1693
-445.4C478B876B086C345C380C383B585F324G061E321H776C853C516F249D571B603
$$ 3478 2876 2086 3345 3380 3383 2585 6324 7061 5321 8776 3853 3516 6249 4571 2603
-450C009C571d68F64D565C333A43B425C574F729F371G236G508H393B330D538E610E457
$$ 3009 3571 -468 664 4565 3333 143 2425 3574 6729 6371 7236 7508 8393 2330 4538 5610 5457
-455.3G145F673E679G391E692B513B875D039D99H61A491A711B502E140F656A668C568
$$ 7145 6673 5679 7391 5692 2513 2875 4039 499 861 1491 1711 2502 5140 6656 1668 3568
-460.3D510C093A705A682G097E419F712F328E405C300E125D818B401B672B505D780
$$ 4510 3093 1705 1682 7097 5419 6712 6328 5405 3300 5125 4818 2401 2672 2505 4780
-464.9F876D853E141A673F314D529C806D848A618C226I726I046D113B710A241A975
$$ 6876 4853 5141 1673 6314 4529 3806 4848 1618 3226 9726 9046 4113 2710 1241 1975
-469.6D604E782G457F473I212A0415I106D561C144C362G314A1621H736A0411H276E793
$$ 4604 5782 7457 6473 9212 10415 9106 4561 3144 3362 7314 11621 8736 10411 8276 5793
-474.3H499C797A699B060B349G226H072E069G474D718B493C657F224G922F586F924
$$ 8499 3797 1699 2060 2349 7226 8072 5069 7474 4718 2493 3657 6224 7922 6586 6924
-479G949E709D306A447e36g89F119F819H390A2178F528G312G313D980A300I35A856
$$ 7949 5709 4306 1447 -536 -789 6119 6819 8390 12178 6528 7312 7313 4980 1300 935 1856
-483.9D807I343G636F542C971C571H81b28D844H088E150D099C724G167D498B445F462
$$ 4807 9343 7636 6542 3971 3571 881 -228 4844 8088 5150 4099 3724 7167 4498 2445 6462
-488.9D505E93B088D463F871F833G062G283E642F078D718A451G52B902E164E895B917
$$ 4505 593 2088 4463 6871 6833 7062 7283 5642 6078 4718 1451 752 2902 5164 5895 2917
-493.9E38C097B932B242C014G11a323i02D941D526D025C314C135G182F833D947D499
$$ 538 3097 2932 2242 3014 711 -1323 -902 4941 4526 4025 3314 3135 7182 6833 4947 4499
-498.8F241F458F463D164F430G301G675H546D624C717A198C076B859E140H462H316
$$ 6241 6458 6463 4164 6430 7301 7675 8546 4624 3717 1198 3076 2859 5140 8462 8316
-503.5G919D016C559A384A935F807H706G569H232D032A984E779H851H314G476A0951
$$ 7919 4016 3559 1384 1935 6807 8706 7569 8232 4032 1984 5779 8851 8314 7476 10951
-508.2G474F666F360D129B106D268A407E095E023D670D838D821c83a294B28A144D858
$$ 7474 6666 6360 4129 2106 4268 1407 5095 5023 4670 4838 4821 -383 -1294 228 1144 4858
-513.2A0066A1384H241F774C528D744F567G978G618C455H609G382I239A1658E558D606
$$ 10066 11384 8241 6774 3528 4744 6567 7978 7618 3455 8609 7382 9239 11658 5558 4606
-517.8B374C814B884F441F606I633D599D673I77C206A11a104D270G043A2073A1602
$$ 2374 3814 2884 6441 6606 9633 4599 4673 977 3206 111 -1104 4270 7043 12073 11602
-522.5H255G216E808B956B543F866F884G311I296A0292F931E555G757G786F589D960
$$ 8255 7216 5808 2956 2543 6866 6884 7311 9296 10292 6931 5555 7757 7786 6589 4960
-527.2C419E036G971A2704A1755A0589H551F939D873D622E748D534G069G971H748F894
$$ 3419 5036 7971 12704 11755 10589 8551 6939 4873 4622 5748 4534 7069 7971 8748 6894
-531.9D499B173B368E246E972E304F898H042F636G223E715D176D964G978F549H421
$$ 4499 2173 2368 5246 5972 5304 6898 8042 6636 7223 5715 4176 4964 7978 6549 8421
-536.6E686E201G893F250F801I658A3271A1102G690C773B556E10D158G688G432F658
$$ 5686 5201 7893 6250 6801 9658 13271 11102 7690 3773 2556 510 4158 7688 7432 6658
-541.2E686D279F829E423G015A1321H241G963H357G024I294I851D446F804G677F303
$$ 5686 4279 6829 5423 7015 11321 8241 7963 8357 7024 9294 9851 4446 6804 7677 6303
-545.9E521D561G759I181E990H931G344G078H863H618F088G831I893A1044A1129A0781
$$ 5521 4561 7759 9181 5990 8931 7344 7078 8863 8618 6088 7831 9893 11044 11129 10781
-550.6H728G086D565D493B537F371H886A0720A0192A2538A0737H808D732G871I566
$$ 8728 7086 4565 4493 2537 6371 8886 10720 10192 12538 10737 8808 4732 7871 9566
-555A1531A1605A0091A3354A0551H317F699E836F138H563I453A0241A0318H464H694
$$ 11531 11605 10091 13354 10551 8317 6699 5836 6138 8563 9453 10241 10318 8464 8694
-559.4E334E861H353G898H924H366A3077A2207A0033F504G217I834G514H928H776I790
$$ 5334 5861 8353 7898 8924 8366 13077 12207 10033 6504 7217 9834 7514 8928 8776 9790
-564G384D789G409G296I947A0705H568E696G598I131I191H331I580G018G253G677I765
$$ 7384 4789 7409 7296 9947 10705 8568 5696 7598 9131 9191 8331 9580 7018 7253 7677 9765
-569A0314I596G149G296F396G359A0566A1656A1163A1331G833H414F831G389I399I783
$$ 10314 9596 7149 7296 6396 7359 10566 11656 11163 11331 7833 8414 6831 7389 9399 9783
-573.7A1843A0178A0920H395F591G122H520H266I195I658A0137G669I637I434I966
$$ 11843 10178 10920 8395 6591 7122 8520 8266 9195 9658 10137 7669 9637 9434 9966
-578.1I629I069A0114H719H836F777H190H884A0315H377H858A2136A3758A5344A3759
$$ 9629 9069 10114 8719 8836 6777 8190 8884 10315 8377 8858 12136 13758 15344 13759
-582.4A1743A0199H680H764I641A0619A0729I353I764A2047H874H181I468A0738A2776
$$ 11743 10199 8680 8764 9641 10619 10729 9353 9764 12047 8874 8181 9468 10738 12776
-586.8A0429I706G825I163A2489A3140I980A0242I316I268H792I715A0106A1089A1183
$$ 10429 9706 7825 9163 12489 13140 9980 10242 9316 9268 8792 9715 10106 11089 11183
-591.2A0503I307I641A1684A1856A0181G673A0413A0307A0869A1043I697I668I939
$$ 10503 9307 9641 11684 11856 10181 7673 10413 10307 10869 11043 9697 9668 9939
-595.3A2137A2089G564F694I179A1155A2097A2348A1241A1324A0081A1519A2645H968
$$ 12137 12089 7564 6694 9179 11155 12097 12348 11241 11324 10081 11519 12645 8968
-599.4H638I839A0157I846A1146A1891A3014A3139A1316A0873I491I481H028H827A0376
$$ 8638 9839 10157 9846 11146 11891 13014 13139 11316 10873 9491 9481 8028 8827 10376
-603.8A0590A0249A4264A3971A4282
$$ 10590 10249 14264 13971 14282
##END=$$ End of the data block
