##TITLE=(R)(+) LIMONENE 13C{1H} $$ Begin of the data block
##JCAMP-DX=5.00 $$ ACD/SpecManager v 12.01
##DATE=25 Jun 2008 17:14:59
##DATA TYPE=NMR SPECTRUM
##DATA CLASS=XYDATA
##ORIGIN=Bruker BioSpin GmbH
##OWNER=ochem
##.OBSERVE FREQUENCY=75.45090
##.ACQUISITION TIME=0.83564
##.ZERO FILL=0
##.SHIFT REFERENCE=INTERNAL,  ,16384, -19.8996
##.OBSERVE NUCLEUS=^13C
##.ACQUISITION MODE=SIMULTANEOUS
##SPECTROMETER/DATA SYSTEM=??
##.SOLVENT NAME=CHLOROFORM-d
##SWCYCLICAL=19606.64648
##NPOINTS=16384
##FIRSTX=18104.00390625
##LASTX=-1501.44433594
##MAXX=18104.00390625
##MINX=-1501.44433594
##MAXY=194208576.00000000
##MINY=-1575302.00000000
##XFACTOR=1.0000000000
##YFACTOR=1.000000000000000
##FIRSTY=39399.00000000
##DELTAX=-1.19669461
##XUNITS=HZ
##YUNITS=ARBITRARY UNITS
##XYDATA=(X++(Y..Y))
$$ [...]
11769.9b6749c21040b45519b74315e66670c23675b23847d34368a10769g4950b74959
11756.7h74704f11469c29406f5058A85748C68097I05581G44254i8440c63757e78088
11743.6c30678b40011b53484a89977b34150C22901B92297D53573A12891b84473f34213
11730.4g85853e32572g76028b91734A75619b5971d23611d38417b80186B8490D96825
11717.2C29722A33341D17336E29235A21101a90826a54515C7216c21330e59951c03772
11704.1c6258d42291d52684c5838a38874d43820i20166g14097c04709e61102a58574
11690.9A36768i9429b08737d36330b38772b77335d76489a55421B63388C86451C01127
11677.8C99071B28125C47561C07092a18607g9358b23517e59759c60199A37030C3380
$$ y = [-26749, -321040, -245519, -274315, -566670, -323675, -223847, -434368, -110769, -74950, -274959, -874704, -611469, -329406, -65058, 185748, 368097, 905581, 744254, -98440, -363757, -578088, -330678, -240011, -253484, -189977, -234150, 322901, 292297, 453573, 112891, -284473, -634213, -785853, -532572, -776028, -291734, 175619, -25971, -423611, -438417, -280186, 28490, 496825, 329722, 133341, 417336, 529235, 121101, -190826, -154515, 37216, -321330, -559951, -303772, -36258, -442291, -452684, -35838, -138874, -443820, -920166, -714097, -304709, -561102, -158574, 136768, -99429, -208737, -436330, -238772, -277335, -476489, -155421, 263388, 386451, 301127, 399071, 228125, 347561, 307092, -118607, -79358, -223517, -559759, -360199, 137030, 33380]
11664.6d7920B55676B57653D0242e7671B00182F00906D90314A89873b61761E766F1506
11650.2I1783A33610C89930B60610E78116F16261A75607c68785i69982i81865f71107
11637.1e87311h07717f81831a009775e91432g51403f23621c47577i894E9026c00726
11623.9f19833f54562b24438D29841D17141C185b0736g2090A60889C26190A4255a22314
11609.5h3024a62076e96157e19864d79348d79985d71489h30527h40640g33951e54311
11596.4f25460g59721h57540f5397A83590a07292d32871b06852A91085b28182d55169
11583.2c85120a99383a0981d300a75430A76973B98100b83988c22939d3127A71924B25738
11568.9D22009C89444A17374A46328A51058B15316c3110h9769d52121c23779d71739
$$ y = [-47920, 255676, 257653, 40242, -57671, 200182, 600906, 490314, 189873, -261761, 5766, 61506, 91783, 133610, 389930, 260610, 578116, 616261, 175607, -368785, -969982, -981865, -671107, -587311, -807717, -681831, -1009775, -591432, -751403, -623621, -347577, -9894, 59026, -300726, -619833, -654562, -224438, 429841, 417141, 3185, -20736, -72090, 160889, 326190, 14255, -122314, -83024, -162076, -596157, -519864, -479348, -479985, -471489, -830527, -840640, -733951, -554311, -625460, -759721, -857540, -65397, 183590, -107292, -432871, -206852, 191085, -228182, -455169, -385120, -199383, -10981, -4300, -175430, 176973, 298100, -283988, -322939, -43127, 171924, 225738, 422009, 389444, 117374, 146328, 151058, 215316, -33110, -89769, -452121, -323779, -471739]
11555.7f82638f25147e02650d01672g02198c36141a07903D60919E17497B407e45186
11542.5b34355C6136D1556a88643A95019C3279e1536A07662C4956a47995e2771C03365
11528.2C36698A07359A25160F1889a4184a63888c6018F7755A50828C30737G55683H75844
11513.8F60593D20463C09337C45743C04914e4697b94568e70156c87268A62146C2198
11500.6c09191e24637b44038d19033e88049h88414c23026E1527D50877D51507F72126
11487.5C60010b55655c43160i9038C49217B10647C2656a24867A63702a05874a51480
11474.3b0375B7937b05516a00052a23299b77282b47393c9379F08608F06642C60090
11461.2H8678C3433a39948I6737I2217D65327C80573G1435C43216C56131A72364a41181
$$ y = [-682638, -625147, -502650, -401672, -702198, -336141, -107903, 460919, 517497, 2407, -545186, -234355, 36136, 41556, -188643, 195019, 33279, -51536, 107662, 34956, -147995, -52771, 303365, 336698, 107359, 125160, 61889, -14184, -163888, -36018, 67755, 150828, 330737, 755683, 875844, 660593, 420463, 309337, 345743, 304914, -54697, -294568, -570156, -387268, 162146, 32198, -309191, -524637, -244038, -419033, -588049, -888414, -323026, 51527, 450877, 451507, 672126, 360010, -255655, -343160, -99038, 349217, 210647, 32656, -124867, 163702, -105874, -151480, -20375, 27937, -205516, -100052, -123299, -277282, -247393, -39379, 608608, 606642, 360090, 88678, 33433, -139948, 96737, 92217, 465327, 380573, 71435, 343216, 356131, 172364, -141181]
11446.8b01931b40185e87676f80309c47677b50919b15684D88730D96595a22558c02887
11433.6a05833E06317E85110H94144I90605D58325E192d24588A24119A03830b59297
11420.5b92894D5472h2361c473C57925G2885A00684A84556B99011C23835C87888C23640
11406.1B91795F66996B28643C2921e45151c0457a76616c80025d12865b24637a08946
11392.9a30897B28346C24943D21298A362i5416B74620B52028a39043e17533b18117
11379.8b84534a28511B12116B5860c8624D35376D74349C60533C26479C08185E70724
11366.6C57485B3777b67854a88171f0980b02372a59240d47382c96411c04396h4482
11353.4f47301g10895c85665h7263a28089h2507c13345e96674A8010A30812H6046g0535
$$ y = [-201931, -240185, -587676, -680309, -347677, -250919, -215684, 488730, 496595, -122558, -302887, -105833, 506317, 585110, 894144, 990605, 458325, 5192, -424588, 124119, 103830, -259297, -292894, 45472, -82361, -3473, 357925, 72885, 100684, 184556, 299011, 323835, 387888, 323640, 291795, 666996, 228643, 32921, -545151, -30457, -176616, -380025, -412865, -224637, -108946, -130897, 228346, 324943, 421298, 1362, -95416, 274620, 252028, -139043, -517533, -218117, -284534, -128511, 212116, 25860, -38624, 435376, 474349, 360533, 326479, 308185, 570724, 357485, 23777, -267854, -188171, -60980, -202372, -159240, -447382, -396411, -304396, -84482, -647301, -710895, -385665, -87263, -128089, -82507, -313345, -596674, 18010, 130812, 86046, -70535]
11339.1B8298B32142b32753b98255c39331c41594E9902C82773G59706A024274A957415
11325.9D957621A4072329D7717904D5863844A8168712I293622E515021C381687B418871
11315.2A954122A453961A374728A230378A055058H23727A108127F84657H3343B89863
11303.2E34707G44774G69034A46270B15936C78789C35119I0910C79495D09770C96034
11290C22706E59298A015877I83744D55512A34366F5234f4552B55819C06291A6695a12488
11275.7a08549c04079b4424C08878D32214B30532a7738a71513a64992a77409F0637
11262.5B47749D26568F98153H80628H98040F90944E92610C06312A6009B78918B01500
11249.3D92789H96537C41831a63267b26814a39114B15512B64825B8859C62338F28186
$$ y = [28298, 232142, -232753, -298255, -339331, -341594, 59902, 382773, 759706, 1024274, 1957415, 4957621, 14072329, 47717904, 45863844, 18168712, 9293622, 5515021, 3381687, 2418871, 1954122, 1453961, 1374728, 1230378, 1055058, 823727, 1108127, 684657, 83343, 289863, 534707, 744774, 769034, 146270, 215936, 378789, 335119, 90910, 379495, 409770, 396034, 322706, 559298, 1015877, 983744, 455512, 134366, 65234, -64552, 255819, 306291, 16695, -112488, -108549, -304079, -24424, 308878, 432214, 230532, -17738, -171513, -164992, -177409, 60637, 247749, 426568, 698153, 880628, 898040, 690944, 592610, 306312, 16009, 278918, 201500, 492789, 896537, 341831, -163267, -226814, -139114, 215512, 264825, 28859, 362338, 628186]
11236.2C1557b81923b04268d76727a09598e41395c07328B75740A01261d90828f21993
11223b36722A27337A62468C79175a70068a60130B60018D34220C7419a06625A09458
11209.8C86036A89208b92130a94393A39789E93638H19779E43000A22375B30131f2979
11196.7b2180D70038E35875D70572D34785F14767F73986D69964B86042G0472D75939
11183.5C26597a39456a56668a90912c64209b02046a39414A72380B17943E1074A50818
11170.4d7664g3983b21622d6967C82559E06344I2644c8172D83235C58034D15392B72964
11156i8809b48920b81602d55504b8503A49982b23433C05333D74563B4825c6703h4068
11141.6h8486b43382e06812c94862a86519a22444d2247a58562d72191c84424H6551
$$ y = [31557, -281923, -204268, -476727, -109598, -541395, -307328, 275740, 101261, -490828, -621993, -236722, 127337, 162468, 379175, -170068, -160130, 260018, 434220, 37419, -106625, 109458, 386036, 189208, -292130, -194393, 139789, 593638, 819779, 543000, 122375, 230131, -62979, -22180, 470038, 535875, 470572, 434785, 614767, 673986, 469964, 286042, 70472, 475939, 326597, -139456, -156668, -190912, -364209, -202046, -139414, 172380, 217943, 51074, 150818, -47664, -73983, -221622, -46967, 382559, 506344, 92644, -38172, 483235, 358034, 415392, 272964, -98809, -248920, -281602, -455504, -28503, 149982, -223433, 305333, 474563, 24825, -36703, -84068, -88486, -243382, -506812, -394862, -186519, -122444, -42247, -158562, -472191, -384424, 86551]
11128.5A88101C38123C89640d1822I1802C65341C38172A53197c16422c63754A69877
11115.3B46140A82068a1I0107D9594h2638A75537C35807B4900E784d59158a56506i4847
11099.8f80075a45935B28822F7016f7929a26254h0178h0134a84733d82589i89266g97593
11085.4f84533b01923D4861g8278c09068c20445c24026b65090f7716b74700c0226A89500
11071A26460D13183E23410A03007I4239C29353C59016E05734B89849E9283C69747A46208
11056.7D84146F29146E00500B70341B70502A5296G0786b50603b74827e70586f06163
11043.5G1945B95146D38019E23086E31000G5214A49531C10463E63760G11325C94960
11030.3C14256A27301g0824b30549c02314d17645e2477B11756a52925e89755B09655
$$ y = [188101, 338123, 389640, -41822, 91802, 365341, 338172, 153197, -316422, -363754, 169877, 246140, 182068, -11, 90107, 49594, -82638, 175537, 335807, 24900, 5784, -459158, -156506, -94847, -680075, -145935, 228822, 67016, -67929, -126254, -80178, -80134, -184733, -482589, -989266, -797593, -684533, -201923, 44861, -78278, -309068, -320445, -324026, -265090, -67716, -274700, -30226, 189500, 126460, 413183, 523410, 103007, 94239, 329353, 359016, 505734, 289849, 59283, 369747, 146208, 484146, 629146, 500500, 270341, 270502, 15296, 70786, -250603, -274827, -570586, -606163, 71945, 295146, 438019, 523086, 531000, 75214, 149531, 310463, 563760, 711325, 394960, 314256, 127301, -70824, -230549, -302314, -417645, -52477, 211756, -152925, -589755, 209655]
11017.2G03350I43657G88733F93195B78301b04871G2963A85989A80895B37930A41170
11004A6806h587c09820e62391c96032f9562D38070D53980B33233C03264B45012B47043
10989.7D83133A99391B04010C02415E87852C82273C01621A62052i7401c06033F0565
10976.5C03484b19725a42890A3553i5121a42600I4619B74399A71434G834b36135E6910
10962.1a23336c04128f96984a95454B99551C96481B30855E7832B09127A66125B75310
10949G7887b72397c26027A17236c0593G3717D1366d2357g1585B1349B11122C3205a87339
10933.4d22033c53747f12222b52497b73413a49458C19016F8907c48339b13241c33557
10920.2c97998d19526e36425c82950a90763a94143f6514b96545d99445b37334a00189
$$ y = [703350, 943657, 788733, 693195, 278301, -204871, 72963, 185989, 180895, 237930, 141170, 16806, -8587, -309820, -562391, -396032, -69562, 438070, 453980, 233233, 303264, 245012, 247043, 483133, 199391, 204010, 302415, 587852, 382273, 301621, 162052, -97401, -306033, 60565, 303484, -219725, -142890, 13553, -95121, -142600, 94619, 274399, 171434, 7834, -236135, 56910, -123336, -304128, -696984, -195454, 299551, 396481, 230855, 57832, 209127, 166125, 275310, 77887, -272397, -326027, 117236, -30593, 73717, 41366, -42357, -71585, 21349, 211122, 33205, -187339, -422033, -353747, -612222, -252497, -273413, -149458, 319016, 68907, -348339, -213241, -333557, -397998, -419526, -536425, -382950, -190763, -194143, -66514, -296545, -499445, -237334, -100189]
10907.1f43720g20953c07043e6088g9654E26669F93197C90506C43730C4225b65466
10893.9a68902C7809B02325A31306D78307D76313b37357d56617e99276e17236b17993
10880.8e05817c60297C64629G45284H06848H31306I03646G52314H8930F6723b57974
10867.6a86174c108a23374b00922h2154C3638A11523C61080D96011B61135I9925b0156
10853.2a42797b76817c69580B8267E60164B47775A89268D44262B01237a5747a08908
10840.1b33979b91200e72997g14190f12277d82489e48412d06893a69718b55693e616
10826.9A47970A01451C22975D44496h4611H3585C90642B64132A33561h8568b38768
10813.7h8261C66736B90921E993b27222a71833a99650G3534b39613d24779b43760B04104
$$ y = [-643720, -720953, -307043, -56088, -79654, 526669, 693197, 390506, 343730, 34225, -265466, -168902, 37809, 202325, 131306, 478307, 476313, -237357, -456617, -599276, -517236, -217993, -505817, -360297, 364629, 745284, 806848, 831306, 903646, 752314, 88930, 66723, -257974, -186174, -3108, -123374, -200922, -82154, 33638, 111523, 361080, 496011, 261135, 99925, -20156, -142797, -276817, -369580, 28267, 560164, 247775, 189268, 444262, 201237, -15747, -108908, -233979, -291200, -572997, -714190, -612277, -482489, -548412, -406893, -169718, -255693, -5616, 147970, 101451, 322975, 444496, -84611, 83585, 390642, 264132, 133561, -88568, -238768, -88261, 366736, 290921, 5993, -227222, -171833, -199650, 73534, -239613, -424779, -243760, 204104]
10799.4A69612D586h6842f3021D7192A66889B65420B22113B37886a25001e91285c77434
10785c42293A59165B79243H798e86889e24373d19948C5152A41372A18830A33732b84336
10770.7b51198a30728B64643E50282B72429I5669A04658E18950C47211A87232F2626
10757.5A91870A52323C83297B6240a19422g35752i03871i31183f17694a72172E2119
10744.3E1976A26092G5797A74999A23002f2469b79449c06527e71470d64436c4375I1132
10730D16513C85895B84551E51457H35399A055492D61297B92483C95733C61151D47630
10716.8D77036A69721B86213C03297b9406d63488e60141d80975b31355b3353B25206
10703.6B88504E38305E92514A73003b76113d17110e26000b53802A27687D90419G04499
$$ y = [169612, 4586, -86842, -63021, 47192, 166889, 265420, 222113, 237886, -125001, -591285, -377434, -342293, 159165, 279243, 8798, -586889, -524373, -419948, 35152, 141372, 118830, 133732, -284336, -251198, -130728, 264643, 550282, 272429, 95669, 104658, 518950, 347211, 187232, 62626, 191870, 152323, 383297, 26240, -119422, -735752, -903871, -931183, -617694, -172172, 52119, 51976, 126092, 75797, 174999, 123002, -62469, -279449, -306527, -571470, -464436, -34375, 91132, 416513, 385895, 284551, 551457, 835399, 1055492, 461297, 292483, 395733, 361151, 447630, 477036, 169721, 286213, 303297, -29406, -463488, -560141, -480975, -231355, -23353, 225206, 288504, 538305, 592514, 173003, -276113, -417110, -526000, -253802, 127687, 490419, 704499]
10690.5F75074B08420A68008E76751E17118C22325a42717a29138d69166a79286E20885
10677.3C09815a56024d48964e28589f52478c60832c58021a52594D6345D44334E08908
10664.2A55757b03292b16224c27125f28418e39238b49306a72798c64008c28860d20523
10651c61782h8597h1044a52977a96396a36406a78720a72323i4403c78677b55198B11575
10636.6B81888b31633E5915B77156E8133B77372A33360C12011B95935A35758e2957
10623.5b5173A33273B92218A73139B12882A96697B54161D01292D40704G23198F41425
10610.3D65658C25237B51778b5640a52363c74475f99270c68701A6172H2159B50549
10597.1A94562b83946a80052g3184A89652a669a96545d48642i62581i09482d30954
$$ y = [675074, 208420, 168008, 576751, 517118, 322325, -142717, -129138, -469166, -179286, 520885, 309815, -156024, -448964, -528589, -652478, -360832, -358021, -152594, 46345, 444334, 508908, 155757, -203292, -216224, -327125, -628418, -539238, -249306, -172798, -364008, -328860, -420523, -361782, -88597, -81044, -152977, -196396, -136406, -178720, -172323, -94403, -378677, -255198, 211575, 281888, -231633, 55915, 277156, 58133, 277372, 133360, 312011, 295935, 135758, -52957, -25173, 133273, 292218, 173139, 212882, 196697, 254161, 401292, 440704, 723198, 641425, 465658, 325237, 251778, -25640, -152363, -374475, -699270, -368701, 16172, 82159, 250549, 194562, -283946, -180052, -73184, 189652, -1669, -196545, -448642, -962581, -909482, -430954]
10584b35338E7289e970a56951b13929a68775a52125C33639B53369a20720c13127d18215
10569.6d59394b39537C27174D70055A99379B06596a63137c98012d42499b51143e52846
10556.5b95469G4931B8489c72530c02897e85114c66225a3946C6498a66604d84654e20716
10542.1c77230c26674a96972c56587d82741c26775B21018B15417b48447a56663b87841
10528.9a62585E7871c01147a29832B4414C0445E02190G39366G097H4968a57338c92640
10514.6c18745c3912a71947b94638d27600a48851A88432A97153B07187A60752A08133
10501.4a35484a83567A12856F23346C83810C69675B98777I5834D73181B97076A96858
10488.2G12159h0810b96774a36929b31573a55239e1830a59290a90471a36934c49307
$$ y = [-235338, 57289, -5970, -156951, -213929, -168775, -152125, 333639, 253369, -120720, -313127, -418215, -459394, -239537, 327174, 470055, 199379, 206596, -163137, -398012, -442499, -251143, -552846, -295469, 74931, 28489, -372530, -302897, -585114, -366225, -13946, 36498, -166604, -484654, -520716, -377230, -326674, -196972, -356587, -482741, -326775, 221018, 215417, -248447, -156663, -287841, -162585, 57871, -301147, -129832, 24414, 30445, 502190, 739366, 7097, 84968, -157338, -392640, -318745, -33912, -171947, -294638, -427600, -148851, 188432, 197153, 207187, 160752, 108133, -135484, -183567, 112856, 623346, 383810, 369675, 298777, 95834, 473181, 297076, 196858, 712159, -80810, -296774, -136929, -231573, -155239, -51830, -159290, -190471, -136934, -349307]
10475.1b50939d09188e11212b92268C99751D91310A37938a2941D40166I66287A020345
10461.9G47884E74470D56667C84713B10888b05467f36108d01514A01170b5961e71669
10448.7c96070c46669b2177A04987B39840a52950b43314A06407B24517a20090a23750
10435.6h6256D2431C50950D86932C16130G6208a84298b38551d27785c29756b6292b20630
10421.2c87813d67993c91535b55164B74550C00820B9096b26092c41411c72208a81943
10408.1B6943c87220c36837e32223e08881a45435c64420d48254g97622d71920g5116
10394.9A37545B27201B68597B7532b40550b16971a71186e19607b24815c50544b62169
10381.7c72274c38121A2602B39912A21091A51977B47299C94451B44736a20729e9772
$$ y = [-250939, -409188, -511212, -292268, 399751, 491310, 137938, -12941, 440166, 966287, 1020345, 747884, 574470, 456667, 384713, 210888, -205467, -636108, -401514, 101170, -25961, -571669, -396070, -346669, -22177, 104987, 239840, -152950, -243314, 106407, 224517, -120090, -123750, -86256, 42431, 350950, 486932, 316130, 76208, -184298, -238551, -427785, -329756, -26292, -220630, -387813, -467993, -391535, -255164, 274550, 300820, 29096, -226092, -341411, -372208, -181943, 26943, -387220, -336837, -532223, -508881, -145435, -364420, -448254, -797622, -471920, -75116, 137545, 227201, 268597, 27532, -240550, -216971, -171186, -519607, -224815, -350544, -262169, -372274, -338121, 12602, 239912, 121091, 151977, 247299, 394451, 244736, -120729, -59772]
10368.6H7565a943D9002C35208C01984d0764d16003b71570g8781d25064h75195f22041
10354.2a77039c69592f78056h06527c22817a62799a63711a16522a50186h7649a45993
10341d50208e48818b84264b60156a69629f41558f29422b24444b09925b13232f15505
10327.9e19803i4307G5577d41155d75853a25140b28981b0732E9339e090B64639H17508
10313.5I07628A63141a4766b86494E3001F55044C88876H1510E8182A61260D22079E80530
10299.2B46850b72584A48553C12401d21469g07363f25936c30577e42523g10283d87657
10286c55611e21883f09517d42819e19579c80031A37887B43618A80575C89896D15549
10272.8A90410B09422C15707B10901C92772F15574H0294B30576B33783b20980C31850
$$ y = [87565, -1943, 49002, 335208, 301984, -40764, -416003, -271570, -78781, -425064, -875195, -622041, -177039, -369592, -678056, -806527, -322817, -162799, -163711, -116522, -150186, -87649, -145993, -450208, -548818, -284264, -260156, -169629, -641558, -629422, -224444, -209925, -213232, -615505, -519803, -94307, 75577, -441155, -475853, -125140, -228981, -20732, 59339, -5090, 264639, 817508, 907628, 163141, -14766, -286494, 53001, 655044, 388876, 81510, 58182, 161260, 422079, 580530, 246850, -272584, 148553, 312401, -421469, -707363, -625936, -330577, -542523, -710283, -487657, -355611, -521883, -609517, -442819, -519579, -380031, 137887, 243618, 180575, 389896, 415549, 190410, 209422, 315707, 210901, 392772, 615574, 80294, 230576, 233783, -220980, 331850]
10259.7C26932D81789C11803B48842B01972B96995B63354H7763D45084F85974D66301
10246.5B48825b4535d8453a48619B61022C35209a27126G0888A39812A26726B49372
10233.3C53708A19095A02537H14085G93495C06309b82547b48573c27351c0705d21032
10220.2b95826c24680i5064a75215b28139c06496c76924c27873I1530D5692f8864a03438
10205.8a66534A93518B54057b76209a94560e1445b95280b28199c40633d45631e94050
10192.7c88863g33211g65444d71848a26236c26876c67586c03415d84185b42599b67708
10179.5b01033A46285b54617e372B18458C17388A83086B30514B33068B06964A50949
10166.3e01814e18455a44426F51076F77306B28599b48954a79131c63828a32056C1481
$$ y = [326932, 481789, 311803, 248842, 201972, 296995, 263354, 87763, 445084, 685974, 466301, 248825, -24535, -48453, -148619, 261022, 335209, -127126, 70888, 139812, 126726, 249372, 353708, 119095, 102537, 814085, 793495, 306309, -282547, -248573, -327351, -30705, -421032, -295826, -324680, -95064, -175215, -228139, -306496, -376924, -327873, 91530, 45692, -68864, -103438, -166534, 193518, 254057, -276209, -194560, -51445, -295280, -228199, -340633, -445631, -594050, -388863, -733211, -765444, -471848, -126236, -326876, -367586, -303415, -484185, -242599, -267708, -201033, 146285, -254617, -5372, 218458, 317388, 183086, 230514, 233068, 206964, 150949, -501814, -518455, -144426, 651076, 677306, 228599, -248954, -179131, -363828, -132056, 31481]
10153.2I794b20984e68766g56276c72117g0602D83376H66889G45352D39474F1523B42171
10138.8A93975a98217a18025C21542C57689C88155F38841F12479A11925d43453e99251
10125.6a62049A44338c7184d7925B11111B52693C58690C55134F31321H88865C84103
10112.5c43495c92898b45563B69638C14341a52196B26006B1710a22301B42678B59330
10099.3C82623A59522B8790B08731G89340E54862C79998C50519G43081G15765A42187
10086.2b6833F07510B865618G204198B0003526E6232400C2193540A3518217G580072
10075.4E479962D047476C018004B709772B044491A581703A468538A383725A416685
10064.6A419744A534067A357850A208711A268974I36694H70105F32085G11750D16138
$$ y = [9794, -220984, -568766, -756276, -372117, -70602, 483376, 866889, 745352, 439474, 61523, 242171, 193975, -198217, -118025, 321542, 357689, 388155, 638841, 612479, 111925, -443453, -599251, -162049, 144338, -37184, -47925, 211111, 252693, 358690, 355134, 631321, 888865, 384103, -343495, -392898, -245563, 269638, 314341, -152196, 226006, 21710, -122301, 242678, 259330, 382623, 159522, 28790, 208731, 789340, 554862, 379998, 350519, 743081, 715765, 142187, -26833, 607510, 2865618, 7204198, 20003526, 56232400, 32193540, 13518217, 7580072, 5479962, 4047476, 3018004, 2709772, 2044491, 1581703, 1468538, 1383725, 1416685, 1419744, 1534067, 1357850, 1208711, 1268974, 936694, 870105, 632085, 711750, 416138]
10052.6A66561H8913I6815a80605b76467i5349G1650B2579B62619D66267C65917C63510
10038.3D50069B14310a09841a52617A28683G9828H0299A97028A3109b28133B97215
10025.1E94277D50411D42842D74299B16578B96199C78628A81681a41057d52316I7657
10012C3958a68679b89593d15515e38104e26367d52540F914D28116A84540A79119a37770
9997.6g884d0421A45467C38198C71534C29270C83857B64281B68978e5661b87497b65365
9983.2b90425I9766F9658a45035A00087G48216D30410C10270A58173a01069A87675
9970.1C43095B51264C11279A45486A60979B06413C7592f5855A53537b29135f39329
9956.9e52160d89260h59291a17559A62251a95908A8834G5414a11588a01516G2442b28236
$$ y = [166561, 88913, 96815, -180605, -276467, -95349, 71650, 22579, 262619, 466267, 365917, 363510, 450069, 214310, -109841, -152617, 128683, 79828, 80299, 197028, 13109, -228133, 297215, 594277, 450411, 442842, 474299, 216578, 296199, 378628, 181681, -141057, -452316, 97657, 33958, -168679, -289593, -415515, -538104, -526367, -452540, 6914, 428116, 184540, 179119, -137770, -7884, -40421, 145467, 338198, 371534, 329270, 383857, 264281, 268978, -55661, -287497, -265365, -290425, 99766, 69658, -145035, 100087, 748216, 430410, 310270, 158173, -101069, 187675, 343095, 251264, 311279, 145486, 160979, 206413, 37592, -65855, 153537, -229135, -639329, -552160, -489260, -859291, -117559, 162251, -195908, 18834, 75414, -111588, -101516, 72442, -228236]
9942.5A36469C51857F17026D31758i0759a30774A88446B89415A51822B98097A59077
9929.4b24932A15710E35683D32095I9084a70060b1991C07639c621E5641h0071a18153
9915a74728c27280e38473e70626b69156A02362a87989B93692C55616A55824b31570
9901.9d06615a1763A81826E97006D83051C94488C06611A32521d21246b40393H7370
9888.7C06377c6031C57061E50724A50117a37246c027h9707c1854b7784A79340C33274
9874.3B92169h2757G1581d1769I736F45208E41997G70410A073375A344250A107086
9861.2A116642G77474E955a49473A60487E04420D71677G58045G61395E37957B03951
9848A97485B86747C42458b00343a84691D34733A99459A17152C17835F53007F97600
$$ y = [136469, 351857, 617026, 431758, -90759, -130774, 188446, 289415, 151822, 298097, 159077, -224932, 115710, 535683, 432095, 99084, -170060, -21991, 307639, -3621, 55641, -80071, -118153, -174728, -327280, -538473, -570626, -269156, 102362, -187989, 293692, 355616, 155824, -231570, -406615, -11763, 181826, 597006, 483051, 394488, 306611, 132521, -421246, -240393, 87370, 306377, -36031, 357061, 550724, 150117, -137246, -3027, -89707, -31854, -27784, 179340, 333274, 292169, -82757, 71581, -41769, 9736, 645208, 541997, 770410, 1073375, 1344250, 1107086, 1116642, 777474, 5955, -149473, 160487, 504420, 471677, 758045, 761395, 537957, 203951, 197485, 286747, 342458, -200343, -184691, 434733, 199459, 117152, 317835, 653007, 697600]
9834.8B14629E65354D23465C1950C62587F77714D56895D93297B9658b52032b98478
9821.7c23490g4242i9127f08355g41707d77098a73054B51079F88948G09011F02413
9808.5D46532B69636H637d1655B6844A26145a07560a33583b9009A5440B68538C26683
9794.2D45303A20669i2277d49760d60619c8392A1378a6929c54815b3101B97462E82447
9779.8D59122B37911b92121b85139C0307d2248c30070b95224b18529c13257a22517
9766.6E5451I3344D4738I2951C21525D83576D05167B40538F60993H95625G40320F19756
9752.3F80616C17444E42165G26618B73297G37836H06381F61783E89983C36944G8016
9739.1B31284F03939I3006b22597i5644B72800A16098d26639g6474B42697A36226E47042
$$ y = [214629, 565354, 423465, 31950, 362587, 677714, 456895, 493297, 29658, -252032, -298478, -323490, -74242, -99127, -608355, -741707, -477098, -173054, 251079, 688948, 709011, 602413, 446532, 269636, 8637, -41655, 26844, 126145, -107560, -133583, -29009, 15440, 268538, 326683, 445303, 120669, -92277, -449760, -460619, -38392, 11378, -16929, -354815, -23101, 297462, 582447, 459122, 237911, -292121, -285139, 30307, -42248, -330070, -295224, -218529, -313257, -122517, 55451, 93344, 44738, 92951, 321525, 483576, 405167, 240538, 660993, 895625, 740320, 619756, 680616, 317444, 542165, 726618, 273297, 737836, 806381, 661783, 589983, 336944, 78016, 231284, 603939, 93006, -222597, -95644, 272800, 116098, -426639, -76474, 242697, 136226, 547042]
9724.7C81887B73034F49670C22826f5870c42850b83819c58346d49839i1131a15968
9711.6g1938a55026b48038b51114E1205E62333C59164B60005D23617A88924A19709
9698.4B20365A34065C32641A64879H6941b07933G610h2545a51943g7683G8756C4400
9684.1F790b56757c66498c56951B70404B04011B8210B82115D74943F57103A044990
9670.9A268438I21611D74524C31688c013A22188H520A29294e0970d80641f88790d32937
9656.5a00634c88865e41790d50968g75736f47266a92451i6652E4785C03169E59131
9643.4C34271A78928C28015e7034b63499d69052b66821c35761a93534C64329F30859
9630.2D01874B1939b26398c84094c69927f93473c16583a69259C3532d4606d19404b42943
$$ y = [381887, 273034, 649670, 322826, -65870, -342850, -283819, -358346, -449839, -91131, -115968, -71938, -155026, -248038, -251114, 51205, 562333, 359164, 260005, 423617, 188924, 119709, 220365, 134065, 332641, 164879, 86941, -207933, 7610, -82545, -151943, -77683, 78756, 34400, 6790, -256757, -366498, -356951, 270404, 204011, 28210, 282115, 474943, 657103, 1044990, 1268438, 921611, 474524, 331688, -3013, 122188, 8520, 129294, -50970, -480641, -688790, -432937, -100634, -388865, -541790, -450968, -775736, -647266, -192451, -96652, 54785, 303169, 559131, 334271, 178928, 328015, -57034, -263499, -469052, -266821, -335761, -193534, 364329, 630859, 401874, 21939, -226398, -384094, -369927, -693473, -316583, -169259, 33532, -44606, -419404, -242943]
9615.8H8136g9141H7671A56047a85097d98147f91381e11528c60233b25468b79866i6588
9601.5c17782a15599b09728e4699A27301b740A42894B54314H4700b71378g30718f55714
9587.1a59737d4438C11035D556G3668E63981A64891A04712B61958A52644C61011E38976
9572.8E44856C14072C0358a31133e5350H3851g9485G157B75612a23358e81248c37941
9558.4a38834a57221d9537D16040D70123F86506F02323a65388b65592b45619a29101
9545.2a20013a40660B64570c1148B36610B04937G8233e48220c94598e61963c99437
9532.1B52183E43152D02163A76917D06964B38424D5645c59047d04465b60717B2858
9518.9E27253B17929a71351d86912d70823I8669C7060d14040a94924a63965H6580E86734
$$ y = [88136, -79141, 87671, 156047, -185097, -498147, -691381, -511528, -360233, -225468, -279866, -96588, -317782, -115599, -209728, -54699, 127301, -2740, 142894, 254314, 84700, -271378, -730718, -655714, -159737, -44438, 311035, 4556, 73668, 563981, 164891, 104712, 261958, 152644, 361011, 538976, 544856, 314072, 30358, -131133, -55350, 83851, -79485, 7157, 275612, -123358, -581248, -337941, -138834, -157221, -49537, 416040, 470123, 686506, 602323, -165388, -265592, -245619, -129101, -120013, -140660, 264570, -31148, 236610, 204937, 78233, -548220, -394598, -561963, -399437, 252183, 543152, 402163, 176917, 406964, 238424, 45645, -359047, -404465, -260717, 22858, 527253, 217929, -171351, -486912, -470823, 98669, 37060, -414040, -194924, -163965, 86580, 586734]
9504.6I73533A050020G55081C61052A92698A04851D0781d5553c76018g74360h38432
9491.4e01619a08466b9178a55016a28219B18038B77080a73435d6464g515a36689E7211
9477B99275H40273I27217A037272A000444E58253G9788i950A96226G70876F20715D7506
9462.7e18889a61108C15359F44798B37999C51992C88159B13289a93922b62460b58867
9449.5b28451e13629c80030e56168B48837A75319b77613b12982b73063b62425a22439
9436.3g48351e30943d50252a90025F5173C65137B35813D08083B78534H2362e16214
9423.2i58082f30669g55016b36962b46230c81072c50929I982A76203i2839B0668c55164
9408.8b96775b50915b10674D16393G31975B02925D50960D65816D87601B82891A68021
$$ y = [973533, 1050020, 755081, 361052, 192698, 104851, 40781, -45553, -376018, -774360, -838432, -501619, -108466, -29178, -155016, -128219, 218038, 277080, -173435, -46464, -7515, -136689, 57211, 299275, 840273, 927217, 1037272, 1000444, 558253, 79788, -9950, 196226, 770876, 620715, 47506, -518889, -161108, 315359, 644798, 237999, 351992, 388159, 213289, -193922, -262460, -258867, -228451, -513629, -380030, -556168, 248837, 175319, -277613, -212982, -273063, -262425, -122439, -748351, -530943, -450252, -190025, 65173, 365137, 235813, 408083, 278534, 82362, -516214, -958082, -630669, -755016, -236962, -246230, -381072, -350929, 9982, 176203, -92839, 20668, -355164, -296775, -250915, -210674, 416393, 731975, 202925, 450960, 465816, 487601, 282891, 168021]
9395.7F5155C8501b4084F0349B90756b4351C61539A68138C32325F40200F32602G3838
9381.3A63882D01115B17115A70193I289b97373a18196D15206E81652A194402H57543
9368.1C95721b05883a07630e275B73977C31477C88162A22650a13415d67288g48017
9355g02255d16623A82905E97409C45438a73277d79170d57162c68172E4543D34190C42957
9340.6A86443a29890d10495d93793d83896b92862a75696c70172a36863e5993A92550
9327.4A68463a67461e74345d02954A13404B37004B87776D44247G66992A428146I09206
9314.3C48952A97081D87915C17420A5365c15648i7767a87911A09661C39435D12548
9301.1B52845f4010b51960c71464a92705C96475C38726a67140g8072C58389D36289
$$ y = [65155, 38501, -24084, 60349, 290756, -24351, 361539, 168138, 332325, 640200, 632602, 73838, 163882, 401115, 217115, 170193, 9289, -297373, -118196, 415206, 581652, 1194402, 857543, 395721, -205883, -107630, -5275, 273977, 331477, 388162, 122650, -113415, -467288, -748017, -702255, -416623, 182905, 597409, 345438, -173277, -479170, -457162, -368172, 54543, 434190, 342957, 186443, -129890, -410495, -493793, -483896, -292862, -175696, -370172, -136863, -55993, 192550, 168463, -167461, -574345, -402954, 113404, 237004, 287776, 444247, 766992, 1428146, 909206, 348952, 197081, 487915, 317420, 15365, -315648, -97767, -187911, 109661, 339435, 412548, 252845, -64010, -251960, -371464, -192705, 396475, 338726, -167140, -78072, 358389, 436289]
9288a1714i4573B61675a975c64612i1913B22626B79270B74710C50120B03363g1938
9273.6g7546a87675b88142C90271A70770e50739a47541B12137D94252F52419C94444
9260.4c27687b2322E83117D08091D73294D08940B07190A24150C00874H8841C29604
9247.3D33030E84326F28701D63716A65434h6683B55139D01595A66623a87916H899C4897
9232.9a86776b45292a75063a15432B81564D32907D52912D01394H63215C83695C7472
9219.7g1372B72188D42644A51509C24577B4843B69399G81395G29721D31178B48362
9206.6c84744g5286b94586e48838a63091A87870C70711A49145A02980A39085b58684
9193.4f55980a59664D27407B28692C84367C98192a73784b58812C17629B08101C14350
$$ y = [-11714, -94573, 261675, -1975, -364612, -91913, 222626, 279270, 274710, 350120, 203363, -71938, -77546, -187675, -288142, 390271, 170770, -550739, -147541, 212137, 494252, 652419, 394444, -327687, -22322, 583117, 408091, 473294, 408940, 207190, 124150, 300874, 88841, 329604, 433030, 584326, 628701, 463716, 165434, -86683, 255139, 401595, 166623, -187916, 8899, 34897, -186776, -245292, -175063, -115432, 281564, 432907, 452912, 401394, 863215, 383695, 37472, -71372, 272188, 442644, 151509, 324577, 24843, 269399, 781395, 729721, 431178, 248362, -384744, -75286, -294586, -548838, -163091, 187870, 370711, 149145, 102980, 139085, -258684, -655980, -159664, 427407, 228692, 384367, 398192, -173784, -258812, 317629, 208101, 314350]
9180.3C30347C15004E14069G59181F01375E27280D35482E91568D47202C77551E11657
9167.1D07263A91222B39073C27358C17146D36834C10320B11224A26587C76440D57761
9153.9A58505B98776F66878G62585G28383E79666G72676F16896B71859A8276B6119
9140.8C52999H38752H49663I3500e5353A58116A61768a7425C11244B80321E90284I83057
9126.4A465038A516553A876442A801220A354717A237879A479690A919841B003576B244370
9114.4C357245D854179F920129A0309422A8260068C7986524A00481632A52588688E5383660
9103.7B1805966A0738088F007170C424324B454702A729523A061400G96209F18747C91721
9091.7F9041C713B53422C37683E45675A156143G24714D89608D30847e0910a61841C2156
$$ y = [330347, 315004, 514069, 759181, 601375, 527280, 435482, 591568, 447202, 377551, 511657, 407263, 191222, 239073, 327358, 317146, 436834, 310320, 211224, 126587, 376440, 457761, 158505, 298776, 666878, 762585, 728383, 579666, 772676, 616896, 271859, 18276, 26119, 352999, 838752, 849663, 93500, -55353, 158116, 161768, -17425, 311244, 280321, 590284, 983057, 1465038, 1516553, 1876442, 1801220, 1354717, 1237879, 1479690, 1919841, 2003576, 2244370, 3357245, 4854179, 6920129, 10309422, 18260068, 37986524, 100481632, 152588688, 55383660, 21805966, 10738088, 6007170, 3424324, 2454702, 1729523, 1061400, 796209, 618747, 391721, 69041, 3713, 253422, 337683, 545675, 1156143, 724714, 489608, 430847, -50910, -161841, 32156]
9077.3g2893a73925h5786c51710d43468b11367a51120D26946D49344D08458a49463
9064.2b65416F8935H7737b78660f45028C0352H99808H07597b8384c51932b80762B05527
9049.8E78565D01690C38017b09348d06442f18076d25713a38282f3337d09218d54865
9036.6b69215b81461d50493g14863h48485g19131f65016d43359a99642f24455f22955
9023.5g55092e50544c66188c86391F5163A95812H5978A12202A71923B85624G8179c56667
9009.1a43854C04890f5911a02012c19313f75273c21764b14087c4101A52447E7222a40834
8994.8a42758d19481e35567c74545b38361D41398F40248B10086c4240A23796a71934
8981.6a5707B5171I3361E42934E91491E54430D92823C24763C9440B68651C67772B17674
$$ y = [-72893, -173925, -85786, -351710, -443468, -211367, -151120, 426946, 449344, 408458, -149463, -265416, 68935, 87737, -278660, -645028, 30352, 899808, 807597, -28384, -351932, -280762, 205527, 578565, 401690, 338017, -209348, -406442, -618076, -425713, -138282, -63337, -409218, -454865, -269215, -281461, -450493, -714863, -848485, -719131, -665016, -443359, -199642, -624455, -622955, -755092, -550544, -366188, -386391, 65163, 195812, 85978, 112202, 171923, 285624, 78179, -356667, -143854, 304890, -65911, -102012, -319313, -675273, -321764, -214087, -34101, 152447, 57222, -140834, -142758, -419481, -535567, -374545, -238361, 441398, 640248, 210086, -34240, 123796, -171934, -15707, 25171, 93361, 542934, 591491, 554430, 492823, 324763, 39440, 268651, 367772, 217674]
8967.2B80472B87138A16473C20723E33337C21772b53893c88860G2353b21068e99207
8954.1a99230f4099b97096d27462f07347d43451c53851C6762B37750C49305a87887
8940.9e20697g45183f84544c09683a78947a25984e30930d85441d00074c9692b79118
8927.8i7376a47944b87931c57116b90769a94960a20190A41922D16378a28223a0265
8914.6B64830D87644C32835E47670D07700h7941d75033f33288e94692c94639h05192
8901.4a003613f94006c71586f0704A15548I0245c3824C35867C88771B61129A85A80642
8887.1B34912A9659B74397B61239G1172a1775a38914e297A84486C16818A26058B71399
8872.7b43686d48109G4019A43818c50694a65231D11979F35597C43668E40983G47462
$$ y = [280472, 287138, 116473, 320723, 533337, 321772, -253893, -388860, 72353, -221068, -599207, -199230, -64099, -297096, -427462, -607347, -443451, -353851, 36762, 237750, 349305, -187887, -520697, -745183, -684544, -309683, -178947, -125984, -530930, -485441, -400074, -39692, -279118, -97376, -147944, -287931, -357116, -290769, -194960, -120190, 141922, 416378, -128223, -10265, 264830, 487644, 332835, 547670, 407700, -87941, -475033, -633288, -594692, -394639, -805192, -1003613, -694006, -371586, -60704, 115548, 90245, -33824, 335867, 388771, 261129, 185, 180642, 234912, 19659, 274397, 261239, 71172, -11775, -138914, -5297, 184486, 316818, 126058, 271399, -243686, -448109, 74019, 143818, -350694, -165231, 411979, 635597, 343668, 540983, 747462]
8859.5E44150A32403c20341e29486b58489C40279D05928A71253a18025a92975b44800
8846.4c79760a16786A70930A78120c07796a85772I7827B83595C35814C52433C0728
8833.2b32752a9432G2393D2366B11385C51706B56154D1760C3703A76776a81334f81353
8818.9a103306h56216c65629e4574A76682B02261a32214c03170d986G4354a77258c99165
8804.5d23461d62669i38704f18449f11550b68363E0444a18502a93803c96120g6708
8791.3a46599h96621a290344g41876b27896B0097B163B03677B99769B39758C92261
8778.2C13274a67912a41585h1231A67956D39270E82526D12357B65312b57877d84352
8765f43141d86606e77743d40639a2431A64738B23572A76877f1197A37082I98135A044305
$$ y = [544150, 132403, -320341, -529486, -258489, 340279, 405928, 171253, -118025, -192975, -244800, -379760, -116786, 170930, 178120, -307796, -185772, 97827, 283595, 335814, 352433, 30728, -232752, -19432, 72393, 42366, 211385, 351706, 256154, 41760, 33703, 176776, -181334, -681353, -1103306, -856216, -365629, -54574, 176682, 202261, -132214, -303170, -4986, 74354, -177258, -399165, -423461, -462669, -938704, -618449, -611550, -268363, 50444, -118502, -193803, -396120, -76708, -146599, -896621, -1290344, -741876, -227896, 20097, 2163, 203677, 299769, 239758, 392261, 313274, -167912, -141585, -81231, 167956, 439270, 582526, 412357, 265312, -257877, -484352, -643141, -486606, -577743, -440639, -12431, 164738, 223572, 176877, -61197, 137082, 998135, 1044305]
8750.6I97918D74961A02015b21883i5719a14556D1813A83539B01097f8007c99705a69126
8736.3b1131E3444i4038I7799E52451D69324D27352B59858b48594a59834e1634B14426
8721.9G76494A141759E89045E59966C90951E26804C11654B62200A21752A21933A06177
8708.8G6024G0820A16560D34044G71528E32065A52792i7867a03380a30715B35401A05134
8694.4a94164B56512C70165F9800f27256f10993c94261b92588H7122F380i5921B38331
8680B45312A81528A58786B56959I0668f2880d1635D50514H87449E48720B75173C91724
8665.7B24524A74532B15472A39310d2825A19545D41032E90859A21921A41737D43756
8652.5D18497b14585d00659c10487h1373A52827E325a15997a69393a31266e0407A48604
$$ y = [997918, 474961, 102015, -221883, -95719, -114556, 41813, 183539, 201097, -68007, -399705, -169126, -21131, 53444, -94038, 97799, 552451, 469324, 427352, 259858, -248594, -159834, -51634, 214426, 776494, 1141759, 589045, 559966, 390951, 526804, 311654, 262200, 121752, 121933, 106177, 76024, 70820, 116560, 434044, 771528, 532065, 152792, -97867, -103380, -130715, 235401, 105134, -194164, 256512, 370165, 69800, -627256, -610993, -394261, -292588, 87122, 6380, -95921, 238331, 245312, 181528, 158786, 256959, 90668, -62880, -41635, 450514, 887449, 548720, 275173, 391724, 224524, 174532, 215472, 139310, -42825, 119545, 441032, 590859, 121921, 141737, 443756, 418497, -214585, -400659, -310487, -81373, 152827, 5325, -115997, -169393, -131266, -50407, 148604]
8638.1a48287b75784A30601a00121h4061B79942A82320C08240D35047B18322b45107
8625e38094d35109h8105a97299e4329B242E3020A67753E7654B22221B71388d75798
8610.6c76836b94844a68000A62085B74599B23251C89203A01113a80754a31461B14936
8597.5B27083B43363A06096B07855C86817B37181c2461C46457B07422B20467A45748
8584.3a99184g62805g05798c33271b7154B72819E48837B65879d1047H5602B26502C94908
8569.9C45045A85823F0714A11117D1631e04198c83656B47847A40042A77964B40613
8556.8A55469C52873B87579f9416a35889a18468b78044e70502h18337d55514g8265
8543.6b15115f43643e87950g45030d64595b28638c41798d03042c64030c69034A15163
$$ y = [-148287, -275784, 130601, -100121, -84061, 279942, 182320, 308240, 435047, 218322, -245107, -538094, -435109, -88105, -197299, -54329, 2242, 53020, 167753, 57654, 222221, 271388, -475798, -376836, -294844, -168000, 162085, 274599, 223251, 389203, 101113, -180754, -131461, 214936, 227083, 243363, 106096, 207855, 386817, 237181, -32461, 346457, 207422, 220467, 145748, -199184, -762805, -705798, -333271, -27154, 272819, 548837, 265879, -41047, 85602, 226502, 394908, 345045, 185823, 60714, 111117, 41631, -504198, -383656, 247847, 140042, 177964, 240613, 155469, 352873, 287579, -69416, -135889, -118468, -278044, -570502, -818337, -455514, -78265, -215115, -643643, -587950, -745030, -464595, -228638, -341798, -403042, -364030, -369034, 115163]
8530.4F13869C45437A33285B07043C61234F49544C74318C3767H06051A656992H29221
8517.3E95908B51604A63587a6010a22950a99217E1015b90118e11613d34721b48270
8504.1d07812c23393f79138e32001e02443e41367e79205b94384a88679c76498A11359
8491B86263B0068d11399a86582b45257b13701c27396c52327d20336b62902h04148g29969
8476.6i23422g89109b31801A0350A91845b53474b71673d98480b47423b7735B18427
8463.4B83890C46447D30389C03711E19025B31089h3898b08231b93555d38972f85689
8450.3a93377H7977C39408E72458E28918B61566C39116A57035h8792D7626A5554C5890
8435.9c285b96240c88480h4862D0345D50565B96790D83068d9697b14327d85492c98137
$$ y = [613869, 345437, 133285, 207043, 361234, 649544, 374318, 33767, 806051, 1656992, 829221, 595908, 251604, 163587, -16010, -122950, -199217, 51015, -290118, -511613, -434721, -248270, -407812, -323393, -679138, -532001, -502443, -541367, -579205, -294384, -188679, -376498, 111359, 286263, 20068, -411399, -186582, -245257, -213701, -327396, -352327, -420336, -262902, -804148, -729969, -923422, -789109, -231801, 10350, 191845, -253474, -271673, -498480, -247423, -27735, 218427, 283890, 346447, 430389, 303711, 519025, 231089, -83898, -208231, -293555, -438972, -685689, -193377, 87977, 339408, 572458, 528918, 261566, 339116, 157035, -88792, 47626, 15554, 35890, -3285, -296240, -388480, -84862, 40345, 450565, 296790, 483068, -49697, -214327, -485492, -398137]
8421.5b36816F0793E31081C71029G4943a48882i1940e6978d16247e00561e17303b05427
8407.2D9927e32706c15459C23341F96758G27605D10187A44358A63827a63750e39056
8394i98437f12830b78962a59153c01541C65558A94521c69747h16186d92092d36346
8380.9D7164i3053d32928c06120F8844A20959B10445C49759C04553a73454a92433B04398
8366.5A35759b20677a7108A74094A56751a63306b48051E4976D2460c62459b66694b13802
8352.1a95443B55030B98855B29418A63886b70512e05132h9973A47465B47165g8558
8339H1724A35809B37707A7248g1515A97090B59165G04545C40016G2622C43828F10210
8324.6D75840E83013B54421a35483b02105b90300b64981C20306E69779D29125B23485
$$ y = [-236816, 60793, 531081, 371029, 74943, -148882, -91940, -56978, -416247, -500561, -517303, -205427, 49927, -532706, -315459, 323341, 696758, 727605, 410187, 144358, 163827, -163750, -539056, -998437, -612830, -278962, -159153, -301541, 365558, 194521, -369747, -816186, -492092, -436346, 47164, -93053, -432928, -306120, 68844, 120959, 210445, 349759, 304553, -173454, -192433, 204398, 135759, -220677, -17108, 174094, 156751, -163306, -248051, 54976, 42460, -362459, -266694, -213802, -195443, 255030, 298855, 229418, 163886, -270512, -505132, -89973, 147465, 247165, -78558, 81724, 135809, 237707, 17248, -71515, 197090, 259165, 704545, 340016, 72622, 343828, 610210, 475840, 583013, 254421, -135483, -202105, -290300, -264981, 320306, 569779, 429125, 223485]
8311.5B04135G5886A20170c545C2539a77412A78728E20291e958a382686i40284d81535
8297.1c1512C59489E56605B65152a4625C17270C49706H33211I08895B94037C44895
8283.9F23673B62783d0621D29807D55329B18689A4242d1966c96714c28844g20685f97222
8269.6a13994e6576I3409G8345b6846a25042b26343B45542D34261B92310B39299G29820
8255.2A116783A091942F92307A10978B55066a68302H1899C43820D63320D36117A7951
8242a71901E4912G9868G56676A335269A126854A277671A478245A395494A045085A310622
8228.9A389329A468248A176758D89237D69901E97426I87637A034372H76748H49681
8216.9H22535A303283A647542B116749A794990A100356A274314A451037A811771A720190
$$ y = [204135, 75886, 120170, -3545, 32539, -177412, 178728, 520291, -5958, -1382686, -940284, -481535, -31512, 359489, 556605, 265152, -14625, 317270, 349706, 833211, 908895, 294037, 344895, 623673, 262783, -40621, 429807, 455329, 218689, 14242, -41966, -396714, -328844, -720685, -697222, -113994, -56576, 93409, 78345, -26846, -125042, -226343, 245542, 434261, 292310, 239299, 729820, 1116783, 1091942, 692307, 110978, 255066, -168302, 81899, 343820, 463320, 436117, 17951, -171901, 54912, 79868, 756676, 1335269, 1126854, 1277671, 1478245, 1395494, 1045085, 1310622, 1389329, 1468248, 1176758, 489237, 469901, 597426, 987637, 1034372, 876748, 849681, 822535, 1303283, 1647542, 2116749, 1794990, 1100356, 1274314, 1451037, 1811771, 1720190]
8204.9A297271I50986A379056A529759A526744A815368A853684A986122B298073B658042
8193C028308B793033B980802C684390D612986E980040G784892A0282050A4978832B6434762
8181E6417876A47211024A75820896F0723832B3381820A1292696F459719C551748B007988
8170.2A225793H33899C71860f0427D03341C69698a33987b26339b28373A46259B3233
8157.1d75732e38011a0836I7948E5546b01328c00536a92621F2415D49273C79464A60631
8142.7a26574C01289D44066c7952c16296a72893a29943a37290b73162a52280G9900
8129.6a39004e30460g39830a157852a164443f63943f56502e83451g84107d62383d84231
8116.4e76225b96536d79812e49242i08844f22036i8957b59556d87566f71275e97531
$$ y = [1297271, 950986, 1379056, 1529759, 1526744, 1815368, 1853684, 1986122, 2298073, 2658042, 3028308, 2793033, 2980802, 3684390, 4612986, 5980040, 7784892, 10282050, 14978832, 26434762, 56417876, 147211024, 175820896, 60723832, 23381820, 11292696, 6459719, 3551748, 2007988, 1225793, 833899, 371860, -60427, 403341, 369698, -133987, -226339, -228373, 146259, 23233, -475732, -538011, -10836, 97948, 55546, -201328, -300536, -192621, 62415, 449273, 379464, 160631, -126574, 301289, 444066, -37952, -316296, -172893, -129943, -137290, -273162, -152280, 79900, -139004, -530460, -739830, -1157852, -1164443, -663943, -656502, -583451, -784107, -462383, -484231, -576225, -296536, -479812, -549242, -908844, -622036, -98957, -259556, -487566, -671275, -597531]
8103.2g23223f10178d76859e15274e75847e97941h50762d73748a83831d60254e68058
8090.1e47864c76759h9644c15482c69277a050736a474900a575302a027001g84910f44535
8076.9f43938d14774b82685c85373b87911b42647C8190b25416i46623a111101g80122
8063.7e36367B6028A38080A64838C28042E79937F14266D66880A19038h783e2961I1948
8049.4d7892h2953e73330e13308e98318b57050A50876E03953C21555A72315c0827b99811
8035d21991d68523c8854g0582D5246c45482e6459A26732E7118C25190C4054a40996
8020.7F5619H3919F4973a34044a39618B94495H383A3978B11544E14277A21043h1639
8006.3b42143C2838d3331B62791H77771I25911E39151A63723C9513A99626A93942D17260
$$ y = [-723223, -610178, -476859, -515274, -575847, -597941, -850762, -473748, -183831, -460254, -568058, -547864, -376759, -89644, -315482, -369277, -1050736, -1474900, -1575302, -1027001, -784910, -644535, -643938, -414774, -282685, -385373, -287911, -242647, 38190, -225416, -946623, -1111101, -780122, -536367, 26028, 138080, 164838, 328042, 579937, 614266, 466880, 119038, -8783, -52961, 91948, -47892, -82953, -573330, -513308, -598318, -257050, 150876, 503953, 321555, 172315, -30827, -299811, -421991, -468523, -38854, -70582, 45246, -345482, -56459, 126732, 57118, 325190, 34054, -140996, 65619, 83919, 64973, -134044, -139618, 294495, 8383, 13978, 211544, 514277, 121043, -81639, -242143, 32838, -43331, 262791, 877771, 925911, 539151, 163723, 39513, 199626, 193942, 417260]
7991.9D30008A59175A08781G0093B48272E68830D29154B93413H8109b4880A42327A29081
7977.6a98208a10690A90084b09917B4061F15687C84145B78671C6353A08825a70843
7964.4a56111B68898F44794H39950D26200A92345B82144h9693H9625a79820b86102
7951.2g48324e99506f16476f98872h8120h1063A5644i0051d27188d47038d19489d67666
7936.9a50956a28246a69292h77614a216330i55973i68336a033183h66016e89802e10323
7923.7b84245d90543d65373d72228c15772f47579b77922A39646F94090H90465E78970
7910.6E10046G69766D86976C92525C85421A97926C23660E64664G81525E42136B86193
7897.4d71518e97409d44467f33883e87863b27590C33594D19067e2154B5005g4355d38971
$$ y = [430008, 159175, 108781, 70093, 248272, 568830, 429154, 293413, 88109, -24880, 142327, 129081, -198208, -110690, 190084, -209917, 24061, 615687, 384145, 278671, 36353, 108825, -170843, -156111, 268898, 644794, 839950, 426200, 192345, 282144, -89693, 89625, -179820, -286102, -748324, -599506, -616476, -698872, -88120, -81063, 15644, -90051, -427188, -447038, -419489, -467666, -150956, -128246, -169292, -877614, -1216330, -955973, -968336, -1033183, -866016, -589802, -510323, -284245, -490543, -465373, -472228, -315772, -647579, -277922, 139646, 694090, 890465, 578970, 510046, 769766, 486976, 392525, 385421, 197926, 323660, 564664, 781525, 542136, 286193, -471518, -597409, -444467, -633883, -587863, -227590, 333594, 419067, -52154, 25005, -74355, -438971]
7883g84674g01311a40701B34399D99912E00950E30651C17045E90115G01417D65771
7869.9A62711F8868c4844i1336C84361e3975d85382c75431a9619a23045b46083b12293
7855.5d2767A95819B24332E40445C90754C77112B17821B54169D00925B07045B94179
7842.3C51642I7447f5007b50189c53718f1855B84370H2687g6287e290a42147b50032
7828a82397B65751a44488d31454g29452g47933c39295b55187e23721f99084e56307
7814.8i5214B21075B43802c41028a66516A87653a04072e27369a082082d78146b7047
7801.7c6727c10324e26947b92097D1384D179a44800A13674B7580C0969b71275b31659
7787.3B5173b84624d49548b97112C7994D08528C87497A1432c68179a04381B84925A48228
$$ y = [-784674, -701311, -140701, 234399, 499912, 500950, 530651, 317045, 590115, 701417, 465771, 162711, 68868, -34844, -91336, 384361, -53975, -485382, -375431, -19619, -123045, -246083, -212293, -42767, 195819, 224332, 540445, 390754, 377112, 217821, 254169, 400925, 207045, 294179, 351642, 97447, -65007, -250189, -353718, -61855, 284370, 82687, -76287, -5290, -142147, -250032, -182397, 265751, -144488, -431454, -729452, -747933, -339295, -255187, -523721, -699084, -556307, -95214, 221075, 243802, -341028, -166516, 187653, -104072, -527369, -1082082, -478146, -27047, -36727, -310324, -526947, -292097, 41384, 4179, -144800, 113674, 27580, 30969, -271275, -231659, 25173, -284624, -449548, -297112, 37994, 408528, 387497, 11432, -368179, -104381, 284925, 148228]
7772.9d86365c52070b12835b91270d67522d97853b71222a59483A25878H3767G6994
7759.8E04774B95373D49216B83515h8394b04467a2959e0504C40027A38806c58788c09903
7745.4d92471a50619I4885D12490H3803b32518e87754a58382E55418C46041A56467
7732.3A95463a96086b38040f0351a17720e15591g17732d89982d66507d3388D12580
7719.1G04873F25944F65666A59464d9135d9278A77544a19933a10481a47672b77335
7705.9d52897c03062B23657F98090C40503E16126E39305B38937d2891f82161d76170
7692.8d68565d35482A8137B13819D01266D36094A20250c50955b79839a59738E16180
7679.6E00755H15927D22009a40816G1896B20544D86693D71978A69762B98406C65623
$$ y = [-486365, -352070, -212835, -291270, -467522, -497853, -271222, -159483, 125878, 83767, 76994, 504774, 295373, 449216, 283515, -88394, -204467, -12959, -50504, 340027, 138806, -358788, -309903, -492471, -150619, 94885, 412490, 83803, -232518, -587754, -158382, 555418, 346041, 156467, 195463, -196086, -238040, -60351, -117720, -515591, -717732, -489982, -466507, -43388, 412580, 704873, 625944, 665666, 159464, -49135, -49278, 177544, -119933, -110481, -147672, -277335, -452897, -303062, 223657, 698090, 340503, 516126, 539305, 238937, -42891, -682161, -476170, -468565, -435482, 18137, 213819, 401266, 436094, 120250, -350955, -279839, -159738, 516180, 500755, 815927, 422009, -140816, 71896, 220544, 486693, 471978, 169762, 298406, 365623]
7666.4D03494B1702a33077e13157b75457a10981D01471E26557A09490C32563B39882
7653.3B23008a29192b49330c12690b95826c48399d3088A67235c8622d70414e25230
7640.1c49439b63606b22722c82145b90625b71941e34142d11072b88046b02195b05546
7626.9e88469a15301G2573A27163I3150A37449B27377C2102i86a28436c22742b07909
7612.6d99812i36138i92078g95228e22527f93711i36244g07371c06669a08285B42087
7599.4F9180e30656a001308h32505e52632e27937b19273A30902A03472a53305d70d11500
7585.1a85341B88274A1754a91986d51542d16764a24242A42960C45748A58245E2690
7571.9c04317c56106A48532D21006B17973A4540A82485B97799a47036a54904B99062
$$ y = [403494, 21702, -133077, -513157, -275457, -110981, 401471, 526557, 109490, 332563, 239882, 223008, -129192, -249330, -312690, -295826, -348399, -43088, 167235, -38622, -470414, -525230, -349439, -263606, -222722, -382145, -290625, -271941, -534142, -411072, -288046, -202195, -205546, -588469, -115301, 72573, 127163, 93150, 137449, 227377, 32102, -986, -128436, -322742, -207909, -499812, -936138, -992078, -795228, -522527, -693711, -936244, -707371, -306669, -108285, 242087, 69180, -530656, -1001308, -832505, -552632, -527937, -219273, 130902, 103472, -153305, -470, -411500, -185341, 288274, 11754, -191986, -451542, -416764, -124242, 142960, 345748, 158245, 52690, -304317, -356106, 148532, 421006, 217973, 14540, 182485, 297799, -147036, -154904, 299062]
7558.7G566a79006b49143g03520f57056c97275d91009e70485c55893a420c98225c55498
7544.4a84269A4963A17048C4359A15786a56836e83334d44115e0832b37725A52415E2393
7530B8492B24938h0295C0732B14367E17725D69553D36500D28332C79470E24546C17658
7515.6A36793c5011A01633a5628G4465a60095c00064c24072e81287b53600b21711c73138
7501.3b26068e1633A1704C63886B46214c900A20352A05455B2729D844b09687b86154
7486.9a72210b02972a23649A58666B17478A88825D42230I56924E16209B18239E62981
7473.8F71515E84414a10895a53720i5834a38992e12177b96218d1815B35068A60878
7460.6E58633E16309D50212d3816a40188A83425H7473C10978G00431E00129A86334
$$ y = [7566, -179006, -249143, -703520, -657056, -397275, -491009, -570485, -355893, -1420, -398225, -355498, -184269, 14963, 117048, 34359, 115786, -156836, -583334, -444115, -50832, -237725, 152415, 52393, 28492, 224938, -80295, 30732, 214367, 517725, 469553, 436500, 428332, 379470, 524546, 317658, 136793, -35011, 101633, -15628, 74465, -160095, -300064, -324072, -581287, -253600, -221711, -373138, -226068, -51633, 11704, 363886, 246214, -3900, 120352, 105455, 22729, 4844, -209687, -286154, -172210, -202972, -123649, 158666, 217478, 188825, 442230, 956924, 516209, 218239, 562981, 671515, 584414, -110895, -153720, -95834, -138992, -512177, -296218, -41815, 235068, 160878, 558633, 516309, 450212, -43816, -140188, 183425, 87473, 310978, 700431, 500129, 186334]
7447.4C08506C03086C09282A22975B79200A44640h3302c32112d19827f94003h00355
7434.3g54607d75417b96750b6735A91690B23463d71846b7546e5431c77725a78314A82315
7419.9D19548A28751g6672C32049A69328c43239C2450B48308A17310A27493G2771c20624
7405.6a33859e2064B46684A46075c01437f47289b78221c88335f3647A80027D87734
7392.4B60506G4996F4868E6469A54587c910B19655B61872a20827d44333f34138h95723
7378d74938g7463a74460f9573B6420a25930b17091B15863B90433e7866a9837E23957
7363.7B97117C89112E46926D88489C03741C68953B89975a40244c58218e59041e05402
7350.5a63318G216e844G6744C53124d3346b47708c14810e33812a72100B01395e3840
$$ y = [308506, 303086, 309282, 122975, 279200, 144640, -83302, -332112, -419827, -694003, -800355, -754607, -475417, -296750, -26735, 191690, 223463, -471846, -27546, -55431, -377725, -178314, 182315, 419548, 128751, -76672, 332049, 169328, -343239, 32450, 248308, 117310, 127493, 72771, -320624, -133859, -52064, 246684, 146075, -301437, -647289, -278221, -388335, -63647, 180027, 487734, 260506, 74996, 64868, 56469, 154587, -3910, 219655, 261872, -120827, -444333, -634138, -895723, -474938, -77463, -174460, -69573, 26420, -125930, -217091, 215863, 290433, -57866, -19837, 523957, 297117, 389112, 546926, 488489, 303741, 368953, 289975, -140244, -358218, -559041, -505402, -163318, 7216, -5844, 76744, 353124, -43346, -247708, -314810, -533812, -172100, 201395, -53840]
7336.1i631B59456D06204E83305D49074G0626g1231c7779A63485B5636b12655e91136
7321.8e85351d24845b42888b87030f7840E6644D22435G69727D04962E8789F0594h5546
7307.4c40973c06145d38961a05887c07192e37496a61634E21575C66483D26934E81286
7294.3A14399b11713E8154C13943F17275C32625I9345E23593G88072E50196h4266g0368
7279.9b23004c86278e31197e43407c85275d04310f82375f44833a96887c16203c9760
7266.7C2592c49434d13958g22567g40575b90091b24525e39544b28169c4883A13504
7253.6C56115B79609B40113B8096g491A89140A00029b22117c6629i3224F1094F74598
7239.2F76946C02846a44253b03797a05969d15881d36412b58526b97131b86949a27947
$$ y = [-9631, 259456, 406204, 583305, 449074, 70626, -71231, -37779, 163485, 25636, -212655, -591136, -585351, -424845, -242888, -287030, -67840, 56644, 422435, 769727, 404962, 58789, 60594, -85546, -340973, -306145, -438961, -105887, -307192, -537496, -161634, 521575, 366483, 426934, 581286, 114399, -211713, 58154, 313943, 617275, 332625, 99345, 523593, 788072, 550196, -84266, -70368, -223004, -386278, -531197, -543407, -385275, -404310, -682375, -644833, -196887, -316203, -39760, 32592, -349434, -413958, -722567, -740575, -290091, -224525, -539544, -228169, -34883, 113504, 356115, 279609, 240113, 28096, -7491, 189140, 100029, -222117, -36629, -93224, 61094, 674598, 676946, 302846, -144253, -203797, -105969, -415881, -436412, -258526, -297131, -286949, -127947]
7226G724c065a23690I281a765a40715A40192b5640a16043c42036c52832a74687a54161
7210.5g947a0695a75196c05033d75904b72603a67566A7797b25733b62566b76935b29601
7196.1b26264a74500a49954B45564B33236b04119d70905c33991B03314C01505c5753
7183f0250c70575g64331a69825b28527f61872a18439d1345a54962h0570d3326f8644
7168.6H8763A41120B63254a42053f61198c58898e64476f32022g65315d94428B8501
7155.4I90b0040b51880a09774a13058b94375a47113A11217H7597d73899c70031b28199
7141.1c48403d00129g4201E27881F35412C23683E37666C01530c5011B79640B20371
7127.9b77768c76254B1518C43166D80760E59085A10282b18138d24152b30129A09947
$$ y = [7724, -3065, -123690, 9281, -1765, -140715, 140192, -25640, -116043, -342036, -352832, -174687, -154161, -7947, -10695, -175196, -305033, -475904, -272603, -167566, 17797, -225733, -262566, -276935, -229601, -226264, -174500, -149954, 245564, 233236, -204119, -470905, -333991, 203314, 301505, -35753, -60250, -370575, -764331, -169825, -228527, -661872, -118439, -41345, -154962, -80570, -43326, -68644, 88763, 141120, 263254, -142053, -661198, -358898, -564476, -632022, -765315, -494428, 28501, 990, -20040, -251880, -109774, -113058, -294375, -147113, 111217, 87597, -473899, -370031, -228199, -348403, -400129, -74201, 527881, 635412, 323683, 537666, 301530, -35011, 279640, 220371, -277768, -376254, 21518, 343166, 480760, 559085, 110282, -218138, -424152, -230129, 109947]
7114.8C30364A17755e6174d06800d84338b65843b56641E0903f5601C2814b18430G6727
7100.4A28086a08994b74398G3068B42366A5420b76063b19932b11812a20883b73254
7087.2c23256A1474A38095B85828F3735i3160C80824F23465C54654C90187F27105A207484
7072.9A041229D72808a1862d82867a57631C7512b97419g20826f76387d73026B6718
7059.7A50297C3624c05590h06045h10790b93614b11755c70862b12036b17647c29103
7046.5e95326f22219c08558D9257A32613C29682C77406a25313d04234E0906a34352
7033.4c37332b78276d7055a93413B76346C60846f6665A35065H9347i0863B51691E98797
7019C64370B42540B41810G7509A56770h0686c10089d07001c17944B45188A59575a60947
$$ y = [330364, 117755, -56174, -406800, -484338, -265843, -256641, 50903, -65601, 32814, -218430, 76727, 128086, -108994, -274398, 73068, 242366, 15420, -276063, -219932, -211812, -120883, -273254, -323256, 11474, 138095, 285828, 63735, -93160, 380824, 623465, 354654, 390187, 627105, 1207484, 1041229, 472808, -11862, -482867, -157631, 37512, -297419, -720826, -676387, -473026, 26718, 150297, 33624, -305590, -806045, -810790, -293614, -211755, -370862, -212036, -217647, -329103, -595326, -622219, -308558, 49257, 132613, 329682, 377406, -125313, -404234, 50906, -134352, -337332, -278276, -47055, -193413, 276346, 360846, -66665, 135065, 89347, -90863, 251691, 598797, 364370, 242540, 241810, 77509, 156770, -80686, -310089, -407001, -317944, 245188, 159575, -160947]
7004.7a23206a69461d05096A2877A89752D89519C87119d1921a46062A56632F43705
6991.5E24123B82565C32115E39440G06216F73986E40968D7040b74896A03857F36621
6978.3D19268B19074A40513H7606D38104E16335E50538E24612D9971d81362g19167
6965.2d83706f44882d74002a41337d31322A23747F45308D53127C47580D1932c18461
6952f8781a09275a08321D15117F71961E87774H2427i1961B13823C26199h3393e35977
6937.6b80915c17258d08990b45050b34416f0259a7711B70882D62407C39802c20089
6924.5f39078e66205f14286g68123f99198d5197D55879D0873b88677f46968d92619
6911.3i8050D41064E43289B56120B26052C94321B75211f3701g5886a95750C36989B17996
$$ y = [-123206, -169461, -405096, 12877, 189752, 489519, 387119, -41921, -146062, 156632, 643705, 524123, 282565, 332115, 539440, 706216, 673986, 540968, 47040, -274896, 103857, 636621, 419268, 219074, 140513, 87606, 438104, 516335, 550538, 524612, 49971, -481362, -719167, -483706, -644882, -474002, -141337, -431322, 123747, 645308, 453127, 347580, 41932, -318461, -68781, -109275, -108321, 415117, 671961, 587774, 82427, -91961, 213823, 326199, -83393, -535977, -280915, -317258, -408990, -245050, -234416, -60259, -17711, 270882, 462407, 339802, -320089, -639078, -566205, -614286, -768123, -699198, -45197, 455879, 40873, -288677, -646968, -492619, -98050, 441064, 543289, 256120, 226052, 394321, 275211, -63701, -75886, -195750, 336989, 217996]
6897i910A47284A74668c36094d46995b1124F04474F88040I54799H18546E89375D62779
6882.6D08435A14248a71064b40116c9485C23706a10030A79986D79701B09732f1101
6869.4a68361d5411b14234b22035c22128B58834C45915b04487d80496a13268c8868
6856.3a48829f2655B02510B06275c08024h2502g7128B51440B41629b4339b5301d93934
6841.9g93188e44541b17085b00311d3366A23081a16530A14686A03051d112b00365H4008
6827.6D32887a53440e08900b53710e7478e06013f29766h55206c99534a66795b76234
6814.4A92787C59091C41268a39824d27943d26274g49281d85910a90039b80837h4387
6801.2b28610a55492a24428b61854f4204A20638B99759B43541B59533H5468b85563
$$ y = [-9910, 147284, 174668, -336094, -446995, -21124, 604474, 688040, 954799, 818546, 589375, 462779, 408435, 114248, -171064, -240116, -39485, 323706, -110030, 179986, 479701, 209732, -61101, -168361, -45411, -214234, -222035, -322128, 258834, 345915, -204487, -480496, -113268, -38868, -148829, -62655, 202510, 206275, -308024, -82502, -77128, 251440, 241629, -24339, -25301, -493934, -793188, -544541, -217085, -200311, -43366, 123081, -116530, 114686, 103051, -4112, -200365, 84008, 432887, -153440, -508900, -253710, -57478, -506013, -629766, -855206, -399534, -166795, -276234, 192787, 359091, 341268, -139824, -427943, -426274, -749281, -485910, -190039, -280837, -84387, -228610, -155492, -124428, -261854, -64204, 120638, 299759, 243541, 259533, 85468, -285563]
6788.1c77068d73890d40243e13609f42920e77697c25444c84203A6944i0001b40041
6774.9c70475b15748a33168B28346a74307c34652a19481A67872C55287C25663b34039
6761.7g03083c20362d23987c11257c48001e47405f94459g84275g75123d35142E7000
6748.6E50986C76542F5989e4631e0097d4090B48345A87522c82b36444e36296c36993
6734.2c34964a52427A4705e5214c39389E9076A04562a39409d8079c11864a89754b87601
6719.8c97835E9815A94209b02724b97809B10333B11565d6302h74783i20542f23157
6706.7b64632E2175B61729E8613D10682A77837F50773I14015H44493I17726H39245
6693.5I35930F97892C17112g1651a22748A32936B57950D02983C64629E61734E87779
$$ y = [-377068, -473890, -440243, -513609, -642920, -577697, -325444, -384203, 16944, -90001, -240041, -370475, -215748, -133168, 228346, -174307, -334652, -119481, 167872, 355287, 325663, -234039, -703083, -320362, -423987, -311257, -348001, -547405, -694459, -784275, -775123, -435142, 57000, 550986, 376542, 65989, -54631, -50097, -44090, 248345, 187522, -382, -236444, -536296, -336993, -334964, -152427, 14705, -55214, -339389, 59076, 104562, -139409, -48079, -311864, -189754, -287601, -397835, 59815, 194209, -202724, -297809, 210333, 211565, -46302, -874783, -920542, -623157, -264632, 52175, 261729, 58613, 410682, 177837, 650773, 914015, 844493, 917726, 839245, 935930, 697892, 317112, -71651, -122748, 132936, 257950, 402983, 364629, 561734, 587779]
6680.4G21084E60692B44454A79486G3131E39573D96853A95072B18606e8250h8789A90634
6666H02281B14635G908a65017b38089c01365F1616B31524D73994C08082D11207C27938
6651.6d1951A43156I0017a44171d86126h00487e10800a35582f9889C57090D63890B07562
6637.3A0771g7849C046b23405F3755C06127C45922D4771a45196d01983c54381a21640
6622.9f1913a83509F125A75741C01236F27442G69250E09796C84438B09499a85325d22076
6608.6e21414d68606e38864f34213f46105c07095b17624c39330b01150B26599F1034
6595.4e8136d0355a20658C38233B52452a50343c19296d38884b7620A91937b76970h4237
6581B70603F8792a93540b06149c5467B10365E64031B31311c04698c18279g34643d44175
$$ y = [721084, 560692, 244454, 179486, 73131, 539573, 496853, 195072, 218606, -58250, -88789, 190634, 802281, 214635, 7908, -165017, -238089, -301365, 61616, 231524, 473994, 308082, 411207, 327938, -41951, 143156, 90017, -144171, -486126, -800487, -510800, -135582, -69889, 357090, 463890, 207562, 10771, -77849, 3046, -223405, 63755, 306127, 345922, 44771, -145196, -401983, -354381, -121640, -61913, -183509, 6125, 175741, 301236, 627442, 769250, 509796, 384438, 209499, -185325, -422076, -521414, -468606, -538864, -634213, -646105, -307095, -217624, -339330, -201150, 226599, 61034, -58136, -40355, -120658, 338233, 252452, -150343, -319296, -438884, -27620, 191937, -276970, -84237, 270603, 68792, -193540, -206149, -35467, 210365, 564031, 231311, -304698, -318279, -734643, -444175]
6566.7b33673A95187D6166d2733e94389d23793A7599C38475B21540D68654B59452a7071
6552.3a01036A3626I4575d3300H2459D89210B47165b18469e79723e40198b55883A43584
6538I8386e3059B89654B27059a2440d49631b70209b38871a21006I7698A72629g1587
6523.6A27374B02120B27417A50099d5530B06672A85201b06294c47234h2531D1322A38756
6509.2C72688A32881a67533a1070a30463A09656A77224E09504I76591D39625a14078
6496.1c8953H7682E76454C80639A59284c7810B51437C25702C33763B37629b79000a32727
6481.7B31744A62253c13829d2366F097G8750C25265A54265c27133b49863c33521b07368
6467.3d1564c12979f61346c93880A82426A2949B53911C17650A98221E9156A65627B61715
$$ y = [-233673, 195187, 46166, -42733, -594389, -423793, 17599, 338475, 221540, 468654, 259452, -17071, -101036, 13626, 94575, -43300, 82459, 489210, 247165, -218469, -579723, -540198, -255883, 143584, 98386, -53059, 289654, 227059, -12440, -449631, -270209, -238871, -121006, 97698, 172629, -71587, 127374, 202120, 227417, 150099, -45530, 206672, 185201, -206294, -347234, -82531, 41322, 138756, 372688, 132881, -167533, -11070, -130463, 109656, 177224, 509504, 976591, 439625, -114078, -38953, 87682, 576454, 380639, 159284, -37810, 251437, 325702, 333763, 237629, -279000, -132727, 231744, 162253, -313829, -42366, 6097, 78750, 325265, 154265, -327133, -249863, -333521, -207368, -41564, -312979, -661346, -393880, 182426, 12949, 253911, 317650, 198221, 59156, 165627, 261715]
6453A60098D88080H64024F49733H08265C23339c3825A7984f4637a05083A1993D9278
6438.6B02129a55007a21262b35645c50890a38039A06158C33102B62517B89878B16377
6425.5B69719B37269C56875a56005e677A21447E02740H1520G6855E870a46625c7298
6411.1G8732g8913b5470a47387c84082f28589c83323f69673g60292e16558b47978a86679
6396.7b03483C7378b18915B5066I2434C33245a77249a22434b39990b12783d19860a30455
6382.4a25004D65858D66690B51035B97651B03268b64233c81845g20599a066122a079502
6369.2g37190d04128e15187b25485b28608D2955B44028B37461G7623a08992F8952a65350
6354.9A12219H41597I65150I62600G35263D70976a60162d91956h25270e83098b37782
$$ y = [160098, 488080, 864024, 649733, 808265, 323339, -33825, 17984, -64637, -105083, 11993, 49278, 202129, -155007, -121262, -235645, -350890, -138039, 106158, 333102, 262517, 289878, 216377, 269719, 237269, 356875, -156005, -5677, 121447, 502740, 81520, 76855, 5870, -146625, -37298, 78732, -78913, -25470, -147387, -384082, -628589, -383323, -669673, -760292, -516558, -247978, -186679, -203483, 37378, -218915, 25066, 92434, 333245, -177249, -122434, -239990, -212783, -419860, -130455, -125004, 465858, 466690, 251035, 297651, 203268, -264233, -381845, -720599, -1066122, -1079502, -737190, -404128, -515187, -225485, -228608, 42955, 244028, 237461, 77623, -108992, 68952, -165350, 112219, 841597, 965150, 962600, 735263, 470976, -160162, -491956, -825270, -583098, -237782]
6341.7f61185e44491b28068B71211E38572E57731G44136E26397E29651G24421G79606
6328.5H25822E95727H2580a75156a12679c68411e2899d6499A673c14030b63391c25528
6314.2a12727C3376C54530D18713D66587H5856D15881G34485H88582G50247B26414
6301B33033C64451A33961i0278a62771e06435d00258A41298I41562I28461A001650
6287.8C25008e4593g04198c16399c6619a50127A03531A57590a82008a4685d76815b67274
6273.5A7759h9951c27168a37595a55084g6278f06640i71619i73229b3132A22958C57669
6259.1B34060C36783C57194D77631F64879C07962e8204a19392h30976f39090a38829
6246I8869B85057i6493c95860f46987f81331f08637f54331a094806i46130e58680g63775
$$ y = [-661185, -544491, -228068, 271211, 538572, 557731, 744136, 526397, 529651, 724421, 779606, 825822, 595727, 82580, -175156, -112679, -368411, -52899, -46499, 1673, -314030, -263391, -325528, -112727, 33376, 354530, 418713, 466587, 85856, 415881, 734485, 888582, 750247, 226414, 233033, 364451, 133961, -90278, -162771, -506435, -400258, 141298, 941562, 928461, 1001650, 325008, -54593, -704198, -316399, -36619, -150127, 103531, 157590, -182008, -14685, -476815, -267274, 17759, -89951, -327168, -137595, -155084, -76278, -606640, -971619, -973229, -23132, 122958, 357669, 234060, 336783, 357194, 477631, 664879, 307962, -58204, -119392, -830976, -639090, -138829, 98869, 285057, -96493, -395860, -646987, -681331, -608637, -654331, -1094806, -946130, -558680, -763775]
6231.6e88635e70299c85207I5716G02884G31028G61388D27971d808A71542C06897B49250
6217.2D60883E35603B06156D3007a41727b33872G4659C10138A48459f1965A8156B23264
6202.9F22829E42628B83610D20185G78695A059986A97923A26798a2664d1786d8063
6189.7H7624H0461c8558b3099a78815g4741B4307a1540d51542h56570a057858h14312
6175.4g28915f11043b48794A24488D69987E06229B37524a59753c44010c29786a98359
6162.2b72971d88432F039a26956A54181B51419a67259E0680D7593b42951e50295d94035
6147.8A20210h6009d00810f59698g05845g91326c22016B0588A45474b76852a132454
6134.7i64253h80357i92273f33834b54780B06297F64330H60491F59837F37979B22883
$$ y = [-588635, -570299, -385207, 95716, 702884, 731028, 761388, 427971, -4808, 171542, 306897, 249250, 460883, 535603, 206156, 43007, -141727, -233872, 74659, 310138, 148459, -61965, 18156, 223264, 622829, 542628, 283610, 420185, 778695, 1059986, 197923, 126798, -12664, -41786, -48063, 87624, 80461, -38558, -23099, -178815, -74741, 24307, -11540, -451542, -856570, -1057858, -814312, -728915, -611043, -248794, 124488, 469987, 506229, 237524, -159753, -344010, -329786, -198359, -272971, -488432, 6039, -126956, 154181, 251419, -167259, 50680, 47593, -242951, -550295, -494035, 120210, -86009, -400810, -659698, -705845, -791326, -322016, 20588, 145474, -276852, -1132454, -964253, -880357, -992273, -633834, -254780, 206297, 664330, 860491, 659837, 637979, 222883]
6121.5D49402G51263D04406C45160A16940b90433c20647b86748f83615g67030f36239
6108.3e50935g23250h13333g20818c04153E4568A10271b98113b65454F8542G6028a80218
6094A55038A65989I5314a15635c74200c18230h481A21942D00064b13065B78387B69498
6079.6d8243a66494c61335c28224e94698h01906d55525b79841d02366f48294b76293
6066.5c9703i6305A2080B41777b54020b39057A71454G34855H27892G51023E00312B2984
6052.1A13057B38442F9983a248a48083B39700A60949d4957c7538b20401a18890a79894
6037.7b8572C29733d7400b69885a77934b83953c77990a55596B82073B66285a30763
6024.6d6642c65944c88242a21941A51015E38054H01301B78279f3054e7609a09772f52193
$$ y = [449402, 751263, 404406, 345160, 116940, -290433, -320647, -286748, -683615, -767030, -636239, -550935, -723250, -813333, -720818, -304153, 54568, 110271, -298113, -265454, 68542, 76028, -180218, 155038, 165989, 95314, -115635, -374200, -318230, -8481, 121942, 400064, -213065, 278387, 269498, -48243, -166494, -361335, -328224, -594698, -801906, -455525, -279841, -402366, -648294, -276293, -39703, -96305, 12080, 241777, -254020, -239057, 171454, 734855, 827892, 751023, 500312, 22984, 113057, 238442, 69983, -1248, -148083, 239700, 160949, -44957, -37538, -220401, -118890, -179894, -28572, 329733, -47400, -269885, -177934, -283953, -377990, -155596, 282073, 266285, -130763, -46642, -365944, -388242, -121941, 151015, 538054, 801301, 278279, -63054, -57609, -109772, -652193]
6010.2i66377a158470c01852A28977B91057C73427B25315A4859a85289c37223a99394
5997a30815D1976D31974D87098C09645F17069E02884A19431d37877c82551C37837A76481
5982.7B52584D28844D39042G92792E20893e4238a48048a4648a050D1657b70286A8302
5968.3B9569d07962d01459C6612a02244h5724B5752a32249e35925d09658b2364b20719
5954c31939a04315d5376a48151c46036b23439g11723d73039B24228D70068C15947a23291
5939.6b63984A22462C71721C4266d86852e14741b73331a25629F4261G1178I1991c79056
5925.2f53094d23148e10572a59655C57600G14041G36242D98396I4801g7754C32332
5912.1D67773E03406E44499G4550D79754A20982a50325A31946E05698I18769G67429
$$ y = [-966377, -1158470, -301852, 128977, 291057, 373427, 225315, 14859, -185289, -337223, -199394, -130815, 41976, 431974, 487098, 309645, 617069, 502884, 119431, -437877, -382551, 337837, 176481, 252584, 428844, 439042, 792792, 520893, -54238, -148048, -14648, -1050, 41657, -270286, 18302, 29569, -407962, -401459, 36612, -102244, -85724, 25752, -132249, -535925, -409658, -22364, -220719, -331939, -104315, -45376, -148151, -346036, -223439, -711723, -473039, 224228, 470068, 315947, -123291, -263984, 122462, 371721, 34266, -486852, -514741, -273331, -125629, 64261, 71178, 91991, -379056, -653094, -423148, -510572, -159655, 357600, 714041, 736242, 498396, 94801, -77754, 332332, 467773, 503406, 544499, 74550, 479754, 120982, -150325, 131946, 505698, 918769, 767429]
5898.9C92260A05429c08554g71750h73314f40303c88471a72028b35079G6339A21520
5885.8E6853a02504B8516a38601b66277a75260A28064A13096b0683B18867b513d98468
5871.4d99157c58474b29194F8074C6091B31547B27892G8007I2071A91857C07065G23789
5857F08212G74769F97347E78363I05638A352098A820227B806516D307487G781626A6523540
5843.9B1822744A3406046F900397D483531C248363B091457A306284G50684F67515H30615
5831.9D50697E35434F30593F54062G50829A000046H98067F05697E24732H25107A125208
5818.7A485068A784399C113270E258424A0468987A9745324B0158922A0933378E273833
5808B578802A946177A771185A375564I47517E49881A121565A838275A653508A229148
$$ y = [392260, 105429, -308554, -771750, -873314, -640303, -388471, -172028, -235079, 76339, 121520, 56853, -102504, 28516, -138601, -266277, -175260, 128064, 113096, -20683, 218867, -2513, -498468, -499157, -358474, -229194, 68074, 36091, 231547, 227892, 78007, 92071, 191857, 307065, 723789, 608212, 774769, 697347, 578363, 905638, 1352098, 1820227, 2806516, 4307487, 7781626, 16523540, 21822744, 13406046, 6900397, 4483531, 3248363, 2091457, 1306284, 750684, 667515, 830615, 450697, 535434, 630593, 654062, 750829, 1000046, 898067, 605697, 524732, 825107, 1125208, 1485068, 1784399, 3113270, 5258424, 10468987, 19745324, 20158922, 10933378, 5273833, 2578802, 1946177, 1771185, 1375564, 947517, 549881, 1121565, 1838275, 1653508, 1229148]
5796I37690F53427C36238B86823A071445A494866A366749A028876A370354B163931
5784C629898F596336A2661842B0890132A6184892H300827D045934B209394A490785
5773.3I88453E66654F29732B76268B52167B61955A75150C6332c29586a02298I9586
5760.1B3946F0879E59033D12500E82287B64248C49045B09097D12786C41817B41554
5746.9a1333B45563G67427D33295A04691b47249c64451a58187b44270c11326d18306
5733.8c65201d27152c50331c66833d03956e05654b35434c8642d00861g15928c37815
5720.6b68181b57627C094D61964C38438C65631C04142C93081B76312C36966a10818
5707.4C9589e3190G6378C69124A01098H6628F10527H49836D86570D96435H90984C28731
$$ y = [937690, 653427, 336238, 286823, 1071445, 1494866, 1366749, 1028876, 1370354, 2163931, 3629898, 6596336, 12661842, 20890132, 16184892, 8300827, 4045934, 2209394, 1490785, 988453, 566654, 629732, 276268, 252167, 261955, 175150, 36332, -329586, -102298, 99586, 23946, 60879, 559033, 412500, 582287, 264248, 349045, 209097, 412786, 341817, 241554, -11333, 245563, 767427, 433295, 104691, -247249, -364451, -158187, -244270, -311326, -418306, -365201, -427152, -350331, -366833, -403956, -505654, -235434, -38642, -400861, -715928, -337815, -268181, -257627, 3094, 461964, 338438, 365631, 304142, 393081, 276312, 336966, -110818, 39589, -53190, 76378, 369124, 101098, 86628, 610527, 849836, 486570, 496435, 890984, 328731]
5693.1e5322b98776a67399c99701d60926a47402f029h3774e03588f42803e62849b77861
5678.7a08438c53760b68447b76943A21027A153981A081037A82875a12991d14098f39463
5665.6g93819b88568c52847h25613i42361d41507C2061G3494b77880e77380c99851
5652.4b94947C8998D37680C21530c6061a1122b00996e90921c35232c26609c07966a32722
5638C05483D2172c81585a041612a042928e60701A21400G34341G74626C29588E7225
5624.9A2183b32342b52020b31477b63264a09862A90823A59188b1288f3683D9370B28875
5610.5E25880B26896A85672A34024A09404E77400A45156a33301b70444a55183b21586
5597.3E6241C8001h5056C93856H7700a20265A1688a80855a45736B15595C67058D35741
$$ y = [-55322, -298776, -167399, -399701, -460926, -147402, -6029, -83774, -503588, -642803, -562849, -277861, -108438, -353760, -268447, -276943, 121027, 1153981, 1081037, 182875, -112991, -414098, -639463, -793819, -288568, -352847, -825613, -942361, -441507, 32061, 73494, -277880, -577380, -399851, -294947, 38998, 437680, 321530, -36061, -11122, -200996, -590921, -335232, -326609, -307966, -132722, 305483, 42172, -381585, -1041612, -1042928, -560701, 121400, 734341, 774626, 329588, 57225, 12183, -232342, -252020, -231477, -263264, -109862, 190823, 159188, -21288, -63683, 49370, 228875, 525880, 226896, 185672, 134024, 109404, 577400, 145156, -133301, -270444, -155183, -221586, 56241, 38001, -85056, 393856, 87700, -120265, 11688, -180855, -145736, 215595, 367058, 435741]
5583D29829C22669C55055G8069A69270F8955C30407F8655b99793c82271B0946A03343
5568.6C6651B84328B62583A82121E57263E37005B26328d3231G8716C39724C88554B07160
5554.3c47535d7593c26306A05294G6098A00224A20742A06100A5567e83429d03045h5879
5539.9A77635F81013D78619D07063F65498E17244A73364A98160C88975a8330d65856
5526.7d36544c15844f00766c36745A99075A18948b06811A18411C63391C17699D66247
5513.6A42157b83166b07645d39760a6337b708A74533C23310A75928D23081b25129g10008
5499.2c76691B64744C18147A58249a26866b31451I0280D99461A17001c08155b18398
5486.1e60540g50819a094617f99506a82793e9809D4915A98846C75848B95681A5723
$$ y = [429829, 322669, 355055, 78069, 169270, 68955, 330407, 68655, -299793, -382271, 20946, 103343, 36651, 284328, 262583, 182121, 557263, 537005, 226328, -43231, 78716, 339724, 388554, 207160, -347535, -47593, -326306, 105294, 76098, 100224, 120742, 106100, 15567, -583429, -403045, -85879, 177635, 681013, 478619, 407063, 665498, 517244, 173364, 198160, 388975, -18330, -465856, -436544, -315844, -600766, -336745, 199075, 118948, -206811, 118411, 363391, 317699, 466247, 142157, -283166, -207645, -439760, -16337, -2708, 174533, 323310, 175928, 423081, -225129, -710008, -376691, 264744, 318147, 158249, -126866, -231451, 90280, 499461, 117001, -308155, -218398, -560540, -750819, -1094617, -699506, -182793, -59809, 44915, 198846, 375848, 295681, 15723]
5472.9B47522B04920c41711e77787f48984c77784F8699A83423f6532A94401I0064A52455
5458.5B8401D2755a83300d52269d82050e29231c47662d96456f92336d66184b2843A16290
5444.2A05232a52664b22245I4646F57633D47915A61029E00248C73814B74654a72019
5431d30470a53514d8141C26471B99089A7888a04772c48702c15449d20242b05490g8354
5416.6f43871f76827d56314c251A61864c60196a004509a029885h08695d09822b4174
5403.5B5702B10243A44701B17544b93568b42712a03763d60964c56588A1126i8372i6859
5389.1e4883i0173e11566c94284f0181a32439A45429c24478c22470b26843d89155f04379
5374.8c31138c65427e52393b32806b5934b15242e23028e84260a09382B50222B16236
$$ y = [247522, 204920, -341711, -577787, -648984, -377784, 68699, 183423, -66532, 194401, 90064, 152455, 28401, 42755, -183300, -452269, -482050, -529231, -347662, -496456, -692336, -466184, -22843, 116290, 105232, -152664, -222245, 94646, 657633, 447915, 161029, 500248, 373814, 274654, -172019, -430470, -153514, -48141, 326471, 299089, 17888, -104772, -348702, -315449, -420242, -205490, -78354, -643871, -676827, -456314, -3251, 161864, -360196, -1004509, -1029885, -808695, -409822, -24174, 25702, 210243, 144701, 217544, -293568, -242712, -103763, -460964, -356588, 11126, -98372, -96859, -54883, -90173, -511566, -394284, -60181, -132439, 145429, -324478, -322470, -226843, -489155, -604379, -331138, -365427, -552393, -232806, -25934, -215242, -523028, -584260, -109382, 250222, 216236]
5361.6d0603C53069A38699a21127A18751F58911G08015D57631b86830e94574d16643
5348.4c07936c35603h70821h45039f13047e11867a97756C06428A68364G3994a75143
5335.3b87992D185A71082C79079B37589c08015d86780A22630E77546G3591a11180a67018
5320.9i3703F4565B6104A71146f170g0510e8804B08001B92113c0253g4491D22513F73552
5305.4B91522B34182B91458h2306d45549c34089b26155e90422h40998i63023i28340
5292.2d95844A76314C8329a92892a77580d81554d23475C98613C16735a32431A10345
5279i9974C42510D19438c7972b40837A88687B17838D18639B72793F4462c49381f01682
5264.7e84360e45291f10083b55683a10447c52284a92545a69390c61900e92535d76279
$$ y = [-40603, 353069, 138699, -121127, 118751, 658911, 708015, 457631, -286830, -594574, -416643, -307936, -335603, -870821, -845039, -613047, -511867, -197756, 306428, 168364, 73994, -175143, -287992, 4185, 171082, 379079, 237589, -308015, -486780, 122630, 577546, 73591, -111180, -167018, -93703, 64565, 26104, 171146, -6170, -70510, -58804, 208001, 292113, -30253, -74491, 422513, 673552, 291522, 234182, 291458, -82306, -445549, -334089, -226155, -590422, -840998, -963023, -928340, -495844, 176314, 38329, -192892, -177580, -481554, -423475, 398613, 316735, -132431, 110345, -99974, 342510, 419438, -37972, -240837, 188687, 217838, 418639, 272793, 64462, -349381, -601682, -584360, -545291, -610083, -255683, -110447, -352284, -192545, -169390, -361900, -592535, -476279]
5251.5b03847b1598E0710g5758E8147a91489A86175C59043i0701c18220c17421a67675
5237.1e61854b05391b21421C1167A16571I2213G1208C47781D17677A74335G4553A65909
5222.8C82115E34167a50808d34016C6944b16875d28489d52972d19568g3727B89134
5209.6G0685a78565d13768f5157D47356E33454D51559C09582a93015b63680a12224
5196.5b758g977A09152B66383A61584B89235E09555C62506A44104A03076H9590D43404
5182.1F63555E59846H70835E32071D42478E43056B91168A88871B53689F02463B9187
5168.9F6871C33871C17463C94780E23014C17183I5182F8083B61714G8416F5403E25123
5154.6H23030D14173b25959d00830e44913h04315e82529c59411f48600d85713a66880
$$ y = [-203847, -21598, 50710, -75758, 58147, -191489, 186175, 359043, -90701, -318220, -317421, -167675, -561854, -205391, -221421, 31167, 116571, 92213, 71208, 347781, 417677, 174335, 74553, 165909, 382115, 534167, -150808, -434016, 36944, -216875, -428489, -452972, -419568, -73727, 289134, 70685, -178565, -413768, -65157, 447356, 533454, 451559, 309582, -193015, -263680, -112224, -2758, -7977, 109152, 266383, 161584, 289235, 509555, 362506, 144104, 103076, 89590, 443404, 663555, 559846, 870835, 532071, 442478, 543056, 291168, 188871, 253689, 602463, 29187, 66871, 333871, 317463, 394780, 523014, 317183, 95182, 68083, 261714, 78416, 65403, 525123, 823030, 414173, -225959, -400830, -544913, -804315, -582529, -359411, -648600, -485713, -166880]
5141.4a38973c97170b72074B66702D80396a45247c59954b98078b3044i1801A00695
5128.2I8075C53095C85D2019C94811C80900C04669F5978a54552C81646D76471a44830
5113.9d08903c61923C1138E3648C14629E32335C89215F80251E67781G2051h2707G2336
5099.5C80403D10115A15593A3164d68679f18930b68281g7398d31295f6251b93758a86943
5085.2B42832B66490C38054D92136C3938b38521A66105h5415A6033g9348G7381a14759
5070.8a85513e01814e80176f22775h19018i14247e80477g15717e42134b33619e2132
5057.6B01275D78380G56385C83722B28706F71682H85423D95222E29593A94716a46174
5044.5D1020A32891b35285d38231c84005d13563c56143B6780H108c54810f02064c57114
$$ y = [-138973, -397170, -272074, 266702, 480396, -145247, -359954, -298078, -23044, -91801, 100695, 98075, 353095, 385, 42019, 394811, 380900, 304669, 65978, -154552, 381646, 476471, -144830, -408903, -361923, 31138, 53648, 314629, 532335, 389215, 680251, 567781, 72051, -82707, 72336, 380403, 410115, 115593, 13164, -468679, -618930, -268281, -77398, -431295, -66251, -293758, -186943, 242832, 266490, 338054, 492136, 33938, -238521, 166105, -85415, 16033, -79348, 77381, -114759, -185513, -501814, -580176, -622775, -819018, -914247, -580477, -715717, -542134, -233619, -52132, 201275, 478380, 756385, 383722, 228706, 671682, 885423, 495222, 529593, 194716, -146174, 41020, 132891, -235285, -438231, -384005, -413563, -356143, 26780, 8108, -354810, -602064, -357114]
5030.1b96317C0594a12341b4454D69217D39009D89531C478c33350c31291b79376B95992
5015.8D94534C28024B8224c4539d1044B7357G7983a9454f9640d96358i37645i43454
5001.4a120394a031039f56813d29698h63710f49294b01585B0248d40766e70754i46118
4988.2i11736f34679c79284g03400e58111h4924b88247i73210f72548c04160A65371
4975.1G6655A03986F1739A12736b3640D5889a2612G4394B70867A17288a72447f7196
4960.7d3653c02099g90272d26787i1041b11876f35678e89064c46243d32354d19324
4947.5A1096B3861E04933H23115C58911a33403d46524g93953f84509d55204d99652
4934.4g7244D29974A07976d40435f81231f58388d47137e48783e79147e25D01927F35074
$$ y = [-296317, 30594, -112341, -24454, 469217, 439009, 489531, 3478, -333350, -331291, -279376, 295992, 494534, 328024, 28224, -34539, -41044, 27357, 77983, -19454, -69640, -496358, -937645, -943454, -1120394, -1031039, -656813, -429698, -863710, -649294, -201585, 20248, -440766, -570754, -946118, -911736, -634679, -379284, -703400, -558111, -84924, -288247, -973210, -672548, -304160, 165371, 76655, 103986, 61739, 112736, -23640, 45889, -12612, 74394, 270867, 117288, -172447, -67196, -43653, -302099, -790272, -426787, -91041, -211876, -635678, -589064, -346243, -432354, -419324, 11096, 23861, 504933, 823115, 358911, -133403, -446524, -793953, -684509, -455204, -499652, -77244, 429974, 107976, -440435, -681231, -658388, -447137, -548783, -579147, -525, 401927, 635074]
4920D32247h6904h07919b30416A822A36872a86419e19348f58759b54384a53417a78654
4905.7b43265b73043f88737i72073h1446E51848B88089C89142D82228e993a88878A63194
4891.3a34325i7347d0955a02528C44324F31175E59983a51128A0961F3040H9422E347
4876.9a92128a2373a79041e73461e10993a01234B08687A20649D27549C91676G8500
4863.8C65097H998d65083b56470H9763B50973F74018C74184C33308D95799B54088A3887
4849.4B8544b86844d72737d11181e79986f24296e04976d61497g65362f76278c09413
4836.3b61072i4510d75861e65334f02623f88285e17099f23367b43607b78328d13767
4823.1c83803c25568e64876e35111e47317b6629A36574B11014B96422A84331D39003
$$ y = [432247, -86904, -807919, -230416, 1822, 136872, -186419, -519348, -658759, -254384, -153417, -178654, -243265, -273043, -688737, -972073, -81446, 551848, 288089, 389142, 482228, -5993, -188878, 163194, -134325, -97347, -40955, -102528, 344324, 631175, 559983, -151128, 10961, 63040, 89422, 5347, -192128, -12373, -179041, -573461, -510993, -101234, 208687, 120649, 427549, 391676, 78500, 365097, 8998, -465083, -256470, 89763, 250973, 674018, 374184, 333308, 495799, 254088, 13887, 28544, -286844, -472737, -411181, -579986, -624296, -504976, -461497, -765362, -676278, -309413, -261072, -94510, -475861, -565334, -602623, -688285, -517099, -623367, -243607, -278328, -413767, -383803, -325568, -564876, -535111, -547317, -26629, 136574, 211014, 296422, 184331, 439003]
4809.9C59693A55301B7865D8711d54829g51326e24410b88416b3495a20970A99110d22926
4795.6a62028d95300d62616f22872a57347g5791c65332d7545b55417f35898i94613
4782.4a103940a029097e86686C23233G80228E42649E43234C84403B65279D02b29313
4769.2a57187E0836F09769A024858I42863B90432a22641c24831c77122i1713A52555
4756.1A72603A03911h4789a48837a21695e0938b24615a87376D2366a26820f7620A03348
4741.7A91593A16372A05516C89249C13083A26649b04888e83508a86367H2161e0888
4728.5d17166c52156e41680e50461c79575b51766a3i3516c2189H2947D95454D92107
4714.2D13711F68338I97982E97473F7945E09300F23717D18559C40975B82001c54516
$$ y = [359693, 155301, 27865, 48711, -454829, -751326, -524410, -288416, -23495, -120970, 199110, -422926, -162028, -495300, -462616, -622872, -157347, -75791, -365332, -47545, -255417, -635898, -994613, -1103940, -1029097, -586686, 323233, 780228, 542649, 543234, 384403, 265279, 402, -229313, -157187, 50836, 609769, 1024858, 942863, 290432, -122641, -324831, -377122, -91713, 152555, 172603, 103911, -84789, -148837, -121695, -50938, -224615, -187376, 42366, -126820, -67620, 103348, 191593, 116372, 105516, 389249, 313083, 126649, -204888, -583508, -186367, 82161, -50888, -417166, -352156, -541680, -550461, -379575, -251766, -13, -93516, -32189, 82947, 495454, 492107, 413711, 668338, 997982, 597473, 67945, 509300, 623717, 418559, 340975, 282001, -354516]
4701e99521i01547d22486b18118a22820G0446b62040b25176A15685g4417D8752C13208
4686.7B59492B48187B82127E89567D12579F7957f1508b95993e57481a95298a1965c00206
4672.3A67215C48463B26375d23161c93866a21462E2628A69155E4538b58845a00502
4659.1D4976a27606c3981b96576f30754f03273e65157c0912F55192A60339b61771e39822
4644.8d24610c71661f36182d14119b40848I3708A45373b55126h9291C73752F94327
4631.6C49012B7737c66292c52175a55088d49474e05374c39444c58097c59850d20248
4618.5f02957d21379D08447A97886D75903d8433a80916D4548B90326A85540a44205
4605.3d38757f81399A58896E34459B16673a77536d93647h7555A59945D79831B85078
$$ y = [-599521, -901547, -422486, -218118, -122820, 70446, -262040, -225176, 115685, -74417, 48752, 313208, 259492, 248187, 282127, 589567, 412579, 67957, -61508, -295993, -557481, -195298, -11965, -300206, 167215, 348463, 226375, -423161, -393866, -121462, 52628, 169155, 54538, -258845, -100502, 44976, -127606, -33981, -296576, -630754, -603273, -565157, -30912, 655192, 160339, -261771, -539822, -424610, -371661, -636182, -414119, -240848, 93708, 145373, -255126, -89291, 373752, 694327, 349012, 27737, -366292, -352175, -155088, -449474, -505374, -339444, -358097, -359850, -420248, -602957, -421379, 408447, 197886, 475903, -48433, -180916, 44548, 290326, 185540, -144205, -438757, -681399, 158896, 534459, 216673, -177536, -493647, -87555, 159945, 479831, 285078]
4592.1A39121a07696d1185C3979D18779E17383H2317B20078A31680f4423A43475A31871
4577.8b30984b0834I6097B81859B53521C89680B99657A71563a72186c40513d20509
4564.6b62416B64039D98748D33948i3205b9530F3091g70233a057912f49037d7616B38091
4550.2D15441C25958B0531B69032C22692E18705G40382D12123D897i3400D99718A39743
4535.9F4078B71670B95959A91785C64574A59473A63229B47038D2248i223b60988e36271
4521.5a40918a61871A45147C17608F58627B90218A42419B9940F18146I77640H73133
4508.4B60633b93238c34535a47954d25762g27437g54704e18746b14064c22717d77025
4495.2f43335f52279e14760c72117b59385c0349a71385A93151D90540A71391B62571
$$ y = [139121, -107696, -41185, 33979, 418779, 517383, 82317, 220078, 131680, -64423, 143475, 131871, -230984, -20834, 96097, 281859, 253521, 389680, 299657, 171563, -172186, -340513, -420509, -262416, 264039, 498748, 433948, -93205, -29530, 63091, -770233, -1057912, -649037, -47616, 238091, 415441, 325958, 20531, 269032, 322692, 518705, 740382, 412123, 4897, -93400, 499718, 139743, 64078, 271670, 295959, 191785, 364574, 159473, 163229, 247038, 42248, -9223, -260988, -536271, -140918, -161871, 145147, 317608, 658627, 290218, 142419, 29940, 618146, 977640, 873133, 260633, -293238, -334535, -147954, -425762, -727437, -754704, -518746, -214064, -322717, -477025, -643335, -652279, -514760, -372117, -259385, -30349, -171385, 193151, 490540, 171391, 262571]
4482C51642D58476B45202D7519E5399a05904B97563E15229F82575I25101G48228C51155
4467.7B3033B38145A68978B19047A7909E3682E28128I37184H12736D26960E39840D49996
4453.3G92197F39813H8928g3740a72784a07971c84859e10765e24893A81511E85140
4440.1B09557C32093C46563B89490C64906A16108b44684a84815e39998h78433d92246
4427c38674i5342D09425F24117F6232A11151a52388a79309g34274h29655d35982e06006
4412.6a49768D6842g4606e54396g22129c68320e25722a009283c82724A9127B3731B41572
4398.3D4571e44554b67405G8768C65960A87733e9869c31313B007A71766b24832e33378
4383.9d80180d54691b82212C163a65125B07008D94163H01712F24856H03504D33686
$$ y = [351642, 458476, 245202, 47519, 55399, -105904, 297563, 515229, 682575, 925101, 748228, 351155, 23033, 238145, 168978, 219047, 17909, 53682, 528128, 937184, 812736, 426960, 539840, 449996, 792197, 639813, 88928, -73740, -172784, -107971, -384859, -510765, -524893, 181511, 585140, 209557, 332093, 346563, 289490, 364906, 116108, -244684, -184815, -539998, -878433, -492246, -338674, -95342, 409425, 624117, 66232, 111151, -152388, -179309, -734274, -829655, -435982, -506006, -149768, 46842, -74606, -554396, -722129, -368320, -525722, -1009283, -382724, 19127, 23731, 241572, 44571, -544554, -267405, 78768, 365960, 187733, -59869, -331313, 2007, 171766, -224832, -533378, -480180, -454691, -282212, 3163, -165125, 207008, 494163, 801712, 624856, 803504, 433686]
4370.7D05057D79799A84181b23269h7673c08212a98187a14248a31017e75046i66920
4357.6i29265f87728f66115d64836a94365B31964C23437A69946b06956a42912A9663
4344.4f2918e7885b75026c32382c32171d44667c31881B7656h1749b1919I0967C41235
4330g5986d4639d16858f02790b80644c08002A652A41582I1207B56123A17876g4825
4315.7f0001c24110h33870i11002g32915a49120C03876A69900d44197g05448b72839
4302.5A82382A63490A79714C04025D2331A23370C8343d78186a35114a1646C03805F32661
4288.2E14186E02190F7360A49709C09629B20743a09049g8719c07452h0794A92049a04871
4273.8d51259f70505d04953C8465g2548b28561a30411B48180E82081F28535C22892
$$ y = [405057, 479799, 184181, -223269, -87673, -308212, -198187, -114248, -131017, -575046, -966920, -929265, -687728, -666115, -464836, -194365, 231964, 323437, 169946, -206956, -142912, 19663, -62918, -57885, -275026, -332382, -332171, -444667, -331881, 27656, -81749, -21919, 90967, 341235, -75986, -44639, -416858, -602790, -280644, -308002, 1652, 141582, 91207, 256123, 117876, -74825, -60001, -324110, -833870, -911002, -732915, -149120, 303876, 169900, -444197, -705448, -272839, 182382, 163490, 179714, 304025, 42331, 123370, 38343, -478186, -135114, -11646, 303805, 632661, 514186, 502190, 67360, 149709, 309629, 220743, -109049, -78719, -307452, -80794, 192049, -104871, -451259, -670505, -404953, 38465, -72548, -228561, -130411, 248180, 582081, 628535, 322892]
4260.6a32479C0885A55221A94054c44747f27114b30312C49632B90392F1579e228A15143
4246.3C92868A38038A94616d89739d13436F8376A92212B1656b40717c08744b28456
4233.1a80698c5680D3524B51050a09418d21151c37820d43064b13868f6496a27242c41683
4218.8A2814C947b32602b71524e85614a71173H3367a6330a3472a30014c65013a15204
4204.4A64318B53696C00843B19236B32803E08661E21747F05031b2082c85873d21274
4191.2c18852b12071e66830c33082H3997d1945c81730c20311H6713a93677c36128c35061
4176.9a14959a45766c27164b36547A63544B09797C64081a87069h8828c46618A9789
4163.7F0130a96120b26408A96143e805I822A37202c415b31752c43488d18344c10053
$$ y = [-132479, 30885, 155221, 194054, -344747, -627114, -230312, 349632, 290392, 61579, -5228, 115143, 392868, 138038, 194616, -489739, -413436, 68376, 192212, 21656, -240717, -308744, -228456, -180698, -35680, 43524, 251050, -109418, -421151, -337820, -443064, -213868, -66496, -127242, -341683, 12814, 3947, -232602, -271524, -585614, -171173, 83367, -16330, -13472, -130014, -365013, -115204, 164318, 253696, 300843, 219236, 232803, 508661, 521747, 605031, -22082, -385873, -421274, -318852, -212071, -566830, -333082, 83997, -41945, -381730, -320311, 86713, -193677, -336128, -335061, -114959, -145766, -327164, -236547, 163544, 209797, 364081, -187069, -88828, -346618, 19789, 60130, -196120, -226408, 196143, -5805, 9822, 137202, -3415, -231752, -343488, -418344, -310053]
4149.3f24528d81323i72046i72481d78931A9513d06337e23117B930A78186B74741D75070
4135a1125B34846G97000I66353C77260b88747d89067a79060A28148A09700d383B50752
4120.6A17020D29379a95682e51952d86936c00964a83778c92898a92060h3547a54984
4107.5a7738e5342B52350A34532A76466A35732C6084f2738c29767e25744b53763f44347
4093.1a173037a124640g12359e37842e35218f32948B18999F94072C32473a6116i8784
4079.9e79136h28405a001383f87744A23078F99704F15707D89737A51710a35371c79236
4066.8h75646g37553a108889h33927d06342d94429f37681h3035a97979b73989I997
4053.6f5550E050f3561a48702a23574B26792C78700E79321D56436D94159C16169A59805
$$ y = [-624528, -481323, -972046, -972481, -478931, 19513, -406337, -523117, 2930, 178186, 274741, 475070, -11125, 234846, 797000, 966353, 377260, -288747, -489067, -179060, 128148, 109700, -4383, 250752, 117020, 429379, -195682, -551952, -486936, -300964, -183778, -392898, -192060, -83547, -154984, -17738, -55342, 252350, 134532, 176466, 135732, 36084, -62738, -329767, -525744, -253763, -644347, -1173037, -1124640, -712359, -537842, -535218, -632948, 218999, 694072, 332473, -16116, -98784, -579136, -828405, -1001383, -687744, 123078, 699704, 615707, 489737, 151710, -135371, -379236, -875646, -737553, -1108889, -833927, -406342, -494429, -637681, -83035, -197979, -273989, 9997, -65550, 5050, -63561, -148702, -123574, 226792, 378700, 579321, 456436, 494159, 316169, 159805]
4039.3A75845D83247E22168B98018F09724D73500A41101B823B46892B45830C12521
4026.1E5434E07981E96580F91805F70106B72431C29434B57884a16050h057E51377E82770
4011.7H64687E50866d0580B63750D32422A90740e5712A41663A06520c07953c36501
3998.6a42549b61665b68448a32511g2587a65714c26879c29260f31482f06146i00802
3985.4a050981a098391i31446h68541g29321a99258A13228E8622B07487B30310B71138
3972.2E072A10688C81483A69638f25b2214b81393d52218c66566c60641f3865a47427
3957.9A52548H5911B54419D75557B95247c1627h2032b65671e20733B67032G07726D40888
3943.5B14630C71384H58244F20531A86691A25905D4723D47881C18439E81581C22036
$$ y = [175845, 483247, 522168, 298018, 609724, 473500, 141101, 2823, 246892, 245830, 312521, 55434, 507981, 596580, 691805, 670106, 272431, 329434, 257884, -116050, -8057, 551377, 582770, 864687, 550866, -40580, 263750, 432422, 190740, -55712, 141663, 106520, -307953, -336501, -142549, -261665, -268448, -132511, -72587, -165714, -326879, -329260, -631482, -606146, -900802, -1050981, -1098391, -931446, -868541, -729321, -199258, 113228, 58622, 207487, 230310, 271138, 5072, 110688, 381483, 169638, -625, -22214, -281393, -452218, -366566, -360641, -63865, -147427, 152548, 85911, 254419, 475557, 295247, -31627, -82032, -265671, -520733, 267032, 707726, 440888, 214630, 371384, 858244, 620531, 186691, 125905, 44723, 447881, 318439, 581581, 322036]
3930.4a53830a52480e15236e66193a48386C37720H39779I67058I42088A000189E04906
3917.2A42526a71834B67653B5674e4414h4532C6979A49324A98234D7478e8921g8260
3902.8d82843g81753g35640c72477B60114D36932I7121f5400D43317A0829d56571b14386
3888.5A36735E33773F62625B23965b65539g72202h56961c66326b48763a44648C4478
3875.3B34459D85871C09412G8237d8355A99733A14083A07166b43274b78335d33242
3862.1g62701d98556b61640a52733a71256B35972A31603d81934e97996c51128H964
3849H0322b47380b98611c65916c26344e76417d53633e10478f28333h72659i66734h77703
3834.6e52152d42676b71504I7150B59752F273I5777d90585h48916g59708d55883c10654
$$ y = [-153830, -152480, -515236, -566193, -148386, 337720, 839779, 967058, 942088, 1000189, 504906, 142526, -171834, 267653, 25674, -54414, -84532, 36979, 149324, 198234, 47478, -58921, -78260, -482843, -781753, -735640, -372477, 260114, 436932, 97121, -65400, 443317, 10829, -456571, -214386, 136735, 533773, 662625, 223965, -265539, -772202, -856961, -366326, -248763, -144648, 34478, 234459, 485871, 309412, 78237, -48355, 199733, 114083, 107166, -243274, -278335, -433242, -762701, -498556, -261640, -152733, -171256, 235972, 131603, -481934, -597996, -351128, 8964, 80322, -247380, -298611, -365916, -326344, -576417, -453633, -510478, -628333, -872659, -966734, -877703, -552152, -442676, -271504, 97150, 259752, 6273, 95777, -490585, -848916, -759708, -455883, -310654]
3820.3c39945a33444I8797d78196e56296b67189f2654c41053i07131g14062e18480
3807.1d28665e88116i44412e31144d43233g75147d20538C09954G38747B57299h3901
3793.9A27772A07719A03153D34865D60605A02637b8816c39272h05151f67979b45550
3780.8b96651d83939f14467e96392c61687b31951d14599a8943A85261B05502b24554
3767.6f59825f42022a65552B49066E33804A56167E81717G67212G47877G48659F21793
3754.4A56893c3422a18289d4732c93999d07285A31695h2088H131b42912d87801e04618
3740.1b64904a65061e45278g11045d20401d87295d28172a25814a88477h3615g9712
3726.9d9745h6155b3316d55917d77403c05762A28336h7524d03042c89035a01495B87170
$$ y = [-339945, -133444, 98797, -478196, -556296, -267189, -62654, -341053, -907131, -714062, -518480, -428665, -588116, -944412, -531144, -443233, -775147, -420538, 309954, 738747, 257299, -83901, 127772, 107719, 103153, 434865, 460605, 102637, -28816, -339272, -805151, -667979, -245550, -296651, -483939, -614467, -596392, -361687, -231951, -414599, -18943, 185261, 205502, -224554, -659825, -642022, -165552, 249066, 533804, 156167, 581717, 767212, 747877, 748659, 621793, 156893, -33422, -118289, -44732, -393999, -407285, 131695, -82088, 8131, -242912, -487801, -504618, -264904, -165061, -545278, -711045, -420401, -487295, -428172, -125814, -188477, -83615, -79712, -49745, -86155, -23316, -455917, -477403, -305762, 128336, -87524, -403042, -389035, -101495, 287170]
3712.6E59247G15114F61402E49136B13295A64637b10475A01678E21100C22027c21584
3699.4e14295d65713b88380b64891e92635e16877d40001c96215B84481D45622I9032
3686.2c97680c6376D01164C75983a92049b5815C20011a81750c82939B42951A0772a74460
3671.9B7707A46462C51942E62116B59496B75107C09250B08753A37315D14770D09930
3658.7C49373C18428A01355b53182b46410a48642a30092a51419E65878H05908F54857
3645.5F18306d8807a13291A00096C86612E44762B08785a37003d74082b17814a11510
3632.4G363b76771e25450h47989f69121b52263b61664c7097E03721D75455D15702A06638
3618a92514b08679c0883B0849g8650i1310b16660h8413A81917D83473B58270a06140
$$ y = [559247, 715114, 661402, 549136, 213295, 164637, -210475, 101678, 521100, 322027, -321584, -514295, -465713, -288380, -264891, -592635, -516877, -440001, -396215, 284481, 445622, 99032, -397680, -36376, 401164, 375983, -192049, -25815, 320011, -181750, -382939, 242951, 10772, -174460, 27707, 146462, 351942, 562116, 259496, 275107, 309250, 208753, 137315, 414770, 409930, 349373, 318428, 101355, -253182, -246410, -148642, -130092, -151419, 565878, 805908, 654857, 618306, -48807, -113291, 100096, 386612, 544762, 208785, -137003, -474082, -217814, -111510, 7363, -276771, -525450, -847989, -669121, -252263, -261664, -37097, 503721, 475455, 415702, 106638, -192514, -208679, -30883, 20849, -78650, -91310, -216660, -88413, 181917, 483473, 258270, -106140]
3603.7i3551a87880a90242h01971d72274a55414A28606C20568A34315A89995D88268
3590.5F34431E95689b11626a42173E9145a98209a19599C32839A22657C2848a01369
3577.3I5921C80741D72586A07608a05845a01239a35421c9271D18814B89220C57869
3564.2C98991D67659D14890E976f13302e26699b20710C20992A41244G2265b78521a6746
3549.8a68370G7094D17789h888b96872b60719c98786d93828b09005b38101H552c61668
3535.4a95795A78616B12494A67087a21689H8531B05920c72707E6502D91853G6028b08705
3521.1c58417D9379b23513e60471a002528a277683a092346f28076c41221F3128B07465
3507.9H097a14578C14371B17282A78434B32721A89706a29657b13681F8211B346f63310
$$ y = [-93551, -187880, -190242, -801971, -472274, -155414, 128606, 320568, 134315, 189995, 488268, 634431, 595689, -211626, -142173, 59145, -198209, -119599, 332839, 122657, 32848, -101369, 95921, 380741, 472586, 107608, -105845, -101239, -135421, -39271, 418814, 289220, 357869, 398991, 467659, 414890, 5976, -613302, -526699, -220710, 320992, 141244, 72265, -278521, -16746, -168370, 77094, 417789, -8888, -296872, -260719, -398786, -493828, -209005, -238101, 8552, -361668, -195795, 178616, 212494, 167087, -121689, 88531, 205920, -372707, 56502, 491853, 76028, -208705, -358417, 49379, -223513, -560471, -1002528, -1277683, -1092346, -628076, -341221, 63128, 207465, 8097, -114578, 314371, 217282, 178434, 232721, 189706, -129657, -213681, 68211, 2346, -663310]
3493.6e84788c83354C89779A154776I75903D39548B82802G3449a13501b47070a53204
3480.4b1888d0443h4553a32563C8430a65745A60786A79043A05854d840D7928E31939
3466C97520F7329a83890c23751b76257b17375c00691b53434f11087f19039h9733g0418
3451.7e4446b09074c62887b24152e8681a09307d87454b46007G3533B35063B07109A08026
3437.3D44362D46525C60143B03894A9465b12279b53500a80450e07837f74418h94536
3424.2a281852a117312f62775d07985a77730d09401a81760d2693A22418C35040B63206
3411H2168C3084c1531G2912B69092F47688D39511B38718A84183A44019b2732d01298
3396.6g85625g47935h30415f84470a53621C07326a30963e34076c37922F03524E62626
$$ y = [-584788, -383354, 389779, 1154776, 975903, 439548, 282802, 73449, -113501, -247070, -153204, -21888, -40443, -84553, -132563, 38430, -165745, 160786, 179043, 105854, -4840, 47928, 531939, 397520, 67329, -183890, -323751, -276257, -217375, -300691, -253434, -611087, -619039, -89733, -70418, -54446, -209074, -362887, -224152, -58681, -109307, -487454, -246007, 73533, 235063, 207109, 108026, 444362, 446525, 360143, 203894, 19465, -212279, -253500, -180450, -507837, -674418, -894536, -1281852, -1117312, -662775, -407985, -177730, -409401, -181760, -42693, 122418, 335040, 263206, 82168, 33084, -31531, 72912, 269092, 647688, 439511, 238718, 184183, 144019, -22732, -401298, -785625, -747935, -830415, -684470, -153621, 307326, -130963, -534076, -337922, 603524, 562626]
3383.5E2924c70042A78218B22831A19024B18815a64767c19708c22792B3121A90660
3370.3C21749F76724G27911A02489b02632B28508F4636B00970H4412c17227b92612
3357.1a26314b67254i301C50487C12240C42321B0306E2017E25188C43304a56568b97151
3342.8a74410D33269G03094F93243E25951B61861B03851a00019H7876E89859H63808
3329.6A112848H06607F75847B98823B65813B86240a24602C3027A30804A60040e08290
3316.4f20768b35801c19009c68950b16808a78353d86351a49289b87237d80830a84813
3303.3i3462A25296C82800f4338B71560F21411E94498D18559A93271C53921B95327
3290.1a76580a74773B50989D25627D18188C82750C66543B52002D14624B54920g4i7998
$$ y = [52924, -370042, 178218, 222831, 119024, 218815, -164767, -319708, -322792, 23121, 190660, 321749, 676724, 727911, 102489, -202632, 228508, 64636, 200970, 84412, -317227, -292612, -126314, -267254, -9301, 350487, 312240, 342321, 20306, 52017, 525188, 343304, -156568, -297151, -174410, 433269, 703094, 693243, 525951, 261861, 203851, -100019, 87876, 589859, 863808, 1112848, 806607, 675847, 298823, 265813, 286240, -124602, 33027, 130804, 160040, -508290, -620768, -235801, -319009, -368950, -216808, -178353, -486351, -149289, -287237, -480830, -184813, -93462, 125296, 382800, -64338, 271560, 621411, 594498, 418559, 193271, 353921, 295327, -176580, -174773, 250989, 425627, 418188, 382750, 366543, 252002, 414624, 254920, -74, -97998]
3275.8b24227C4839b23257f35504i91529f47007b76847E255B0623b22790A64558D98041
3261.4a23784b59258A58139E05484F78642c22499g35502e95507e50877e48532e94314
3248.2g41733e36004c32719d28424d88276d38384b61046A06199D69071F49006D08508
3235.1A83232i4866d45291e60126h65647d05419B18765A62372i9862A73962A26562
3221.9B73123B05675g0654G0928F1541C93497G19035D10349A69228d8776i9199C13163
3207.5G10486B06370B4449C16491a1103A47819B37094B14708e10a44560d13642f20563
3193.2h01804c16268D66120B58525B85347C03633f2271b26564c2621b2155b03377c24243
3178.8C0192A87523B24498B40222F33190E97134B31524b24260c66161a00848C64i539
$$ y = [-224227, 34839, -223257, -635504, -991529, -647007, -276847, 5255, 20623, -222790, 164558, 498041, -123784, -259258, 158139, 505484, 678642, -322499, -735502, -595507, -550877, -548532, -594314, -741733, -536004, -332719, -428424, -488276, -438384, -261046, 106199, 469071, 649006, 408508, 183232, -94866, -445291, -560126, -865647, -405419, 218765, 162372, -99862, 173962, 126562, 273123, 205675, -70654, 70928, 61541, 393497, 719035, 410349, 169228, -48776, -99199, 313163, 710486, 206370, 24449, 316491, -11103, 147819, 237094, 214708, -510, -144560, -413642, -620563, -801804, -316268, 466120, 258525, 285347, 303633, -62271, -226564, -32621, -22155, -203377, -324243, 30192, 187523, 224498, 240222, 633190, 597134, 231524, -224260, -366161, -100848, 364, -9539]
3164.5b35619h47505a102202a150651a266448i25316g02655c89917b46188B94307A41174
3151.3h3176A59640B93284F9765d9703i8836h7113A26942C25321B22551A35346f3560
3136.9b8771a77925A36969A40593D00351A29203g3684b21181b8679C87412G57706A490431
3122.6A060535A096228A971866A669564A421737A518500A347618A728639B502137C063451
3110.6C627343E351766H746794A6515788C8356408A12863864A40423744E2393788B2437180
3099.8A1575939F926075E017044C813218B982283B546810B016261A355819I52121H18542
3087.9A468279A829652I21723A208892A876470B326519H73372A30732A03399B31199
3075.9D38452C9373A60900I85843A104837D23991B01326F41475F53804G26321A036821
$$ y = [-235619, -847505, -1102202, -1150651, -1266448, -925316, -702655, -389917, -246188, 294307, 141174, -83176, 159640, 293284, 69765, -49703, -98836, -87113, 126942, 325321, 222551, 135346, -63560, -28771, -177925, 136969, 140593, 400351, 129203, -73684, -221181, -28679, 387412, 757706, 1490431, 1060535, 1096228, 1971866, 1669564, 1421737, 1518500, 1347618, 1728639, 2502137, 3063451, 3627343, 5351766, 8746794, 16515788, 38356408, 112863864, 140423744, 52393788, 22437180, 11575939, 6926075, 5017044, 3813218, 2982283, 2546810, 2016261, 1355819, 952121, 818542, 1468279, 1829652, 921723, 1208892, 1876470, 2326519, 873372, 130732, 103399, 231199, 438452, 39373, 160900, 985843, 1104837, 423991, 201326, 641475, 653804, 726321, 1036821]
3062.7H39028D08146A97761A87569C17657D97986G13462F97281C24145h4467e874D36439
3048.4B61209A37877B21902a3765g62185c04952G4135G9009D04982E05177C12526D74874
3034G50244F75344B71190f7701g83536g71119c38144c18194b67219B83292C17566c340
3019.7B12720C07068E55047B12233c7984h5104i66C82243B42595H6068a40226B33595
3005.3D17626B8627H7649e9540a96642b62386A8670b56458d59375b43776g7027I9391
2990.9D5413C7599A40860e8126d19303e47145b61977A24550c44445f44024c82876c01387
2976.6c20878b32994a49202A33266b5405e68659g24338h97035f88889a67727B1294
2963.4g3267b35400e43339d98530A26241C6474b56286A74655B04519B38885B01929
$$ y = [839028, 408146, 197761, 187569, 317657, 497986, 713462, 697281, 324145, -84467, -5874, 436439, 261209, 137877, 221902, -13765, -762185, -304952, 74135, 79009, 404982, 505177, 312526, 474874, 750244, 675344, 271190, -67701, -783536, -771119, -338144, -318194, -267219, 283292, 317566, -3340, 212720, 307068, 555047, 212233, -37984, -85104, -966, 382243, 242595, 86068, -140226, 233595, 417626, 28627, 87649, -59540, -196642, -262386, 18670, -256458, -459375, -243776, -77027, 99391, 45413, 37599, 140860, -58126, -419303, -547145, -261977, 124550, -344445, -644024, -382876, -301387, -320878, -232994, -149202, 133266, -25405, -568659, -724338, -897035, -688889, -167727, 21294, -73267, -235400, -543339, -498530, 126241, 36474, -256286, 174655, 204519, 238885, 201929]
2950.3a0512B27459D31763B52184C8837a05863b59117a29594I3202C07187a31209e12193
2935.9e06267c19368f0211A46286A14269c51361f54162d60943d68193d07950C76491
2922.7C84378C08808A23945a25380A08461F8735b14772f6704b38056A9049E08054B55428
2908.4I6372B59566D88294a79690f17558d08204c91041C95863G178B04645D33911C33412
2894c83908d22094a29604C68683B52620A20776C50182i7053d56595a38989B81675C66875
2879.7E5321F3048A2956C83796B61111C15809C32683a125d97149f28071f38766g25257
2865.3b94225b82738e36530c48520h1338c17653d15509c67935d43622c68406c88140
2852.1a35248B74156A90990B68212B63590A6712a48612f9785D0446b53896d71216e29473
$$ y = [-10512, 227459, 431763, 252184, 38837, -105863, -259117, -129594, 93202, 307187, -131209, -512193, -506267, -319368, -60211, 146286, 114269, -351361, -654162, -460943, -468193, -407950, 376491, 384378, 308808, 123945, -125380, 108461, 68735, -214772, -66704, -238056, 19049, 508054, 255428, 96372, 259566, 488294, -179690, -617558, -408204, -391041, 395863, 7178, 204645, 433911, 333412, -383908, -422094, -129604, 368683, 252620, 120776, 350182, -97053, -456595, -138989, 281675, 366875, 55321, 63048, 12956, 383796, 261111, 315809, 332683, -1125, -497149, -628071, -638766, -725257, -294225, -282738, -536530, -348520, -81338, -317653, -415509, -367935, -443622, -368406, -388140, -135248, 274156, 190990, 268212, 263590, 16712, -148612, -69785, 40446, -253896, -471216, -529473]
2837.8f47771i5561D84995C64743E5517F9452d7358a9648B6728A94104C83562E24081
2823.4G11224G18577D41568B28709E7573d69807c25112d84701f68816e02877c47578
2810.2c26757d3799F4098C8556B71499D03735D2256b91398c67767d20877e8653b19005
2795.9d93267a60875b30598c18449c18437b46545e07093b70263G7867I575A75687C55248
2781.5A93185I9389c8894f8775H9035D30489D07383C65928A95233c33716b70976H1682
2767.2D10810a18979C7733c59139c70408A45720A17228c2581b16513b22650b77723
2754f06390b82227A89775B88796e1113b68035b04071b96078c33677d1080d63496e90766
2739.6A3260B80516C7392A99298D45121a37245a75844A0015b35236c28612d34040a5018
$$ y = [-647771, -95561, 484995, 364743, 55517, 69452, -47358, -19648, 26728, 194104, 383562, 524081, 711224, 718577, 441568, 228709, 57573, -469807, -325112, -484701, -668816, -502877, -347578, -326757, -43799, 64098, 38556, 271499, 403735, 42256, -291398, -367767, -420877, -58653, -219005, -493267, -160875, -230598, -318449, -318437, -246545, -507093, -270263, 77867, 9575, 175687, 355248, 193185, 99389, -38894, -68775, 89035, 430489, 407383, 365928, 195233, -333716, -270976, 81682, 410810, -118979, 37733, -359139, -370408, 145720, 117228, -32581, -216513, -222650, -277723, -606390, -282227, 189775, 288796, -51113, -268035, -204071, -296078, -333677, -41080, -463496, -590766, 13260, 280516, 37392, 199298, 445121, -137245, -175844, 10015, -235236, -328612, -434040, -15018]
2725.3A10393i2764B6796b62838c70523d01442h0800A27149B78206D0183i0733I2635
2710.9B81961G55174H41790D05464I9407E5571i6164b61184a66671A77132C71648E0965
2696.6a64597a57695C7149F68379D69811A00367e8578b39970a43295i1475a03562b87733
2682.2a09377a1913E6218C58052d58131e79789b63745c01982e36757f02935b63351
2669c08624d90617g19232c10850a23631d57462e33881b57124A06001a58638a67091
2655.9B50457B11662a70123B2550D64464D30558a66596c08635f93282g70112e74326
2642.7i7995A24297B70571A20558B93851E82049B08282c49704e35514b88111F6252
2629.5B02835D01879F23771F29035H1487e00230C31259A04232b65008B0600A41828
$$ y = [110393, -92764, 26796, -262838, -370523, -401442, -80800, 127149, 278206, 40183, -90733, 92635, 281961, 755174, 841790, 405464, 99407, 55571, -96164, -261184, -166671, 177132, 371648, 50965, -164597, -157695, 37149, 668379, 469811, 100367, -58578, -239970, -143295, -91475, -103562, -287733, -109377, -11913, 56218, 358052, -458131, -579789, -263745, -301982, -536757, -602935, -263351, -308624, -490617, -719232, -310850, -123631, -457462, -533881, -257124, 106001, -158638, -167091, 250457, 211662, -170123, 22550, 464464, 430558, -166596, -308635, -693282, -770112, -574326, -97995, 124297, 270571, 120558, 293851, 582049, 208282, -349704, -535514, -288111, 66252, 202835, 401879, 623771, 629035, 81487, -500230, 331259, 104232, -265008, 20600, 141828]
2616.4B90091A47529C3584b71885d56830d13593e72810b87870D33213C33822B72449
2603.2A01061a76555e2840A55204B09518B49468B11571B18907E54955D41696A19244
2590.1a1418c28791a04317B7352h6569a70345a11368A93662C96524F7686a82808b13889
2575.7b07888a73860C24436A59787A23574e6548B79831E02752E55313C31453B04070
2562.5a33155f73521e78192e45137f79542g18458i83321e18442c52226c78397e66281
2549.4a97517E6872d9206a58176d33526g485H3067C6041a62713A8875G8447B11797
2535G9881a66281b25501D49163D66393D01108B53005A1760A69718A2831b38038c78327
2520.6b54725a62743a21988c2518E0518B62344C27623c99304g66500h18449b79788
$$ y = [290091, 147529, 33584, -271885, -456830, -413593, -572810, -287870, 433213, 333822, 272449, 101061, -176555, -52840, 155204, 209518, 249468, 211571, 218907, 554955, 441696, 119244, -11418, -328791, -104317, 27352, -86569, -170345, -111368, 193662, 396524, 67686, -182808, -213889, -207888, -173860, 324436, 159787, 123574, -56548, 279831, 502752, 555313, 331453, 204070, -133155, -673521, -578192, -545137, -679542, -718458, -983321, -518442, -352226, -378397, -566281, -197517, 56872, -49206, -158176, -433526, -7485, 83067, 36041, -162713, 18875, 78447, 211797, 79881, -166281, -225501, 449163, 466393, 401108, 253005, 11760, 169718, 12831, -238038, -378327, -254725, -162743, -121988, -32518, 50518, 262344, 327623, -399304, -766500, -818449, -279788]
2507.5b8852A2684a46162a82039H979a12342C40219E02365D38178D7589b12389b95678
2493.1e2778a73424A07222B45258D53226d8531c37110B09850G9451d97318f36372i1154
2478.8i3028a26442b48351a55561a31948d97953h26768a87815a76368b3745a36600
2465.6a47511A89256B22716B28110E19304G55060C86735D95282D82889B47561h0225
2452.4G8776B71332D79275B45062b62655g33625g69747b15101c02152e57197d87993
2439.3e11822a38602E1221D22061A52078b16749a88058g0444C3218A83149E64733D80101
2424.9a76677b70377A89419F5241B1610a04619c4058C02612B44035F1625b0706C78843
2410.6D91679D07468c17535g00399d90593a10800a21701b3545G6740E4261a87178C67249
$$ y = [-28852, 12684, -146162, -182039, 8979, -112342, 340219, 502365, 438178, 47589, -212389, -295678, -52778, -173424, 107222, 245258, 453226, -48531, -337110, 209850, 79451, -497318, -636372, -91154, -93028, -126442, -248351, -155561, -131948, -497953, -826768, -187815, -176368, -23745, -136600, -147511, 189256, 222716, 228110, 519304, 755060, 386735, 495282, 482889, 247561, -80225, 78776, 271332, 479275, 245062, -262655, -733625, -769747, -215101, -302152, -557197, -487993, -511822, -138602, 51221, 422061, 152078, -216749, -188058, -70444, 33218, 183149, 564733, 480101, -176677, -270377, 189419, 65241, 21610, -104619, -34058, 302612, 244035, 61625, -20706, 378843, 491679, 407468, -317535, -700399, -490593, -110800, -121701, -23545, 76740, 54261, -187178, 367249]
2396.2F12025C96254E02958H11800H89607F31184D65545C29360a15645b54032b25682
2383B75156B11074C19056A44744b6585C35186D18509I75917A144106G60692A30604
2369.9A51130A38467d2329c62622a13095f2399C3283D47264D56818E38778C60492A01999
2355.5D25976D98226C47416A20162G8073G06469A522120A905287A922677B184232B553972
2342.3A687204A715303B089736B313270B893676C717906D983674F783846A0133419
2331.6A7610252C6732288I4120928A94208576I5380768C9020564B0114728A2927000
2322I022836G151473F922295G210731H294422A1034457A7731036C3635588H3731560
2311.2A88765584A01138896D0340856B0589476A2682959H093348E535005C925298C440335
$$ y = [612025, 396254, 502958, 811800, 889607, 631184, 465545, 329360, -115645, -254032, -225682, 275156, 211074, 319056, 144744, -26585, 335186, 418509, 975917, 1144106, 760692, 130604, 151130, 138467, -42329, -362622, -113095, -62399, 33283, 447264, 456818, 538778, 360492, 101999, 425976, 498226, 347416, 120162, 78073, 706469, 1522120, 1905287, 1922677, 2184232, 2553972, 1687204, 1715303, 2089736, 2313270, 2893676, 3717906, 4983674, 6783846, 10133419, 17610252, 36732288, 94120928, 194208576, 95380768, 39020564, 20114728, 12927000, 9022836, 7151473, 6922295, 7210731, 8294422, 11034457, 17731036, 33635588, 83731560, 188765584, 101138896, 40340856, 20589476, 12682959, 8093348, 5535005, 3925298, 3440335]
2300.5C353942B776175B346923B194136B290411B411897A663684A432449B137019A711686
2288.5A570419A444400A382651A122679I32749I74077A317351A051502E52555C0293
2276.5F65877A071687I39274A139443A241000A470238I95034G65314G02467A080302
2264.6A272044A362859A580947A086704C58994C84917C79459B49663A20248c06321
2252.6e73158h50985e14166c1632f3740a15930H8512E54650E53236A81248B47516C24974
2238.2B42484F46462A165170I15625F30671B47533a47958C88178D26829A15055A39958
2225.1E16092D92792I3745a30983B16683E88486F17469b10341b31414a42522B58547
2211.9C11257B4820a40292A50175E99510D23481G0846D9484A9468A6344H0082i7638
$$ y = [3353942, 2776175, 2346923, 2194136, 2290411, 2411897, 1663684, 1432449, 2137019, 1711686, 1570419, 1444400, 1382651, 1122679, 932749, 974077, 1317351, 1051502, 552555, 30293, 665877, 1071687, 939274, 1139443, 1241000, 1470238, 995034, 765314, 702467, 1080302, 1272044, 1362859, 1580947, 1086704, 358994, 384917, 379459, 249663, 120248, -306321, -573158, -850985, -514166, -31632, -63740, -115930, 88512, 554650, 553236, 181248, 247516, 324974, 242484, 646462, 1165170, 915625, 630671, 247533, -147958, 388178, 426829, 115055, 139958, 516092, 492792, 93745, -130983, 216683, 588486, 617469, -210341, -231414, -142522, 258547, 311257, 24820, -140292, 150175, 599510, 423481, 70846, 49484, 19468, 16344, 80082, -97638]
2197.5a5028a29331e05416e58680c40504a47868b27116b49512c4187E1050b46261a21164
2183.2C54368A89228A0454d1231B11517H36699F26023e5617A02823G3076A67430B21882
2168.8H4065c50174a34749a71213b73654A55974F60203F11664D12260E97252A94347
2155.7h8766A1363A19926C67574C39229c1047a0632b86877b60279A07708D07961C89743
2141.3C48785b9880A45062C27650A86429A0254A80401D82988H00975I66296A294470
2128.1A364223A805676B838204B867317B073586A924374B134292B672533C519816C861482
2116.2E037638G989518A3629310B7125994F7796400A71895424A23581016D6706772
2106.6B0743840A1320478F856602D417670C948746C304353B221699A763093A247202
$$ y = [-15028, -129331, -505416, -558680, -340504, -147868, -227116, -249512, -34187, 51050, -246261, -121164, 354368, 189228, 10454, -41231, 211517, 836699, 626023, -55617, 102823, 73076, 167430, 221882, 84065, -350174, -134749, -171213, -273654, 155974, 660203, 611664, 412260, 597252, 194347, -88766, 11363, 119926, 367574, 339229, -31047, -10632, -286877, -260279, 107708, 407961, 389743, 348785, -29880, 145062, 327650, 186429, 10254, 180401, 482988, 800975, 966296, 1294470, 1364223, 1805676, 2838204, 2867317, 2073586, 1924374, 2134292, 2672533, 3519816, 3861482, 5037638, 7989518, 13629310, 27125994, 67796400, 171895424, 123581016, 46706772, 20743840, 11320478, 6856602, 4417670, 3948746, 3304353, 2221699, 1763093, 1247202]
2095.8A033706A524290A709655A977170B095780A480551D81875C72078D50341D27127
2083.9G42424G13258D81184B82924B19063A9188C98854G09156E46453G55021E32244
2070.7E95137B15194A37786B16728D6841A49890C88630G83661E76517H35080H88415
2057.5C48008I3691C52475D34685C70714D01130A62232b29519a52646b70304b96919
2044.4g7039B69282C13914B89083B43272D86248D92118d5428a36147a57948a37292
2031.2b20313d01266A52484C29177E69935D86813D21064D75116I41911A211265F24466
2018F17663H05405I89740E90829E17864I26626F42623F60823C96716G0524c60446e22075
2003.7e71461b29656A54072a07519B97919C04752B60516B0599e23331f24197c37369
$$ y = [1033706, 1524290, 1709655, 1977170, 2095780, 1480551, 481875, 372078, 450341, 427127, 742424, 713258, 481184, 282924, 219063, 19188, 398854, 709156, 546453, 755021, 532244, 595137, 215194, 137786, 216728, 46841, 149890, 388630, 783661, 576517, 835080, 888415, 348008, 93691, 352475, 434685, 370714, 401130, 162232, -229519, -152646, -270304, -296919, -77039, 269282, 313914, 289083, 243272, 486248, 492118, -45428, -136147, -157948, -137292, -220313, -401266, 152484, 329177, 569935, 486813, 421064, 475116, 941911, 1211265, 624466, 617663, 805405, 989740, 590829, 517864, 926626, 642623, 660823, 396716, 70524, -360446, -522075, -571461, -229656, 154072, -107519, 297919, 304752, 260516, 20599, -523331, -624197, -337369]
1990.5b42456A35020C50288a06506a92291a75989h5547D17573G99289F67463g7708
1977.3b16102a19778A22853C30058C77998B56134g004a46630b09430b83745a15331
1964.2e22511d89054a91342a6958B95819A143653H49066D14039E05652F75935E51250
1951F34892B70693A15512F62673C52633A3833C3630C6112D96277I65147G92076F47061
1936.7A144442A473001I48035H07401E31739D13756F84796H78277F13299E32619E06140
1923.5a20825C6549B43356B6636B86832C13851C93119I2302b82781F5189A79152a54285
1909.1f11235i86195g91931d35033g65887g10997i28767i80222a92448A24860C46185
1896B24610d4022b19196b48707E3964c49675c29680i4643f75744g63246c24590C44222
$$ y = [-242456, 135020, 350288, -106506, -192291, -175989, -85547, 417573, 799289, 667463, -77708, -216102, -119778, 122853, 330058, 377998, 256134, -7004, -146630, -209430, -283745, -115331, -522511, -489054, -191342, -16958, 295819, 1143653, 849066, 414039, 505652, 675935, 551250, 634892, 270693, 115512, 662673, 352633, 13833, 33630, 36112, 496277, 965147, 792076, 647061, 1144442, 1473001, 948035, 807401, 531739, 413756, 684796, 878277, 613299, 532619, 506140, -120825, 36549, 243356, 26636, 286832, 313851, 393119, 92302, -282781, 65189, 179152, -154285, -611235, -986195, -791931, -435033, -765887, -710997, -928767, -980222, -192448, 124860, 346185, 224610, -44022, -219196, -248707, 53964, -349675, -329680, -94643, -675744, -763246, -324590, 344222]
1881.6C20331C20086H07197G04953B99941B03803B72888E96023G06273E41445D78765
1868.4E71120E13263C63683I2121A77438C11459A82350I3164B41519a29395d55853
1855.3d38273E1283E24670E46341C04833c91213d62215b28607d6441D11160C49095
1842.1B8314A82100F96943G76735A89337A86375A56469D05364D93509D55345B37545
1829F91378F96646E38783H00304F97960D63269A22234d63690a25809C2178A4366a97657
1814.6a0661D8956A3237F1978A81582A5305I1858b63764e7686e5972C6058b01525f9217
1799A52221E48858A097922A376962A172828H80481A145017A208230H04796G84143A011807
1785.9G97887H50080H30825A138885A182706A204074B395120B957345C778347E296463
$$ y = [320331, 320086, 807197, 704953, 299941, 203803, 272888, 596023, 706273, 541445, 478765, 571120, 513263, 363683, 92121, 177438, 311459, 182350, 93164, 241519, -129395, -455853, -438273, 51283, 524670, 546341, 304833, -391213, -462215, -228607, -46441, 411160, 349095, 28314, 182100, 696943, 776735, 189337, 186375, 156469, 405364, 493509, 455345, 237545, 691378, 696646, 538783, 800304, 697960, 463269, 122234, -463690, -125809, 32178, 14366, -197657, -10661, 48956, 13237, 61978, 181582, 15305, 91858, -263764, -57686, -55972, 36058, -201525, -69217, 152221, 548858, 1097922, 1376962, 1172828, 880481, 1145017, 1208230, 804796, 784143, 1011807, 797887, 850080, 830825, 1138885, 1182706, 1204074, 2395120, 2957345, 3778347, 5296463]
1773.9H528316A5694985C2425894H3399008A67525760I4500280C7500312A7561240
1764.3I907760F107698C973989B801976B229743A783440A538051A632029A518898A238962
1752.4G11480E56300F22118G20571H89254H92990B87504h7311A46700A44792B49197
1739.2H9119a86521A4365C05089D47999D22677E05938A85121c70108c71257a5670E6332
1724.8e7328G9614C32045A46912b4654C20693A59884d42548b69289C10491E10059a7244
1710.5c23191c14570b20904d7806C93762D09805C65657A78680a94085A8402A06582
1697.3d6961A87167C6121b54249a40708A94123E10897G35912I38348E82349e57061
1684.2B9270F71960B57829b38625g9111a82444c59409d86742b96015b63315a90923
$$ y = [8528316, 15694985, 32425894, 83399008, 167525760, 94500280, 37500312, 17561240, 9907760, 6107698, 3973989, 2801976, 2229743, 1783440, 1538051, 1632029, 1518898, 1238962, 711480, 556300, 622118, 720571, 889254, 892990, 287504, -87311, 146700, 144792, 249197, 89119, -186521, 14365, 305089, 447999, 422677, 505938, 185121, -370108, -371257, -15670, 56332, -57328, 79614, 332045, 146912, -24654, 320693, 159884, -442548, -269289, 310491, 510059, -17244, -323191, -314570, -220904, -47806, 393762, 409805, 365657, 178680, -194085, 18402, 106582, -46961, 187167, 36121, -254249, -140708, 194123, 510897, 735912, 938348, 582349, -557061, 29270, 671960, 257829, -238625, -79111, -182444, -359409, -486742, -296015, -263315, -190923]
1671a53960e04789c90536c29725C22042B29736i6497g96903e84029a48525b41055d12300
1656.6e57466d83492b43313b45889B56518D14730a807d95417d71500a68684G0668A63124
1642.3B68880E18586G48249D44604B21500b82658A89565C75333C98701E67213C55763
1629.1D55483B33480f3788b92334d70624h9324A50232a8236a17217c75041b66331a77975
1614.7a01871a65275A50601H8344b14436F3706a00160H5403B5417a65150D7147D0790
1600.4c6668A07566c70677F4174a10788A79701B7357H1098C07446G12928F89888E93341
1586C05631E79897D08769F02033G13198I23904A084025A007545A367938B265186C233309
1572.9E322440H936433A6925432D0076628A10759664A45383696F3745728B6312412
$$ y = [-153960, -504789, -390536, -329725, 322042, 229736, -96497, -796903, -584029, -148525, -241055, -412300, -557466, -483492, -243313, -245889, 256518, 414730, -1807, -495417, -471500, -168684, 70668, 163124, 268880, 518586, 748249, 444604, 221500, -282658, 189565, 375333, 398701, 567213, 355763, 455483, 233480, -63788, -292334, -470624, -89324, 150232, -18236, -117217, -375041, -266331, -177975, -101871, -165275, 150601, 88344, -214436, 63706, -100160, 85403, 25417, -165150, 47147, 40790, -36668, 107566, -370677, 64174, -110788, 179701, 27357, 81098, 307446, 712928, 689888, 593341, 305631, 579897, 408769, 602033, 713198, 923904, 1084025, 1007545, 1367938, 2265186, 3233309, 5322440, 8936433, 16925432, 40076628, 110759664, 145383696, 63745728, 26312412]
1563.3A3954548H449475E259034C465781B353351B517920B532581B182725B235115
1552.5A930123A372538H48293F59408I79002A348483A621132H77240F41688D83158
1540.6D39391D65701B04915F3499g3128c48267a82033B37942C35909A5981f684D93445
1526.2D61233a76627B4524B73252B17474C89102G91908I87552H39677A085629A075724
1513G21111c4454e66568a54568a21968a74529e87821e29507b89797I7631B63531c96535
1498.7f88068b65274A78503B13264A75465d226a33633a52805d72823g79234d04049
1485.5E591d28446a72992f3710B49374A48491E15877D25435C81779D46043b38134a96432
1471.1D7276B27353D15505B88870A55372a49613i9231h5003c5936B828B06216G6948
$$ y = [13954548, 8449475, 5259034, 3465781, 2353351, 2517920, 2532581, 2182725, 2235115, 1930123, 1372538, 848293, 659408, 979002, 1348483, 1621132, 877240, 641688, 483158, 439391, 465701, 204915, 63499, -73128, -348267, -182033, 237942, 335909, 15981, -6684, 493445, 461233, -176627, 24524, 273252, 217474, 389102, 791908, 987552, 839677, 1085629, 1075724, 721111, -34454, -566568, -154568, -121968, -174529, -587821, -529507, -289797, 97631, 263531, -396535, -688068, -265274, 178503, 213264, 175465, -4226, -133633, -152805, -472823, -779234, -404049, 5591, -428446, -172992, -63710, 249374, 148491, 515877, 425435, 381779, 446043, -238134, -196432, 47276, 227353, 415505, 288870, 155372, -149613, -99231, -85003, -35936, 2828, 206216, 76948]
1456.8c1654g5206E27388D78664A82575c22881B67114F49138D94376C89624B88434
1443.6A57884C44466C87408C55223B36969d8823b86764g13037g61981i18629c34705
1430.5f5661d8203B36711G8948c5710a50856G14096A064695E31770B19966A74003D27538
1416.1D12308A31406c54206c75909C87167D86739a64470d29862g03461b99807b5117
1402.9a87061F1819A62671E85297F85824D65786A09802g5347d50303a96174f41784
1389.8g69905i13328f60903e93343e59662d56294c17890c55519b88971g1359E259b64255
1375.4b23388d61607e79694e8606A75508F27059H28746G54091B54639a2524b52732
1362.2c06270d03280c84975a81918a36224a38176D13874C92218A84732E1128B14327
$$ y = [-31654, -75206, 527388, 478664, 182575, -322881, 267114, 649138, 494376, 389624, 288434, 157884, 344466, 387408, 355223, 236969, -48823, -286764, -713037, -761981, -918629, -334705, -65661, -48203, 236711, 78948, -35710, -150856, 714096, 1064695, 531770, 219966, 174003, 427538, 412308, 131406, -354206, -375909, 387167, 486739, -164470, -429862, -703461, -299807, -25117, -187061, 61819, 162671, 585297, 685824, 465786, 109802, -75347, -450303, -196174, -641784, -769905, -913328, -660903, -593343, -559662, -456294, -317890, -355519, -288971, -71359, 5259, -264255, -223388, -461607, -579694, -58606, 175508, 627059, 828746, 754091, 254639, -12524, -252732, -306270, -403280, -384975, -181918, -136224, -138176, 413874, 392218, 184732, 51128, 214327]
1349.1I7506e28549h73918c89929a7703b04774d45133d39286a09374a61697i5388B96967
1334.7I2082G1849C98330I1812b89065a25543C28351A63982A76941A01364d06566a77393
1320.4a9620d77216g80227c67470A6598C60485a00242d75351c40385a69513d5360A35970
1306D02595B93647a52232a64947a69295b93573a7176a94519D230B40621b56491b09982
1291.6a17894a85114b65313b77208e14508g09547c21846H8868A36243C78774A46351
1278.5F32114H24928G18556C65180D49526F11910E18988G7546A7925B83916i0145c91287
1264.1c79942h2998A34974h8945b26972e9210C57531E8538b82950h02751i71606d70023
1249.8c84390f3437I808E02767C69254B44201B62364E7690b05711d62019B87972B77706
$$ y = [97506, -528549, -873918, -389929, -17703, -204774, -445133, -439286, -109374, -161697, -95388, 296967, 92082, 71849, 398330, 91812, -289065, -125543, 328351, 163982, 176941, 101364, -406566, -177393, -19620, -477216, -780227, -367470, 16598, 360485, -100242, -475351, -340385, -169513, -45360, 135970, 402595, 293647, -152232, -164947, -169295, -293573, -17176, -194519, 4230, 240621, -256491, -209982, -117894, -185114, -265313, -277208, -514508, -709547, -321846, 88868, 136243, 378774, 146351, 632114, 824928, 718556, 365180, 449526, 611910, 518988, 77546, 17925, 283916, -90145, -391287, -379942, -82998, 134974, -88945, -226972, -59210, 357531, 58538, -282950, -802751, -971606, -470023, -384390, -63437, 9808, 502767, 369254, 244201, 262364, 57690, -205711, -462019, 287972, 277706]
1235.4I2518E08999D64975E19039F36098C84314B1582b39844h07008c19006H0391B13657
1221E1084a4066E4338A27776c6929B9137A29282B64740A726E8358C30666D43435C27890
1205.5f8560a87203a89103c01176c63412B37655B12836d99330g18504e73866c83365
1192.3A18518C53094d3841b33898B71107E82414A151780A138247F51443F0183b03871
1179.2A32974B71392a56030C132F9526C15921D86368a33321b60337G9506A29131a12821
1164.8a06212a06200d05295c49713E295a06968b87479g68789e59872i4545B16877A18461
1150.4b85785d91803C4463C16155A14603d26284c32724d451a03032D4948g6605i9620
1136.1b53875D5101d23945b31699B2030b3782d88016e89214g45420c90949g5651c48507
$$ y = [92518, 508999, 464975, 519039, 636098, 384314, 21582, -239844, -807008, -319006, 80391, 213657, 51084, -14066, 54338, 127776, -36929, 29137, 129282, 264740, 1726, 58358, 330666, 443435, 327890, -68560, -187203, -189103, -301176, -363412, 237655, 212836, -499330, -718504, -573866, -383365, 118518, 353094, -43841, -233898, 271107, 582414, 1151780, 1138247, 651443, 60183, -203871, 132974, 271392, -156030, 3132, 69526, 315921, 486368, -133321, -260337, 79506, 129131, -112821, -106212, -106200, -405295, -349713, 5295, -106968, -287479, -768789, -559872, -94545, 216877, 118461, -285785, -491803, 34463, 316155, 114603, -426284, -332724, -4451, -103032, 44948, -76605, -99620, -253875, 45101, -423945, -231699, 22030, -23782, -488016, -589214, -745420, -390949, -75651, -348507]
1121.7f52958b23165a29490f6898h5178a13424d817a37914b10133b52594d10936c45641
1107.4c51605b32508F8184C92758c26742b16732f390C39443F66699A90216c98481c45460
1093a9226a0637d03327b44349a57250c58023d11009b21101c14434a93692d79390a87617
1078.6B67437B98978C62853E9346c48116c49392a4331e132d1977B43973C9778c34049
1064.3G4017F15406I10835F00811B08721E8078b52533a20303g696B40839a37387b75034
1049.9I75B87560C60545C40622E25750B57576d7717D09385F16986E92192D62258C16792
1035.5B59232I536h500a36526f25295e76990h2474G9065E26989B65064C28166A64882
1021.2A48770A81178A61965A66992a6632i0697c62105c26256C90516H30894F64799
$$ y = [-652958, -223165, -129490, -66898, -85178, -113424, -4817, -137914, -210133, -252594, -410936, -345641, -351605, -232508, 68184, 392758, -326742, -216732, -6390, 339443, 666699, 190216, -398481, -345460, -19226, -10637, -403327, -244349, -157250, -358023, -411009, -221101, -314434, -193692, -479390, -187617, 267437, 298978, 362853, 59346, -348116, -349392, -14331, -5132, -41977, 243973, 39778, -334049, 74017, 615406, 910835, 600811, 208721, 58078, -252533, -120303, -7696, 240839, -137387, -275034, 975, 287560, 360545, 340622, 525750, 257576, -47717, 409385, 616986, 592192, 462258, 316792, 259232, 9536, -8500, -136526, -625295, -576990, -82474, 79065, 526989, 265064, 328166, 164882, 148770, 181178, 161965, 166992, -16632, -90697, -362105, -326256, 390516, 830894, 664799]
1008A96779c38439c99532B79372F61831B33350A72115c3210i6176C52342E59865D73185
993.7f3905A35238C39532B20320d1627a12516h6029f7149f8895A36575h6424B32806
979.3G15064I93265H72619G40106E12553F47087G20260C44595H7273C96312H10702
966.1C70120D5680a63774b06105a14208A7821a79342A02660B41534B05288B38970A62091
951.8g3026c8295b54899a82493f55736d91178c64432I4779A92598a68750d60114e43274
937.4A78933B49427h6379b72813d39274b0954F639e6719c72660e54025g05697g56415
923.1f53801e80590b66771H901d7363A72740A80868B48447B00422D4077i0104b12003
908.7F1062E32618G77459D63656D13177I46820C16850g9367b72187i6821A21223A66715
$$ y = [196779, -338439, -399532, 279372, 661831, 233350, 172115, -33210, -96176, 352342, 559865, 473185, -63905, 135238, 339532, 220320, -41627, -112516, -86029, -67149, -68895, 136575, -86424, 232806, 715064, 993265, 872619, 740106, 512553, 647087, 720260, 344595, 87273, 396312, 810702, 370120, 45680, -163774, -206105, -114208, 17821, -179342, 102660, 241534, 205288, 238970, 162091, -73026, -38295, -254899, -182493, -655736, -491178, -364432, 94779, 192598, -168750, -460114, -543274, 178933, 249427, -86379, -272813, -439274, -20954, 6639, -56719, -372660, -554025, -705697, -756415, -653801, -580590, -266771, 8901, -47363, 172740, 180868, 248447, 200422, 44077, -90104, -212003, 61062, 532618, 777459, 463656, 413177, 946820, 316850, -79367, -272187, -96821, 121223, 166715]
894.3c36230e85464f64593d48999d57220c74935b41413A5590G9107B37509C61161A6641
880g3517B74175A64451A45863C64324F1261b00738I2477B77999B73582B9893G7504
865.6a49537a63115a20985e137A73063a98292d15682g68713e82150e27128d78478B1241
851.3a41791e33562f90551h42678f65671b97466A72524I3294C6554b92294a75808b03247
836.9d47304f9975b50209e25610g77144a93513A59904d3583a04369a19518f460A18729
822.5A55722D09934C82002C57050A04737A42762B78135A50351B30459B09279a71120
809.4d94222c66441A5131B19580C12336H3700a55088c22907d27673e82211a73423c67186
795c85825A91024E03933C74990A8774e0243d90346i76372h99295d51465a00785d80552
$$ y = [-336230, -585464, -664593, -448999, -457220, -374935, -241413, 15590, 79107, 237509, 361161, 16641, -73517, 274175, 164451, 145863, 364324, 61261, -200738, 92477, 277999, 273582, 29893, 77504, -149537, -163115, -120985, -5137, 173063, -198292, -415682, -768713, -582150, -527128, -478478, 21241, -141791, -533562, -690551, -842678, -665671, -297466, 172524, 93294, 36554, -292294, -175808, -203247, -447304, -69975, -250209, -525610, -777144, -193513, 159904, -43583, -104369, -119518, -6460, 118729, 155722, 409934, 382002, 357050, 104737, 142762, 278135, 150351, 230459, 209279, -171120, -494222, -366441, 15131, 219580, 312336, 83700, -155088, -322907, -427673, -582211, -173423, -367186, -385825, 191024, 503933, 374990, 18774, -50243, -490346, -976372, -899295, -451465, -100785, -480552]
780.7b50838B8789I4213C37197B01268a21342B12372B67368A63212F99019F44605i6956
766.3e44987e78284a46881b38063c2533D4157A07659E08976E09670B59494a07335c8778
751.9C328a30130a22769d12860d63600d69080e35252A4169B49131B2928c10656e5744
737.6e6207A01611B02495A16435a35627b55283g5602D54432C19827D5442A11146C07173
723.2C32173A00860b862b76798c25785d8952d6365a85112d88438d51646d57750e99657
708.9b95062C00994D58244A90274b8777d26931d35394e08258d92111a90309b36193
695.7e61211b23843a73800i04855e81137B04f56982g34828b34519a05580b10479A32337
681.3D34375B40622a19358c54834d63752d48569a22483B64486D93024D80964E73852
$$ y = [-250838, 28789, 94213, 337197, 201268, -121342, 212372, 267368, 163212, 699019, 644605, -96956, -544987, -578284, -146881, -238063, -32533, 44157, 107659, 508976, 509670, 259494, -107335, -38778, 3328, -130130, -122769, -412860, -463600, -469080, -535252, 14169, 249131, 22928, -310656, -55744, -56207, 101611, 202495, 116435, -135627, -255283, -75602, 454432, 319827, 45442, 111146, 307173, 332173, 100860, -2862, -276798, -325785, -48952, -46365, -185112, -488438, -451646, -457750, -599657, -295062, 300994, 458244, 190274, -28777, -426931, -435394, -508258, -492111, -190309, -236193, -561211, -223843, -173800, -904855, -581137, 204, -656982, -734828, -234519, -105580, -210479, 132337, 434375, 240622, -119358, -354834, -463752, -448569, -122483, 264486, 493024, 480964, 573852]
668.2B88945d60034d25912d28402e98058b73380e01094b57366c2083d0475e21002f44159
653.8b05289a45046C27964D95296I12672G86828C73539E23125G54763E03464D14857
640.6G47861G23187D92531D63912A31328a03545c14310i636A17860A37369A49031C48654
626.3C07957D78506D95452B45848A86970C11443C72405B66540C70927B61802I6472
613.1i2838a42346b115A12309B2218b25119d13676b64192b85106a3471A12946E34098
598.8C17897C93950F04242C41755c18359a23830B77717E6192A8368C51927D79324F4100
584.4b23058e01415b82255C59514D50922A95413a29103c5708F2854b22067g83191g55014
570f87771c71434d8253B28219A64920a34775A37215C43047a56492g88246i53494g43352
$$ y = [288945, -460034, -425912, -428402, -598058, -273380, -501094, -257366, -32083, -40475, -521002, -644159, -205289, -145046, 327964, 495296, 912672, 786828, 373539, 523125, 754763, 503464, 414857, 747861, 723187, 492531, 463912, 131328, -103545, -314310, -9636, 117860, 137369, 149031, 348654, 307957, 478506, 495452, 245848, 186970, 311443, 372405, 266540, 370927, 261802, 96472, -92838, -142346, -2115, 112309, 22218, -225119, -413676, -264192, -285106, -13471, 112946, 534098, 317897, 393950, 604242, 341755, -318359, -123830, 277717, 56192, 18368, 351927, 479324, 64100, -223058, -501415, -282255, 359514, 450922, 195413, -129103, -35708, 62854, -222067, -783191, -755014, -687771, -371434, -48253, 228219, 164920, -134775, 137215, 343047, -156492, -788246, -953494, -743352]
555.7f28335b20073b38658C7243c5009a32917c09405c05516h6087A51898b75402e9466
541.3C76459b01106d96608i8821E21910F78509D66264B01222C59064D26499F22675
528.2a18557d86450a07872a69836h272a12508g929b58690c23231d38966f37573f92728
513.8g79279e92750b00515a26609a29784c37685a08712B24593B27732B35117D17372
500.6a24696f02539h22681g01784f24519d44698e42793d37346c4457C03628C56304
487.5D66839B42233B42075B65127G2224c61684d90313a82412A12853C69756F66786
474.3B52679B86755c40865f57720b95856A3412A79865H48399E84679C09207b3520A863
459.9E02227A88939a32451b60187h21308a151785f31432b69409H2788B83674A49930
$$ y = [-628335, -220073, -238658, 37243, -35009, -132917, -309405, -305516, -86087, 151898, -275402, -59466, 376459, -201106, -496608, -98821, 521910, 678509, 466264, 201222, 359064, 426499, 622675, -118557, -486450, -107872, -169836, -8272, -112508, -7929, -258690, -323231, -438966, -637573, -692728, -779279, -592750, -200515, -126609, -129784, -337685, -108712, 224593, 227732, 235117, 417372, -124696, -602539, -822681, -701784, -624519, -444698, -542793, -437346, -34457, 303628, 356304, 466839, 242233, 242075, 265127, 72224, -361684, -490313, -182412, 112853, 369756, 666786, 252679, 286755, -340865, -657720, -295856, 13412, 179865, 848399, 584679, 309207, -23520, 1863, 502227, 188939, -132451, -260187, -821308, -1151785, -631432, -269409, 82788, 283674, 149930]
446.8g3381A01744c46131b78419e55288a76777E95021F37212D28366C64155b3592c16422
432.4i9726B06420B90059A33412C45193D99814E3797F9817a95578e45979i77475g63850
418.1f20099a74583c73154f04297d41882i3463e20531d73652c4778b69993d95339c68741
403.7e74630b37923a83223c09420f68616d47316b01496B24269A99542B69502D61011
390.5A58089A00604C55848A87636c23462d27343c20160b45812d36818b62921f49850
377.4e86702e64988c41774D6117D70880B18048A16820a96577d92152b69563d32495
364.2a14295c1721E8327b22160d61154a0020E24690D36596A25695c85603f23457e91258
349.8f55861f0389B13009I337H5453G6643c34223d15947h38514h24744e59544B6109
$$ y = [-73381, 101744, -346131, -278419, -555288, -176777, 595021, 637212, 428366, 364155, -23592, -316422, -99726, 206420, 290059, 133412, 345193, 499814, 53797, 69817, -195578, -545979, -977475, -763850, -620099, -174583, -373154, -604297, -441882, -93463, -520531, -473652, -34778, -269993, -495339, -368741, -574630, -237923, -183223, -309420, -668616, -447316, -201496, 224269, 199542, 269502, 461011, 158089, 100604, 355848, 187636, -323462, -427343, -320160, -245812, -436818, -262921, -649850, -586702, -564988, -341774, 46117, 470880, 218048, 116820, -196577, -492152, -269563, -432495, -114295, -31721, 58327, -222160, -461154, -10020, 524690, 436596, 125695, -385603, -623457, -591258, -655861, -60389, 213009, 9337, 85453, 76643, -334223, -415947, -838514, -824744, -559544, 26109]
335.5a36384d33384c48811a10104b8350D65348B74905A35853A2805a6133H1811c49170
321.1d96900e16472b92942b81157b69092a91818b78237c27792e53906h36380f80919
308a67884h1622b14758e13425f41252e19026b60218d26941c52095e68442A83778E66290
293.6B19901a27953C41521A26258C4624A48736D1128a00480b93934d20235h9998a01059
279.2g09389f23907b60250G2157A94203B08890a65090g7005C81549F75694D75767D88117
264.9C70991b92728i57509h70840c31687E1765D16142C86192B75762b105H2617C17381
250.5B00420a68718c1571b71194f90525e68097a2832B03691B35477b18543d84564A6835
236.2A46176b66207c16911b70860h9662C21404e0819f9830D9817h1797d07063F4179
$$ y = [-136384, -433384, -348811, -110104, -28350, 465348, 274905, 135853, 12805, -16133, 81811, -349170, -496900, -516472, -292942, -281157, -269092, -191818, -278237, -327792, -553906, -836380, -680919, -167884, -81622, -214758, -513425, -641252, -519026, -260218, -426941, -352095, -568442, 183778, 566290, 219901, -127953, 341521, 126258, 34624, 148736, 41128, -100480, -293934, -420235, -89998, -101059, -709389, -623907, -260250, 72157, 194203, 208890, -165090, -77005, 381549, 675694, 475767, 488117, 370991, -292728, -957509, -870840, -331687, 51765, 416142, 386192, 275762, -2105, 82617, 317381, 200420, -168718, -31571, -271194, -690525, -568097, -12832, 203691, 235477, -218543, -484564, 16835, 146176, -266207, -316911, -270860, -89662, 321404, -50819, -69830, 49817, -81797, -407063, 64179]
221.8C14890e4340H4983B85869C46699F41279D58652C65650B04727C84481A0161d33454
207.4d39435g77247f65254d07951d39710b72709a46374A34020d0035a92936A02323
194.3A11086b17904c31168A15494B11085B99000E4370A55232B43609a71566c45071
181.1c75523b9120B17889A87662f21254i43987d94045a03614f6403d72889d30260a33457
166.7D35929E89155C87755A66640C60394C917b89031e30730b15079c45946a04741D4058
152.4c60961b5682A79758e27621a287593a209667f25782d03793g35430d07014F3774
139.2a99373e84261g07804d61223A9806D11971B54364a14787A18061a56800b63060
126.1B58328C58014C95570B02746B65038a9390b03565h45437h89788d20107c42982
$$ y = [314890, -54340, 84983, 285869, 346699, 641279, 458652, 365650, 204727, 384481, 10161, -433454, -439435, -777247, -665254, -407951, -439710, -272709, -146374, 134020, -40035, -192936, 102323, 111086, -217904, -331168, 115494, 211085, 299000, 54370, 155232, 243609, -171566, -345071, -375523, -29120, 217889, 187662, -621254, -943987, -494045, -103614, -66403, -472889, -430260, -133457, 435929, 589155, 387755, 166640, 360394, 3917, -289031, -530730, -215079, -345946, -104741, 44058, -360961, -25682, 179758, -527621, -1287593, -1209667, -625782, -403793, -735430, -407014, 63774, -199373, -584261, -707804, -461223, 19806, 411971, 254364, -114787, 118061, -156800, -263060, 258328, 358014, 395570, 202746, 265038, -19390, -203565, -845437, -889788, -420107, -342982]
112.9f57613g76728f19590h42843g57754d04435d79016e31886a25396D03499E29464
99.7A78963f9680e74870c30123i955A51417B28876f5270B58968B07088h7815f2371
85.4D01602C09322B09398C20704B04009B70334G7031c9696a31933a04248f5136a85090
71a71780A28801a70303d84786c19499i2049h7862a54171C9810a30649d5783C05074
56.7C98377C40714A17892F3165D2852c96721b66330a67214b62021c90965a60241c26253
42.3e77967f88050A25544B37042C37460A07708B1011b07371b92796B14095F8940e10583
27.9g90746c73382f6346i1084d3093a65466c41550e51342d23343b79649B5446C39857
13.6C17372a31465e9485C00214D93862B98306F07541F18404B11081c29474b83845c20583
$$ y = [-657613, -776728, -619590, -842843, -757754, -404435, -479016, -531886, -125396, 403499, 529464, 178963, -69680, -574870, -330123, -9955, 151417, 228876, -65270, 258968, 207088, -87815, -62371, 401602, 309322, 209398, 320704, 204009, 270334, 77031, -39696, -131933, -104248, -65136, -185090, -171780, 128801, -170303, -484786, -319499, -92049, -87862, -154171, 39810, -130649, -45783, 305074, 398377, 340714, 117892, 63165, 42852, -396721, -266330, -167214, -262021, -390965, -160241, -326253, -577967, -688050, 125544, 237042, 337460, 107708, 21011, -207371, -292796, 214095, 68940, -510583, -790746, -373382, -66346, -91084, -43093, -165466, -341550, -551342, -423343, -279649, 25446, 339857, 317372, -131465, -59485, 300214, 493862, 298306, 607541, 618404, 211081, -329474, -283845, -320583]
-0.8E9480E23889I26739E03497b10252c05843c22940a24391d6944e8891d7748A14879
-15.1B48598B24153B6706b50361b62016c09388f8499a5571a52942E6327A96009e1470
-29.5f3166b4555G4032d61034A25781C67925A89663b54447c53520b59973d67007g90820
-43.9f19084f85782a61682C0119A47516B22467b6721H7592D55915D51490C68693c78108
-58.2g01486c78063a73079A7589a89666E8773B15144E0552b56850f25117e83517e2368
-72.6A98487H703c40003b97855C1672B31466B60447C4588A80955G30398E91246H46912
-87I50449G21421C54088A07925C09832A96862a51695H7634B22948C16335d9971c47966
-101.3d34250h3112d7221e92442e74399f02732c24609f9214A77147B49167c6999e95184
$$ y = [59480, 523889, 926739, 503497, -210252, -305843, -322940, -124391, -46944, -58891, -47748, 114879, 248598, 224153, 26706, -250361, -262016, -309388, -68499, -15571, -152942, 56327, 196009, -51470, -63166, -24555, 74032, -461034, 125781, 367925, 189663, -254447, -353520, -259973, -467007, -790820, -619084, -685782, -161682, 30119, 147516, 222467, -26721, 87592, 455915, 451490, 368693, -378108, -701486, -378063, -173079, 17589, -189666, 58773, 215144, 50552, -256850, -625117, -583517, -52368, 198487, 8703, -340003, -297855, 31672, 231466, 260447, 34588, 180955, 730398, 591246, 846912, 950449, 721421, 354088, 107925, 309832, 196862, -151695, 87634, 222948, 316335, -49971, -347966, -434250, -83112, -47221, -592442, -574399, -602732, -324609, -69214, 177147, 249167, -36999, -595184]
-115.7A03336B26154C02761B94047C72196E22533A54749g2333b02501e47817d5738
-128.8D19720D00243a40434d07782d65061d87129f7288C2494a08277C03798D46281
-142A51912a45373c32462d73124g46224f58291d43146b79455f7451A4376A50063b88725
-156.4e18580f62441d59664f08494e53286a15997A85222H2628B31530C7109B57936
-169.5G28778G12927D09126D88662A9595b45629d02191b08012B31270a89518d14848
-182.7c61021A17990A29787B52726D45188E51561D09259H0401b41746d33348h48296
-195.9f20461d54956b87328a71799b02423b07895b37474B18793D05768B52603A64608
-209d63241d41268c67922c52670b14114d37281g26187e98744e29658b73760A31948
$$ y = [103336, 226154, 302761, 294047, 372196, 522533, 154749, -72333, -202501, -547817, -45738, 419720, 400243, -140434, -407782, -465061, -487129, -67288, 32494, -108277, 303798, 446281, 151912, -145373, -332462, -473124, -746224, -658291, -443146, -279455, -67451, 14376, 150063, -288725, -518580, -662441, -459664, -608494, -553286, -115997, 185222, 82628, 231530, 37109, 257936, 728778, 712927, 409126, 488662, 19595, -245629, -402191, -208012, 231270, -189518, -414848, -361021, 117990, 129787, 252726, 445188, 551561, 409259, 80401, -241746, -433348, -848296, -620461, -454956, -287328, -171799, -202423, -207895, -237474, 218793, 405768, 252603, 164608, -463241, -441268, -367922, -352670, -214114, -437281, -726187, -598744, -529658, -273760, 131948]
-222.2A93349A63811a30985b63644b47951a07734c03552A38923A9723b24161b42049
-235.3d03654f1424b86958d35107g55910a129192g80485f92511c90568b21687e72267
-248.5f59025h19968i13956f68274e86362d71000b77475c79647c33899d82210a37047
-261.7A91396D25471A51815D15138D58136A81025C1803A33617C02321F90300F96486
-274.8C83117B58345C11090B26819A50450b18498B30583d5221b22316c17703i4422
-288f5735b08736B6263D01088A34586E7932B35223G01576D35588a08638d63479C21764
-302.4C71519d5828g03814f04844A32288C94271C91712E26454D92655F27653D67277
-315.5i7268D17A21413B50815b8421A88375c4188a70399C42869F88491F33603F31621
$$ y = [193349, 163811, -130985, -263644, -247951, -107734, -303552, 138923, 19723, -224161, -242049, -403654, -61424, -286958, -435107, -755910, -1129192, -780485, -692511, -390568, -221687, -572267, -659025, -819968, -913956, -668274, -586362, -471000, -277475, -379647, -333899, -482210, -137047, 191396, 425471, 151815, 415138, 458136, 181025, 31803, 133617, 302321, 690300, 696486, 383117, 258345, 311090, 226819, 150450, -218498, 230583, -45221, -222316, -317703, -94422, -65735, -208736, 26263, 401088, 134586, 57932, 235223, 701576, 435588, -108638, -463479, 321764, 371519, -45828, -703814, -604844, 132288, 394271, 391712, 526454, 492655, 627653, 467277, -97268, 417, 121413, 250815, -28421, 188375, -34188, -170399, 342869, 688491, 633603, 631621]
-329.9C60542D1259c77820e02210c36789d9482A98087A479b11657c40493c84751a65993
-344.2A72265B39967B08137a25405G3684G34008G34349F00439A60411F0513A28865
-357.4C8561A76891C08810C1725B13234c7786b50307a63935A19737A53463A34748B5260
-371.8D06471C44717a42101a28522b55962c89688i08842i14313f36084d12934e00171
-384.9f41409f41562c49379e37476h21043g73799h98756a076129a381601a135527e45243
-398.1A52270A44691d7536A41859E10124A21040a77987H044C56196C85401A51971D5844
-412.5B93861e1366C8751a17247d61068f74756b72121c09550a92092b34651f00337
-425.6f53421g55461c99312a76868E8679B90045F53871A038865I58767H29636F03704
$$ y = [360542, 41259, -377820, -502210, -336789, -49482, 198087, 1479, -211657, -340493, -384751, -165993, 172265, 239967, 208137, -125405, 73684, 734008, 734349, 600439, 160411, 60513, 128865, 38561, 176891, 308810, 31725, 213234, -37786, -250307, -163935, 119737, 153463, 134748, 25260, 406471, 344717, -142101, -128522, -255962, -389688, -908842, -914313, -636084, -412934, -500171, -641409, -641562, -349379, -537476, -821043, -773799, -898756, -1076129, -1381601, -1135527, -545243, 152270, 144691, -47536, 141859, 510124, 121040, -177987, 8044, 356196, 385401, 151971, 45844, 293861, -51366, 38751, -117247, -461068, -674756, -272121, -309550, -192092, -234651, -600337, -653421, -755461, -399312, -176868, 58679, 290045, 653871, 1038865, 958767, 829636, 603704]
-438.8C23956A71950E9262c2235g63070e25693D12141C39935C29245D02482D29451
-451.9D56995B24494D78733g8399e05092h88259h90932h74279i57183f10095e27945
-465.1d21764b13506e68117c68379a84982b64061d18571b67194a03813A35676a93781
-478.3a99859i3749h2790c71394e72255b82927g5226f90116f19756C84311C04320b6957
-492.6A18118A57913C55332A32499g1405a1572a05206A09252C00222c2832D5558D6048
-507A63020b35653I668C22777B81093a67433b00832b53039A33765A88245C33225B55553
-521.4D96487D71136C65031E23750E60039E30744C85044F56456D56998B87705B18877
-534.5C81123A20157c18517b36440g2479b22370a76992C32106D84256A24440a66526
$$ y = [323956, 171950, 59262, -32235, -763070, -525693, 412141, 339935, 329245, 402482, 429451, 456995, 224494, 478733, -78399, -505092, -888259, -890932, -874279, -957183, -610095, -527945, -421764, -213506, -568117, -368379, -184982, -264061, -418571, -267194, -103813, 135676, -193781, -199859, -93749, -82790, -371394, -572255, -282927, -75226, -690116, -619756, 384311, 304320, -26957, 118118, 157913, 355332, 132499, -71405, -11572, -105206, 109252, 300222, -32832, 45558, 46048, 163020, -235653, 9668, 322777, 281093, -167433, -200832, -253039, 133765, 188245, 333225, 255553, 496487, 471136, 365031, 523750, 560039, 530744, 385044, 656456, 456998, 287705, 218877, 381123, 120157, -318517, -236440, -72479, -222370, -176992, 332106, 484256, 124440, -166526]
-547.7b36679H7260D92934E20779A70248a17180F3170B22384A10077b14290B98044
-560.8H7659a5725b01141e64475h90985c95407d867A18121h492C83240E27561E52322
-575.2E46531E11452A18857a38741F1059e7166G1385a3641D01650A009458A174593
-588.4A014193D64548e7771B63181F77817F37585D52366D83711B46588D41053A63863
-601.5E2881A61274g2990i7753I2922e4456a58167b39110d24946c84047d03890a01404
-615.9e74040e93138a05488H7326b53669a123980i90326c16875A99013c6516e9077
-629.1a60773c03861c31100a80294a62697D55481d5727c16375a21952B4004A6478c93401
-643.4f93995i23932h36022b74396A84947H681B96139C28463a88690d9309D46822B11100
$$ y = [-236679, 87260, 492934, 520779, 170248, -117180, 63170, 222384, 110077, -214290, 298044, 87659, -15725, -201141, -564475, -890985, -395407, -4867, 118121, -8492, 383240, 527561, 552322, 546531, 511452, 118857, -138741, 61059, -57166, 71385, -13641, 401650, 1009458, 1174593, 1014193, 464548, -57771, 263181, 677817, 637585, 452366, 483711, 246588, 441053, 163863, 52881, 161274, -72990, -97753, 92922, -54456, -158167, -239110, -424946, -384047, -403890, -101404, -574040, -593138, -105488, 87326, -253669, -1123980, -990326, -316875, 199013, -36516, -59077, -160773, -303861, -331100, -180294, -162697, 455481, -45727, -316375, -121952, 24004, 16478, -393401, -693995, -923932, -836022, -274396, 184947, 8681, 296139, 328463, -188690, -49309, 446822, 211100]
-657.8A87909G08845I45575E37044D81781C93395H16588F82942H09659H53835F32540
-670.9C93782B25247C77848H95923A119333E14834B77796C34603B32268b04780d04497
-684.1f12989e09740a45346C61546B63525a12244F5795B29984a2481b57562b25597
-697.3h2113d7935c80660f57657a8573A92698h2818a75680h19123e27459a16611G6988
-711.6C40913C75860C02392A17406C05333C17093B37689A65077A25549C05514D09825
-724.8B94076C71513A08747C16138C06759B83166B83180A23801C9984B83155F68402
-738C62187E9614d19144d36953e92673d74960b65571b21799H4766C07973F3448C31315
-752.3A04951F2855c43197c83701f08036c45258c20581c52626c02040E6732D55212
$$ y = [187909, 708845, 945575, 537044, 481781, 393395, 816588, 682942, 809659, 853835, 632540, 393782, 225247, 377848, 895923, 1119333, 514834, 277796, 334603, 232268, -204780, -404497, -612989, -509740, -145346, 361546, 263525, -112244, 65795, 229984, -12481, -257562, -225597, -82113, -47935, -380660, -657657, -18573, 192698, -82818, -175680, -819123, -527459, -116611, 76988, 340913, 375860, 302392, 117406, 305333, 317093, 237689, 165077, 125549, 305514, 409825, 294076, 371513, 108747, 316138, 306759, 283166, 283180, 123801, 39984, 283155, 668402, 362187, 59614, -419144, -436953, -592673, -474960, -265571, -221799, 84766, 307973, 63448, 331315, 104951, 62855, -343197, -383701, -608036, -345258, -320581, -352626, -302040, 56732, 455212]
-765.5A089487H22589E55911A80088C908b5293a92774B4544B09811B80460B81083A247
-779.8i3966B13599D09630a606d71928a39443A69724D5432B754C6345b64777b764b88781
-795.4a71694A18465D1725a25069b38334b31404e05050d14315d51499e13736c91158
-808.6d92672g31429f88193d00265a40674D54546D21343C07026B32101A71890I5419
-821.7C10349a85090D1249c5393B56691C33136A39664A96445A03410g9421c10499f28104
-836.1e63072d43171b20040A93603D93626E58376E83435B07609F4034A60207E5462
-849.2B10525A50819b22401b3278A81036D97035E36542B34913D70620G46541F45585
-862.4A33294a64342i5816i2603B90A01928a64661f74690h00117b44455B7321C81901
$$ y = [1089487, 822589, 555911, 180088, 3908, -25293, -192774, 24544, 209811, 280460, 281083, 1247, -93966, 213599, 409630, -1606, -471928, -139443, 169724, 45432, 2754, 36345, -264777, -2764, -288781, -171694, 118465, 41725, -125069, -238334, -231404, -505050, -414315, -451499, -513736, -391158, -492672, -731429, -688193, -400265, -140674, 454546, 421343, 307026, 232101, 171890, 95419, 310349, -185090, 41249, -35393, 256691, 333136, 139664, 196445, 103410, -79421, -310499, -628104, -563072, -443171, -220040, 193603, 493626, 558376, 583435, 207609, 64034, 160207, 55462, 210525, 150819, -222401, -23278, 181036, 497035, 536542, 234913, 470620, 746541, 645585, 133294, -164342, -95816, -92603, 290, 101928, -164661, -674690, -800117, -244455, 27321, 381901]
-876.8E65833C39870A90631B13783b05667d63890d89503h9228G8158b98447a09932
-889.9B57516A75064A63731D83159F37948H11456D02329E39216G52118C14611b01060
-903.1a60099c98586d08564d33873c55309e100C69076B17798h1657b26985a58413B48134
-917.5A47493A19892D2344B89523D10967f3130A71857A42313D31036D30169G20491
-930.6D61141b32897c97870c15328a48684A51876B38681A57124a74499b15436C0723
-943.8B2188G9748A11646C77144F36238B83783B75068E1291F3203C93225D37405e1129
-958.1a61051c59135c44047h3740e81181e72265a22751c90907d73471b64948a23681
-971.3d8629g14637i44788g51557c70495c29126d56320d26693F6019I6041B98962G6507
$$ y = [565833, 339870, 190631, 213783, -205667, -463890, -489503, -89228, 78158, -298447, -109932, 257516, 175064, 163731, 483159, 637948, 811456, 402329, 539216, 752118, 314611, -201060, -160099, -398586, -408564, -433873, -355309, -5100, 369076, 217798, -81657, -226985, -158413, 248134, 147493, 119892, 42344, 289523, 410967, -63130, 171857, 142313, 431036, 430169, 720491, 461141, -232897, -397870, -315328, -148684, 151876, 238681, 157124, -174499, -215436, 30723, 22188, 79748, 111646, 377144, 636238, 283783, 275068, 51291, 63203, 393225, 437405, -51129, -161051, -359135, -344047, -83740, -581181, -572265, -122751, -390907, -473471, -264948, -123681, -48629, -714637, -944788, -751557, -370495, -329126, -456320, -426693, 66019, 96041, 298962, 76507]
-985.7A46774E20819E90731B92657A31958A20826A7678A91854G8470D22098G87698
-998.8D31703a6187A75321B7705b21669a55585c15248h5384B31150G070c93769c78906
-1013.2e08490c79172c71164a34871A38029E10939A12522A11165A30192A73509B37895
-1026.4A78503A29692A60824E61490D18403a45250f33649h95969h31833f90107e25360
-1039.5c91562A11871D50021F48875F16079H06206H28244H71955E60759D08858B64941
-1052.7B11757B65039b51334d01865A19171D9023A16683a36600f25056f77545c07357
-1065.8B29891E82807b55878g01382d62360C2024A79814c191h967I9115e238b34245
-1080.2b42941a15642A87289C42908E43050A02870c72414f36556f53137c21171c79721
$$ y = [146774, 520819, 590731, 292657, 131958, 120826, 17678, 191854, 78470, 422098, 787698, 431703, -16187, 175321, 27705, -221669, -155585, -315248, -85384, 231150, 7070, -393769, -378906, -508490, -379172, -371164, -134871, 138029, 510939, 112522, 111165, 130192, 173509, 237895, 178503, 129692, 160824, 561490, 418403, -145250, -633649, -895969, -831833, -690107, -525360, -391562, 111871, 450021, 648875, 616079, 806206, 828244, 871955, 560759, 408858, 264941, 211757, 265039, -251334, -401865, 119171, 49023, 116683, -136600, -625056, -677545, -307357, 229891, 582807, -255878, -701382, -462360, 32024, 179814, -3191, -8967, 99115, -5238, -234245, -242941, -115642, 187289, 342908, 543050, 102870, -372414, -636556, -653137, -321171, -379721]
-1093.4e60983c69531f3931c92829d99497b00721d18290a82617a10188c24892A9558
-1106.5B8232A15999B10367E88929C89059E73769C91564a67580c43501c27200B6481
-1119.7A17126A10047F01604F15736C96684C03604F69588C70932B62005B47385e34781
-1132.9f49113d77294e35249c40423c99935e31886h04838e19544e65413e53163c82955
-1146b84930B69399A59391g124C41063D43401B00885A86804B74530A21557A71034H0725
-1160.4d3295A35068C83391A75493c70544a78112A53420d828a80910b96966b10112
-1173.5b24011a19622A75268a2873c84527b00172A16181A31649h5501d72569c83027
-1186.7H6410F5228A07896b40642a57539E6565A65891C48914D00722E41561A12973
$$ y = [-560983, -369531, -63931, -392829, -499497, -200721, -418290, -182617, -110188, -324892, 19558, 28232, 115999, 210367, 588929, 389059, 573769, 391564, -167580, -343501, -327200, 26481, 117126, 110047, 601604, 615736, 396684, 303604, 669588, 370932, 262005, 247385, -534781, -649113, -477294, -535249, -340423, -399935, -531886, -804838, -519544, -565413, -553163, -382955, -284930, 269399, 159391, -7124, 341063, 443401, 200885, 186804, 274530, 121557, 171034, 80725, -43295, 135068, 383391, 175493, -370544, -178112, 153420, -4828, -180910, -296966, -210112, -224011, -119622, 175268, -12873, -384527, -200172, 116181, 131649, -85501, -472569, -383027, 86410, 65228, 107896, -240642, -157539, 56565, 165891, 348914, 400722, 541561, 112973]
-1199.9c88653B03617G01144H1066b75040i1492a00802a93605H0192C32851H86558
-1213E79319D64265B72163H1157b00425e64247g07299e35278a73836B29460A85288
-1226.2a00005I0184B60579C46860a430f7188A4526C86746E72940B71983e9505C44597
-1240.6F85322E68379C27694a67432E5633A03397a32247e84611d83837E2405B12426
-1253.7B15562G9364B4213a52303a46495a18298a07929c61810d38429f11382g20993
-1266.9f91404c85516b64357c32749a31642B72914B13235A43060c91015g31928g58417
-1280.1c51343i0982B1120G0312B66378B33508G3242h4785c7758F7528D83931G98996
-1294.4E55057C00990E1028a89530g8297b63450d37925f74027b75100b08360f43493
$$ y = [-388653, 203617, 701144, 81066, -275040, -91492, -100802, -193605, 80192, 332851, 886558, 579319, 464265, 272163, 81157, -200425, -564247, -707299, -535278, -173836, 229460, 185288, -100005, 90184, 260579, 346860, -1430, -67188, 14526, 386746, 572940, 271983, -59505, 344597, 685322, 568379, 327694, -167432, 55633, 103397, -132247, -584611, -483837, 52405, 212426, 215562, 79364, 24213, -152303, -146495, -118298, -107929, -361810, -438429, -611382, -720993, -691404, -385516, -264357, -332749, -131642, 272914, 213235, 143060, -391015, -731928, -758417, -351343, -90982, 21120, 70312, 266378, 233508, 73242, -84785, -37758, 67528, 483931, 798996, 555057, 300990, 51028, -189530, -78297, -263450, -437925, -674027, -275100, -208360, -643493]
-1307.6g84606d94796g89723d89454g21423h90881c56581d5975a40308B26350B31802
-1320.7B09458A20913F1107B86558E89531F40046G46505F04851A92690C24071D28934
-1333.9C84728B90300D03637A98136b19696b96535e34600d38511a93718d6914A42339
-1347.1A80639A93744d1516a2309g1710c97699f14328e07686d35108e75944c07949
-1360.2b34950F7538E19721A033568D43306A58320a63958g54861g49452f01963h13536
-1373.4f51387c15500d37421e73233c47174c75826a93825d19917e23506A96527F10050
-1386.6F43599D17309f4786e4683a10084a3760C21962D18536D61271B7835b20435d31218
-1400.9b31368g8283a41753E753A57967D02679A23898d52703e11146b26795D84136
$$ y = [-784606, -494796, -789723, -489454, -721423, -890881, -356581, -45975, -140308, 226350, 231802, 209458, 120913, 61107, 286558, 589531, 640046, 746505, 604851, 192690, 324071, 428934, 384728, 290300, 403637, 198136, -219696, -296535, -534600, -438511, -193718, -46914, 142339, 180639, 193744, -41516, -12309, -71710, -397699, -614328, -507686, -435108, -575944, -307949, -234950, 67538, 519721, 1033568, 443306, 158320, -163958, -754861, -749452, -601963, -813536, -651387, -315500, -437421, -573233, -347174, -375826, -193825, -419917, -523506, 196527, 610050, 643599, 417309, -64786, -54683, -110084, -13760, 321962, 418536, 461271, 27835, -220435, -431218, -231368, -78283, -141753, 5753, 157967, 402679, 123898, -452703, -511146, -226795, 484136]
-1414.1d5084d69582b05511a60586a71466c04510d67791d78831g0076A7068a31893
-1427.2d0459B1083B7898a27106B02517A47559A38402F6100b51880a54130a42168A2167
-1441.6B86922A52102I1418A55188A09401d704B03426A45788a36209a05369A44566
-1454.8A67862A20889b72461c36162d68475H4722B53149B2527i6596a78566I6053C20266
-1469.1D07371D64804B71082a29752b61610A8215A09095g9082h3223a92737b5567H8059
-1483.5C2332g4924c58993f7101C7888d51647e68345c56928d76568c13831c42067c06359
-1497.9a39941e7888b7421a02461
$$ y = [-45084, -469582, -205511, -160586, -171466, -304510, -467791, -478831, -70076, 17068, -131893, -40459, 21083, 27898, -127106, 202517, 147559, 138402, 66100, -251880, -154130, -142168, 12167, 286922, 152102, 91418, 155188, 109401, -4704, 203426, 145788, -136209, -105369, 144566, 167862, 120889, -272461, -336162, -468475, 84722, 253149, 22527, -96596, -178566, 96053, 320266, 407371, 464804, 271082, -129752, -261610, 18215, 109095, -79082, -83223, -192737, -25567, 88059, 32332, -74924, -358993, -67101, 37888, -451647, -568345, -356928, -476568, -313831, -342067, -306359, -139941, -57888, -27421, -102461]
##END=$$ End of the data block
