##TITLE= N,N-diethylaniline
##JCAMP-DX= 5.01
##DATA TYPE= INFRARED SPECTRUM
##DATA CLASS= XYDATA
##ORIGIN= Dept of Chemistry, UWI, JAMAICA
##OWNER= public domain
##LONGDATE= 1999/10/22 13:54:00
##SPECTROMETERDATASYSTEM= PERKIN-ELMER 1000 FT-IR
##XUNITS= 1/CM
##YUNITS= TRANSMITTANCE
##XFACTOR= 3.7E-3
##YFACTOR= 9.63982466E-7
##FIRSTX= 500
##FIRSTY= 0.00976793
##LASTX= 4200
##NPOINTS= 7401
##XYDATA= (X++(Y..Y))
135135 10133 10196 10354 10575 10859 11175 11490 11837 12122 12374 12564 12658 12627 12469 12216 11869 11459 11048 10701 10417 10291 10354
138108 10606 11048 11648 12311 12974 13605 14205 14710 15152 15531 15878 16131 16320 16383 16320 16194 15973 15752 15594 15531 15720 16162
141081 16920 17961 19161 20424 21592 22539 23328 24022 24748 25664 26895 28410 30115 31851 33555 35165 36617
143378 38006 39332 40595 41794 42836 43657 44320 44825 45267 45740 46340 47097 48076 49244 50633 52180 53821 55557
145811 57357 59187 61050 63039 65154 67395 69731 72067 74371 76549 78601 80495 82326 84188 86114 88134
147973 90281 92553 94984 97509 100161 102844 105496 108021 110389 112598 114650 116670 118659 120742 122826 124941
150135 126930 128792 130528 132233 134032 136084 138451 141103 144039 147069 150068 152940 155655 158275 160864 163547
152297 166419 169450 172638 175921 179141 182266 185202 187979 190599 193125 195619 198081 200638 203258 206004 208877
154459 211844 214937 218031 221156 224250 227311 230342 233341 236340 239338 242369 245399 248366 251271 254112 256953
156622 259825 262729 265728 268822 271978 275198 278386 281606 284731 287825 290855 293854 296916 300104 303450 307049
158784 310868 314814 318792 322674 326399 329903 333218 336469 339720 343098 346602 350200 353894 357555 361217 364784
160946 368257 371634 374886 378042 381136 384135 387133 390195 393415 396793 400391 404116 407967 411850 415638 419331
163108 422867 426213 429401 432432 435367 438240 441081 443985 446952 450014 453108 456296 459516 462767 466050 469333
165270 472553 475646 478614 481328 483759 485937 487926 489820 491745 493860 496291 499132 502383 506045 509959 514000
167432 518040 521986 525806 529467 533003 536507 540042 543546 547113 550617 554058 557436 560687 563844 566969 570094
169595 573314 576660 580069 583604 587140 590644 594053 597399 600587 603681 606680 609584 612425 615203 618012 620790
171757 623568 626346 629029 631680 634206 636636 639004 641340 643644 645917 648158 650305 652388 654408 656429 658480
173919 660627 662868 665204 667540 669781 671865 673790 675558 677199 678778 680419 682155 684018 685975 687995 690047
176081 692130 694214 696297 698381 700432 702421 704315 706020 707535 708798 709808 710534 711039 711355 711481 711481 711386 711260
178514 711102 710913 710660 710313 709839 709145 708040 706304 703621 699706 694340 687522 679693 671486 663910 657849 653935
180811 652420 653019 655071 657723 660185 661858 662521 662174 660974 659175 656965 654440 651599 648411 644812 640740 636068
183108 630702 624483 617349 609173 599861 589286 577291 563780 548565 531519 512548 491619 468733 444080
185000 417848 390385 362070 333375 304839 277061 250734 226428 204741 186180 171091 159727 152151
186757 148426 148521 152467 160264 171944 187443 206762 229616 255721 284510 315382 347580 380378 413081
188649 445121 476057 505540 533413 559582 583983 606711 627829 647400 665488 682219 697655 711860
190405 724928 736892 747846 757852 767007 775309 782885 789703 795827 801319 806212 810632 814641 818302 821680
192432 824774 827615 830171 832444 834433 836138 837621 838852 839862 840620 841062 841157 840873 840241 839326 838221 837085 835980
194865 834970 833959 832918 831655 830045 827993 825436 822343 818776 814798 810442 805770 800751 795353 789545 783200
197027 776224 768522 759999 750560 740080 728495 715711 701664 686196 669245 650747 630607 608763 585277
198919 560182 533697 506171 478140 450235 423056 397266 373244 351147 330882 312036 294138 276619
200676 259068 241232 223176 205120 187443 170649 155150 141292 129265 119164 110925 104391 99372 95773
202568 93406 92269 92332 93658 96310 100382 106096 113577 123015 134726 148837 165630 185202 207645 232836
204595 260614 290634 322453 355535 389312 423246 456801 489599 521229 551438 580069 606995 632185
206351 655639 677484 697781 716658 734209 750529 765681 779759 792796 804887 816093 826447 836106
208108 845071 853436 861265 868588 875470 881878 887875 893494 898766 903659 908236 912529 916506 920263 923830 927239
210270 930585 933899 937119 940307 943369 946274 948957 951419 953660 955712 957543 959247 960826 962341 963761 965182
212432 966508 967802 969002 970138 971211 972221 973200 974147 974999 975788 976451 977051 977525 977935 978282 978566 978850 979103 979355
215000 979576 979766 979924 980018 980050 980018 979829 979513 979040 978377 977556 976609 975567 974431 973231 971969 970643 969223 967770
217568 966255 964772 963383 962152 961110 960289 959721 959405 959374 959626 960131 960889 961867 962972 964140 965371 966602 967897
220000 969191 970611 972095 973673 975346 977083 978850 980587 982323 983996 985637 987184 988668 990025 991256 992392
222162 993403 994381 995328 996338 997348 998390 999369 1000284 1001042 1001641 1002115 1002525 1002936 1003409 1003977 1004577 1005177 1005745 1006187
224730 1006534 1006755 1006882 1006945 1006976 1006976 1006945 1006913 1006913 1006882 1006850 1006755 1006629 1006408 1006092 1005714 1005303 1004861 1004419 1003977 1003472 1002873 1002147 1001200
227973 999968 998485 996717 994697 992456 990057 987500 984785 981912 978724 975189 971211 966729 961741 956280 950409
230135 944159 937530 930585 923230 915401 907068 898198 888759 878816 868493 857887 847217 836611 826257 816219
232162 806686 797721 789419 781874 775182 769406 764671 761135 758831 757884 758326 760125 763313 767733 773257 779791
234324 787178 795290 803971 813094 822532 832160 841820 851416 860854 870040 879005 887654 896019 904069 911708 918968
236486 925787 932132 938035 943464 948452 953060 957290 961236 964866 968244 971337 974147 976735 979103 981249 983270
238649 985195 987026 988794 990530 992140 993687 995107 996433 997601 998643 999558 1000379 1001136 1001768 1002399 1002936 1003472
240946 1003946 1004388 1004767 1005082 1005335 1005524 1005682 1005777 1005840 1005871 1005903 1005903 1005871 1005808 1005745 1005650 1005524 1005335 1005114 1004798 1004419 1003977 1003409
244054 1002809 1002115 1001389 1000663 999937 999242 998611 998011 997475 996970 996496 996023 995549 995012 994444 993781 993055 992235 991319 990277
246757 989173 987973 986710 985448 984185 982922 981660 980397 979103 977714 976230 974652 972916 971022 969002 966792
248919 964456 961962 959342 956627 953850 951009 948104 945074 941886 938508 934878 930964 926702 922125 917232 911992
251081 906436 900533 894252 887654 880615 873102 865053 856340 846870 836548 825279 812999 799646 785189 769563
253108 752770 734714 715458 694971 673285 650431 626566 601818 576470 550901 525553 501089 478235
254865 457780 440639 427633 419552 416932 420152 429306 444080 463967 488115 515547 545093 575681 606301
256757 636131 664478 690962 715363 737618 757758 775845 792039 806433 819155 830424 840336 849048
258514 856782 863664 869882 875564 880836 885792 890527 895009 899302 903374 907162 910635 913728 916443 918747 920641
260676 922157 923325 924145 924714 925092 925282 925345 925313 925155 924934 924619 924177 923609 922914 922094 921083 919915 918495 916822 914833
263378 912497 909719 906468 902712 898355 893399 887781 881562 874744 867483 859907 852173 844408 836643 828814 820701
265541 811957 802140 790713 777203 761040 741848 719309 693172 663531 630702 595347 558540 521828
267297 487137 456580 432368 416522 410461 414944 429906 454339 486600 524417 565422 607311 648095 686322
269189 721077 751918 778844 802014 821901 838884 853404 865905 876669 886044 894189 901323 907541 913002
271081 917737 921873 925471 928533 931122 933331 935131 936583 937751 938666 939329 939834 940118 940276 940213 940023 939645 939108
273514 938382 937498 936393 935131 933615 931848 929827 927523 924934 922030 918842 915307 911487 907352 902933 898134
275676 892957 887339 881152 874333 866820 858550 849585 839831 829382 818208 806275 793554 779980 765554 750150
277703 733830 716531 698412 679630 660438 641340 622905 605890 591086 579406 571672 568515 570378 577323
279595 589034 604912 624041 645380 667887 690521 712459 733104 751949 768806 783516 796143 806717
281351 815430 822343 827678 831592 834149 835506 835759 835001 833265 830613 827078 822690 817482 811389 804445 796616
283514 787841 778118 767417 755800 743237 729789 715521 700496 684775 668455 651694 634648 617475
285270 600429 583762 567789 552795 539064 526911 516588 508318 502225 498437 497049 497996 501247 506676 514126
287297 523344 534139 546229 559361 573250 587645 602355 617096 631743 646138 660153 673696 686669
289054 699044 710786 721929 732409 742258 751476 760030 767954 775245 781969 788125 793775 798952 803750 808201
291081 812273 816061 819533 822722 825594 828246 830645 832823 834875 836800 838663 840462 842230 844029 845765 847501
293243 849175 850753 852205 853531 854699 855677 856530 857192 857729 858139 858424 858613 858676 858613 858455 858171 857792 857287 856687 855961
295946 855172 854288 853404 852521 851637 850721 849806 848859 847817 846681 845450 844124 842767 841346 839862 838316 836737 835033
298378 833265 831371 829351 827204 824963 822595 820133 817576 814925 812178 809306 806307 803182 799867 796395 792733
300541 788914 784936 780738 776350 771742 766943 761893 756621 751129 745478 739670 733672 727548 721266 714795 708135
302703 701285 694245 686985 679504 671865 664068 656176 648253 640393 632659 625146 617917 611067 604596 598598 593106
304865 588150 583762 579974 576786 574229 572272 570851 569936 569431 569336 569557 570094 570914 572019 573408 575018 576849 578869
307297 581047 583289 585625 587929 590265 592538 594779 596957 599040 601029 602860 604565 606080 607406 608447 609236
309459 609710 609836 609615 608984 607942 606427 604438 601881 598693 594842 590265 584899 578711 571672 563780 554973 545282
311757 534708 523407 511474 499195 486884 474889 463525 453076 443669 435336 427949 421320 415165 409230
313649 403264 397077 390574 383756 376685 369551 362669 356356 350958 346918 344582 344234 346160 350485 357240 366426
315811 377821 391206 406231 422457 439471 456864 474163 491051 507245 522523 536696 549733 561571
317568 572114 581395 589413 596199 601755 606143 609457 611730 612961 613214 612488 610688 607847 603807 598535 591906
319730 583825 574166 562833 549765 534960 518451 500300 480729 460021 438524 416775 395372 375075
321486 356640 340794 328293 319707 315414 315603 320181 328956 341393 356893 374728 394110 414344 434704
323378 454623 473594 491367 507655 522333 535434 546955 556930 565517 572840 578964 584078 588245 591591
325270 594179 596073 597304 597967 598062 597651 596768 595410 593674 591496 588907 585877 582468 578617 574324 569589 564412
327568 558730 552543 545851 538622 530825 522460 513526 504056 494081 483664 472837 461694 450204 438524 426623
329595 414628 402601 390606 378768 367120 355756 344739 334196 324126 314720 305976 298052 291013 284952
331486 279870 275893 272988 271189 270589 271126 272862 275829 279996 285394 292055 299883 308911 319076 330250 342435
333649 355441 369235 383693 398687 414123 429875 445847 461946 478045 494050 509865 525395 540642
335405 555447 569841 583699 596989 609741 621926 633511 644559 655071 665046 674485 683450 691941 699991
337297 707598 714795 721645 728148 734303 740143 745636 750781 755611 760125 764323 768238 771868 775245 778402 781338
339459 784084 786609 788945 791092 793081 794911 796584 798194 799710 801130 802487 803719 804855 805865 806749 807538
341622 808233 808864 809527 810158 810853 811547 812273 813031 813820 814609 815430 816282 817103 817987 818839 819723 820575 821396 822185 822911
344324 823637 824268 824900 825436 825941 826383 826762 827109 827457 827772 828120 828467 828782 829035 829193 829256 829224 829098 828846 828530 828088
347162 827583 827015 826352 825626 824868 824047 823164 822280 821301 820228 819092 817829 816503 815051 813536 811989 810348 808675
349595 806907 805044 803056 800941 798699 796300 793807 791218 788503 785694 782821 779886 776824 773699 770479 767133
351757 763692 760157 756558 752865 749171 745447 741753 738091 734524 731021 727548 724139 720730 717289 713785 710155
353919 706430 702547 698475 694214 689731 685028 680104 674958 669560 663941 658038 651883 645443 638720 631712 624483
356081 617033 609331 601471 593422 585151 576723 568073 559203 550144 540800 531204 521323 511159 500679 489883
358108 478771 467344 455633 443669 431390 418889 406168 393194 380063 366741 353262 339689 326052
359865 312415 298778 285236 271820 258594 245557 232804 220367 208245 196534 185233 174374 164052
361622 154235 145017 136431 128539 121374 114934 109252 104296 100035 96405 93374 90880 88923 87440 86429 85830
363784 85609 85798 86303 87187 88418 89997 91985 94353 97131 100382 104075 108274 113009 118375 124373 131065 138483
366081 146659 155560 165220 175605 186654 198333 210644 223523 237002 251018 265539 280533 295874 311563
367973 327504 343571 359702 375864 391900 407778 423435 438745 453708 468291 482433 496133 509391
369730 522270 534708 546798 558446 569715 580542 590928 600871 610341 619432 628176 636605 644780 652735
371622 660469 668045 675400 682566 689510 696203 702674 708892 714890 720698 726254 731652 736892 741911 746772 751476
373784 755990 760314 764450 768364 772120 775656 779097 782411 785726 789008 792260 795480 798636 801667 804508 807159
375946 809622 811863 813946 815809 817513 819060 820512 821838 823132 824332 825468 826510 827457 828246 828909 829414 829856
378243 830235 830550 830803 830961 830929 830708 830266 829540 828625 827551 826415 825184 823984 822753 821491 820165 818681 817040
380676 815209 813220 811105 808927 806717 804539 802487 800562 798794 797153 795669 794280 792923 791597 790240 788788
382838 787272 785631 783895 782095 780233 778371 776508 774614 772657 770605 768332 765775 762966 759841 756495 752896
385000 749140 745162 740932 736418 731494 726159 720351 714038 707282 700085 692446 684365 675810 666782 657155 646959
387162 636036 624388 611920 598535 584109 568642 552101 534550 516052 496764 476846 456454 435683
388919 414754 393857 373276 353420 334701 317624 302724 290382 280943 274598 271347 271063 273493 278165
390811 284668 292497 301146 310205 319297 328167 336564 344424 351684 358376 364563 370340 375833 381073 386186 391174
392973 396130 401149 406263 411566 417122 422962 428991 435146 441239 447173 452824 458127 463020 467471 471448 474952
395135 477951 480413 482370 483759 484706 485148 485179 484769 483885 482496 480602 478109 475047 471385 467123 462262 456801
397432 450835 444395 437577 430506 423277 415985 408693 401496 394394 387481 380789 374317 368130 362259 356735 351495
399595 346539 341898 337511 333407 329587 326084 322895 319960 317276 314783 312415 310142 307870 305565 303198 300672
401757 297989 295054 291865 288330 284479 280186 275482 270337 264718 258594 251965 244768 237034 228700 219767 210297
403919 200259 189779 178983 167998 156949 145964 135200 124751 114650 105022 95963 87503 79737 72698
405811 66479 61050 56410 52558 49402 46940 45109 43846 43025 42615 42457 42489 42678 42994 43467 44225 45298 46813
408243 48865 51611 55115 59503 64869 71278 78853 87661 97699 109031 121532 135137 149658 164873 180561
410270 196566 212696 228890 245115 261309 277502 293570 309479 325073 340289 355062 369330 383124
412027 396446 409419 422046 434420 446573 458537 470280 481865 493197 504309 515136 525711 535939
413784 545851 555478 564822 573945 582847 591559 600051 608258 616086 623410 630102 636068 641277 645822 649831 653430
415946 656839 660185 663563 666877 670097 673064 675653 677768 679378 680482 681177 681524 681587 681461 681145 680577 679756 678620
418378 677105 675274 673159 670886 668519 666214 663910 661669 659396 657028 654598 652072 649515 646990 644496 641971
420541 639288 636289 632880 628966 624672 620158 615708 611572 607974 604943 602481 600398 598504 596547 594337 591780
422703 588718 585183 581079 576376 571041 565012 558225 550680 542410 533382 523691 513305 502225 490388 477667
424730 463998 449320 433663 417343 400802 384640 369709 356766 346602 339815 336721 337384 341393 348243
426622 357082 366962 377064 386597 394867 401465 406105 408693 409199 407715 404274 399034 392121 383661 373749 362543
428784 350169 336721 322327 307175 291360 275135 258626 242022 225512 209287 193472 178194 163578
430541 149658 136589 124404 113166 102907 93690 85451 78222 71909 66511 61934 58177 55115 52716 50885
432568 49591 48739 48265 48171 48455 49118 50191 51738 53758 56346 59535 63417 68058 73519 79832 87061 95173 104170
435000 113987 124657 136147 148395 161400 175163 189589 204647 220304 236497 253259 270621 288519
436757 307017 325957 345244 364690 384071 403232 422046 440386 458222 475583 492440 508854 524796
438514 540295 555384 570062 584267 598030 611225 623883 635973 647558 658638 669308 679630 689668
440270 699422 708829 717889 726601 734872 742763 750213 757252 763881 770100 775908 781401 786609 791565 796395 801130
442432 805802 810379 814862 819249 823448 827457 831276 834938 838442 841756 844881 847786 850374 852647 854541 856151
444595 857571 858897 860286 861896 863727 865810 868051 870419 872786 875059 877206 879163 880867 882256 883361 884150
446757 884687 885097 885508 886013 886739 887654 888696 889801 890843 891758 892452 892926 893210 893305 893178 892863 892389 891821 891158 890495
449459 889959 889485 889169 888917 888633 888254 887654 886834 885729 884403 882951 881467 880015 878721 877585 876606 875754 874964
451892 874144 873197 872060 870703 869156 867452 865779 864200 862843 861706 860728 859844 858960 858045 857098 856182 855425 854888
454324 854572 854509 854636 854951 855488 856372 857824 859970 862874 866473 870671 875154 879731 884150 888317 892200 895798
456622 899176 902364 905426 908330 911077 913571 915749 917548 918905 919789 920357 920736 921115 921652 922441 923356 924303 925092
459054 925597 925881 926039 926323 926892 927933 929417 931185 933016 934720 936141 937245 938035 938666 939234 939866 940592 941412
461486 942296 943148 943938 944601 945137 945516 945832 946053 946242 946400 946431 946400 946210 945863 945358 944695 943874 942927 941886 940907 940023
464324 939424 939139 939171 939455 939802 940086 940150 939866 939203 938224 936930 935351 933552 931500 929164 926576 923703 920515 917043
466892 913350 909593 905931 902585 899776 897724 896493 896146 896588 897756 899523 901891 904858 908425 912592 917232
469054 922125 927018 931563 935541 938855 941539 943654 945358 946779 948041 949178 950125 950914 951482 951892 952208 952461
471351 952713 952997 953218 953344 953313 953060 952618 951956 951166 950283 949399 948546 947757 947094 946589 946305 946242 946368 946589 946873 947094
474189 947157 947063 946842 946526 946242 946084 946147 946368 946779 947284 947820 948294 948736 949178 949651 950283 951040 951987 953060 954197 955270
477027 956280 957132 957795 958332 958774 959184 959626 960068 960510 960857 961110 961173 961110 960984 960952 961078 961520 962309 963383 964645 966003
479865 967329 968560 969664 970643 971527 972316 973011 973673 974305 974936 975599 976293 977019 977746 978503 979229 979955 980650 981344 982070
482568 982828 983554 984280 984974 985574 986048 986363 986489 986458 986237 985858 985448 985006 984627 984343 984154 984059 983996 983933 983838 983680 983491
485541 983238 982986 982638 982228 981691 981028 980239 979355 978408 977493 976578 975694 974905 974147 973421 972695 971906 971085 970138 969096
488243 967991 966792 965561 964361 963193 962088 961015 960068 959216 958490 957890 957448 957164 957006 956943 956975 957069 957227 957385
490811 957574 957827 958079 958395 958742 959153 959563 960005 960447 960920 961426 961962 962467 962941 963383 963761 964077 964361 964677 965087
493514 965592 966161 966792 967392 967928 968370 968781 969254 969822 970517 971401 972379 973452 974526 975567 976546 977493 978377 979229
496081 980081 980871 981660 982417 983143 983901 984659 985385 986142 986837 987468 988036 988478 988762 988920 988983 989015 989110 989299 989646 990120
498919 990751 991414 992077 992740 993339 993939 994507 995076 995581 996023 996401 996717 996970 997222 997412 997601 997727 997822 997853 997822 997696
501757 997506 997254 996970 996654 996338 995991 995675 995391 995107 994886 994697 994507 994318 994065 993813 993466 993024 992519 991887 991161
504459 990309 989330 988320 987310 986363 985542 984880 984343 983933 983585 983238 982828 982354 981818 981218 980523 979797 979040 978187 977272
507162 976293 975252 974210 973137 972095 971053 970012 969002 967928 966855 965719 964519 963288 962057 960763 959532
509324 958300 957132 956028 954954 953881 952808 951735 950693 949714 948830 948136 947568 947157 946873 946621 946400 946116 945737
511757 945327 944853 944316 943780 943275 942738 942265 941823 941349 940876 940371 939802 939139 938382 937561 936646 935699 934689 933647 932574
514459 931406 930175 928880 927555 926197 924871 923577 922409 921304 920263 919316 918463 917643 916948 916285 915749 915244
516757 914833 914454 914107 913791 913539 913318 913129 913034 912939 912939 913002 913160 913444 913855 914423 915054 915749 916443 917138 917800 918526 919284
519730 920136 921115 922188 923325 924429 925471 926418 927239 927933 928565 929164 929764 930396 931058 931784 932605 933584 934657 935920
522297 937340 938887 940623 942454 944380 946400 948483 950535 952587 954607 956596 958553 960447 962278 964014 965624
524459 967139 968560 969885 971211 972537 973958 975473 977051 978661 980271 981818 983301 984659 985921 987089 988131
526622 989110 989962 990783 991509 992203 992866 993529 994160 994792 995360 995896 996370 996812 997222 997633 998011 998390 998769 999148 999527
529324 999874 1000221 1000568 1000915 1001263 1001610 1001957 1002336 1002715 1003094 1003504 1003851 1004135 1004388 1004546 1004672 1004767 1004861 1005019 1005240 1005524
532162 1005903 1006313 1006755 1007197 1007608 1007986 1008302 1008555 1008776 1008965 1009154 1009344 1009533 1009723 1009849 1009975 1010070 1010133 1010133 1010133 1010101 1010038
535135 1010007 1009943 1009880 1009817 1009754 1009723 1009754 1009786 1009849 1009912 1009943 1009943 1009912 1009849 1009754 1009659 1009596 1009533 1009470 1009375 1009249 1009060 1008870 1008649 1008491 1008397 1008365
538784 1008397 1008460 1008523 1008586 1008649 1008681 1008712 1008744 1008776 1008807 1008776 1008744 1008712 1008681 1008649 1008681 1008681 1008744 1008776 1008839 1008839 1008839 1008839 1008807 1008807 1008776 1008712 1008649 1008586 1008523 1008460
542973 1008397 1008365 1008365 1008428 1008523 1008649 1008807 1008965 1009060 1009123 1009091 1008965 1008744 1008428 1008113 1007797 1007513 1007292 1007134 1007039 1007008 1006945 1006882 1006787
546216 1006661 1006503 1006313 1006155 1006029 1005935 1005871 1005840 1005840 1005840 1005840 1005840 1005808 1005808 1005777 1005777 1005745 1005714 1005650 1005619 1005556 1005524 1005524 1005556 1005587 1005619 1005682 1005745 1005808 1005840
550270 1005840 1005808 1005714 1005587 1005398 1005177 1004956 1004703 1004482 1004261 1004072 1003883 1003725 1003567 1003441 1003283 1003157 1002999 1002873 1002746 1002620
553108 1002525 1002462 1002399 1002367 1002336 1002336 1002336 1002336 1002336 1002304 1002241 1002147 1002020 1001894 1001736 1001578 1001420 1001231 1001042 1000852 1000663 1000442 1000189 999937 999621
556486 999306 998927 998516 998106 997664 997222 996749 996275 995739 995139 994476 993750 992961 992140 991319 990530 989772 989046 988352 987657
559189 986963 986237 985448 984627 983712 982765 981754 980713 979640 978566 977525 976514 975536 974620 973768 972916 972064 971211
561622 970359 969538 968717 967960 967297 966729 966255 965845 965529 965277 965087 964961 964961 965024 965214 965466 965845 966287 966792 967392 968055
564459 968812 969664 970611 971590 972663 973768 974936 976136 977398 978693 979987 981249 982481 983680 984785 985858 986837
566757 987815 988731 989646 990562 991445 992329 993150 993971 994728 995423 996054 996622 997159 997664 998106 998580 999021 999463 999874 1000253
569459 1000600 1000915 1001136 1001326 1001484 1001578 1001705 1001799 1001894 1001989 1002115 1002241 1002336 1002431 1002525 1002588 1002652 1002715 1002778 1002873 1002999 1003188 1003409 1003662
572703 1003946 1004230 1004514 1004767 1005019 1005240 1005461 1005682 1005871 1006029 1006187 1006282 1006376 1006440 1006471 1006503 1006534 1006503 1006440 1006345 1006250 1006155 1006061 1005966
575946 1005903 1005808 1005714 1005587 1005429 1005240 1005051 1004830 1004640 1004419 1004230 1004041 1003883 1003725 1003567 1003441 1003314 1003188 1003062 1002999 1002904
578784 1002809 1002746 1002652 1002588 1002494 1002431 1002399 1002399 1002431 1002494 1002525 1002557 1002557 1002525 1002431 1002336 1002210 1002083 1001989 1001894 1001862 1001831 1001862 1001926 1002020 1002115 1002210 1002304 1002367
582703 1002367 1002367 1002336 1002273 1002241 1002210 1002178 1002178 1002178 1002147 1002115 1002083 1002020 1001926 1001862 1001768 1001705 1001641 1001641 1001673 1001736 1001831 1001894 1001926 1001926 1001894 1001862 1001862 1001926 1002052 1002210
586892 1002399 1002620 1002778 1002936 1003062 1003157 1003188 1003220 1003220 1003220 1003188 1003188 1003157 1003157 1003188 1003220 1003220 1003188 1003157 1003062 1002936 1002778 1002652 1002557 1002431 1002336 1002241
590541 1002083 1001894 1001641 1001326 1001010 1000694 1000410 1000158 999937 999779 999653 999558 999527 999558 999621 999779 999968 1000253 1000600 1000979 1001357
593378 1001768 1002147 1002525 1002873 1003188 1003472 1003725 1003946 1004104 1004198 1004261 1004230 1004198 1004167 1004104 1004072 1004072 1004072 1004072 1004104 1004135 1004135 1004104 1004009 1003883 1003662
596892 1003409 1003157 1002873 1002620 1002431 1002241 1002083 1001926 1001799 1001641 1001452 1001294 1001136 1000979 1000852 1000726 1000600 1000410 1000221 999968
599595 999684 999337 999021 998674 998327 997980 997664 997380 997159 996970 996875 996812 996812 996812 996780 996749 996622 996465 996212 995928 995581 995202 994823
602703 994444 994065 993718 993371 992992 992582 992140 991603 990972 990309 989615 988889 988131 987373 986553 985700 984785 983775 982733 981565
605405 980366 979134 977872 976609 975378 974210 973137 972190 971337 970643 970075 969696 969443 969380 969475 969728 970138 970675 971306
607973 972032 972821 973673 974526 975441 976325 977240 978156 979071 979987 980839 981628 982354 983017 983585 984122 984595 985069 985542 986016
610676 986458 986868 987247 987594 987878 988131 988320 988447 988604 988699 988857 989015 989204 989425 989646 989899 990151 990341 990530 990625 990688
613514 990688 990625 990530 990404 990309 990183 990088 990025 989993 989993 989993 990057 990088 990120 990151 990151 990120 990057 989993 989899 989804 989709 989583 989425 989204 988920 988573 988099
617297 987594 987026 986426 985827 985290 984753 984280 983806 983364 982922 982481 981975 981502 980965 980366 979703 979008 978219 977367 976483
620000 975599 974715 973831 973011 972221 971432 970675 969917 969128 968339 967518 966666 965845 965024 964172 963351 962467 961520 960479 959279
622703 957922 956406 954765 952966 951072 949146 947189 945263 943369 941507 939645 937845 936078 934373 932700 931090
624865 929575 928154 926828 925629 924493 923356 922251 921020 919663 918116 916348 914360 912182 909846 907447 905016
627027 902712 900502 898482 896651 894946 893336 891790 890274 888759 887212 885602 883993 882288 880520 878721 876890
629189 875028 873197 871429 869756 868178 866789 865589 864547 863664 862843 862054 861170 860128 858865 857382 855772 854130
631486 852489 850974 849585 848322 847123 846018 845039 844250 843777 843682 843966 844692 845734 847091 848701 850563 852742 855267
633919 858203 861486 864958 868399 871492 873891 875312 875627 874807 873039 870450 867388 864042 860633 857224 853941
636081 850721 847628 844661 841820 839199 836737 834496 832444 830645 829067 827804 826888 826447 826447 826920 827835 829067 830550
638514 832192 833928 835759 837653 839705 841883 844282 846870 849648 852647 855835 859213 862748 866378 870072 873797
640676 877521 881278 885003 888759 892516 896304 900060 903785 907415 910982 914423 917769 921083 924398 927744 931153
642838 934594 938003 941412 944695 947852 950882 953755 956564 959247 961836 964361 966729 968938 970990 972821 974494
645000 976009 977367 978598 979734 980776 981691 982544 983270 983901 984501 985037 985511 985984 986426 986837 987247 987594 987942 988289
647568 988573 988857 989141 989425 989678 989930 990151 990372 990562 990751 990909 991067 991161 991256 991319 991319 991351 991382 991414 991477 991540 991603 991635 991635
650811 991603 991572 991540 991477 991445 991414 991382 991351 991288 991193 991098 991004 990846 990719 990530 990372 990183 989993 989836 989709 989615 989520 989425 989330 989173
654189 989015 988825 988604 988447 988289 988163 988099 988068 988005 987973 987910 987847 987752 987626 987500 987342 987216 987089 986995 986900 986837 986774 986710 986616
657432 986521 986395 986269 986142 986016 985890 985795 985669 985574 985448 985322 985132 984943 984690 984406 984090 983775 983491 983175 982891 982638
660270 982354 982039 981754 981439 981123 980807 980492 980208 979924 979640 979324 979008 978693 978377 978061 977777 977493 977177 976893 976578
662973 976262 975946 975599 975283 974968 974620 974273 973863 973389 972884 972348 971811 971337 970927 970580 970264 969980 969696 969380 969065
665676 968749 968433 968181 967928 967770 967676 967613 967613 967644 967676 967739 967802 967834 967897 967991 968118 968307 968528 968812 969159 969475 969854 970201 970517
668919 970832 971148 971432 971748 972032 972348 972600 972884 973105 973295 973452 973547 973610 973642 973673 973737 973768 973831 973894 973926 973894 973831 973737 973547
672162 973326 973105 972884 972663 972474 972284 972095 971843 971495 971117 970643 970106 969570 969033 968528 968055 967581 967171 966729 966287
674865 965845 965403 964961 964551 964140 963730 963320 962878 962404 961931 961394 960889 960415 960005 959658 959374 959184 959026 958900 958774
677568 958711 958679 958679 958742 958837 958963 959121 959279 959437 959563 959658 959753 959784 959816 959847 959879 959910 959973 960037 960100 960163 960226 960258 960258 960226 960131 960037 959910
681351 959753 959595 959374 959121 958837 958553 958300 958048 957827 957638 957448 957259 957038 956785 956501 956185 955807 955428 954986 954544
684054 954102 953692 953313 952934 952618 952334 952050 951766 951514 951261 951009 950788 950567 950346 950156 949998 949872 949746 949714 949683 949714
686892 949809 949904 950030 950156 950314 950472 950630 950788 950977 951135 951324 951514 951671 951798 951924 952019 952082 952145 952208 952303 952429 952587
689865 952713 952871 952997 953060 953124 953124 953092 953060 953029 952966 952934 952871 952745 952587 952366 952082 951735 951324 950914 950503 950093 949714 949399 949146
693108 948957 948767 948641 948515 948389 948294 948168 948073 948010 948010 948041 948136 948294 948483 948704 948925 949146 949336 949525 949651 949746 949809 949872
696216 949872 949904 949872 949872 949841 949809 949809 949809 949809 949809 949809 949841 949872 949967 950062 950188 950377 950567 950724 950882 950945 950977 950914 950819 950693 950567 950409 950251
700000 950062 949841 949620 949367 949146 948957 948799 948641 948546 948420 948294 948168 947978 947726 947378 946968 946431 945800 945074 944316 943496
702838 942675 941886 941097 940307 939518 938729 937940 937151 936362 935572 934846 934120 933457 932795 932163 931563 930964 930396 929827 929291
705541 928786 928312 927933 927649 927460 927365 927397 927555 927775 928060 928407 928754 929070 929385 929669 929922 930238 930553 930932 931343 931784
708378 932258 932700 933079 933394 933710 933963 934247 934562 934910 935288 935667 936014 936330 936551 936709 936804 936835 936867 936867 936867 936867 936835 936772 936646
711622 936488 936235 935951 935604 935194 934752 934278 933805 933363 932984 932605 932321 932037 931784 931563 931279 930995 930680 930364 930048
714324 929796 929606 929480 929385 929354 929354 929385 929417 929480 929575 929669 929764 929890 930017 930111 930206 930269 930301 930301 930301 930269 930206 930143 930080 929985 929922 929827 929764 929669
718243 929575 929449 929291 929133 928912 928691 928470 928281 928123 927965 927839 927712 927618 927491 927334 927144 926923 926671 926355 926008 925661
721081 925313 925029 924777 924587 924398 924240 924082 923893 923703 923482 923293 923072 922851 922630 922409 922157 921936 921746 921652 921652 921746
723919 921904 922094 922251 922409 922472 922535 922567 922599 922662 922788 922914 923041 923167 923293 923388 923451 923482 923482 923482 923451 923451 923451 923482 923546 923640 923703 923767
727568 923830 923893 923956 924019 924082 924145 924177 924177 924114 924019 923924 923830 923735 923703 923703 923703 923735 923735 923703 923640 923577 923482 923419 923388 923388 923388 923451 923482 923482 923482 923451 923419 923356
732027 923325 923261 923198 923104 922977 922883 922756 922662 922567 922441 922314 922094 921841 921494 921115 920641 920168 919631 919095 918558 918021 917516
735000 917011 916538 916064 915559 915023 914423 913760 913065 912339 911645 910982 910351 909719 909120 908457 907731 906942 906026 905016 903911
737703 902806 901670 900533 899397 898292 897187 896083 894946 893778 892547 891284 889927 888475 886991 885413 883772
739865 882067 880331 878532 876701 874838 872944 870987 869030 866978 864863 862717 860507 858234 855898 853499 851069
742027 848606 846081 843493 840873 838189 835475 832665 829856 826952 824016 821049 817987 814893 811768 808611 805455
744189 802298 799110 795953 792765 789608 786420 783200 779980 776729 773446 770100 766722 763250 759715 756116 752391
746351 748603 744689 740680 736639 732504 728306 724076 719751 715332 710849 706209 701474 696581 691562 686385 681051
748514 675558 669876 664036 658070 651946 645696 639288 632754 626061 619243 612235 605101 597809 590423 582878 575271
750676 567600 559835 552069 544241 536444 528615 520787 512927 505098 497238 489378 481581 473879 466271 458790 451435
752838 444174 437040 430001 423056 416175 409388 402727 396161 389722 383409 377253 371255 365384 359670 354115 348685
755000 343445 338363 333439 328735 324221 319896 315793 311942 308280 304902 301746 298873 296285 294012 292086 290476
757162 289214 288330 287793 287572 287698 288140 288930 290034 291518 293380 295653 298305 301367 304839 308690 312889 317434
759459 322264 327378 332776 338458 344361 350516 356893 363427 370119 376906 383724 390511 397266 403927 410461 416869
761622 423088 429086 434862 440386 445595 450519 455065 459295 463177 466681 469806 472553 474857 476783 478298 479403
763784 480097 480413 480318 479845 478929 477635 475899 473784 471353 468575 465545 462262 458758 455033 451151 447047 442785
766081 438366 433789 429149 424414 419647 414912 410177 405505 400896 396382 391995 387765 383756 379999 376590 373497
768243 370750 368351 366268 364500 363017 361849 360965 360333 359986 359860 360018 360396 360996 361817 362859 364027 365352 366710
770676 368099 369425 370656 371760 372739 373528 374160 374601 374854 374886 374759 374381 373781 372960 371918 370656 369172 367467 365605
773243 363553 361375 359102 356735 354336 351842 349317 346728 344077 341362 338615 335869 333154 330503 327978 325578
775405 323337 321285 319360 317592 315951 314435 313046 311784 310647 309669 308817 308154 307680 307396 307301 307396 307680 308091
777838 308627 309258 310016 310868 311815 312857 313962 315130 316329 317561 318823 320086 321380 322643 323905 325137 326336
780135 327472 328546 329524 330440 331229 331923 332492 332997 333375 333691 333912 334101 334228 334322 334417 334512 334607 334796 335017 335301 335711
782973 336185 336785 337511 338331 339310 340383 341614 343003 344550 346223 347991 349916 351937 354020 356198 358439 360744
785270 363080 365416 367752 370024 372266 374444 376527 378579 380568 382493 384356 386186 387891 389469 390921 392247
787432 393447 394520 395530 396477 397361 398213 398971 399665 400265 400739 401117 401433 401654 401875 402064 402285 402475 402664 402854 403011
790135 403138 403264 403422 403548 403737 403895 404116 404306 404495 404653 404779 404874 404937 404969 405000 405032 405063 405126 405190 405316 405442 405600 405758
793243 405947 406137 406358 406610 406863 407147 407431 407715 408062 408409 408820 409262 409735 410240 410840 411471 412197 413018 413902 414912
795946 415985 417153 418384 419647 420941 422267 423624 425077 426592 428233 429938 431737 433663 435620 437672 439787
798108 441965 444143 446384 448688 450993 453360 455759 458158 460589 463051 465482 467944 470375 472805 475268 477698
800270 480129 482496 484864 487105 489283 491367 493355 495218 497017 498722 500331 501847 503236 504530 505698 506771
802432 507655 508444 509044 509454 509675 509707 509580 509265 508854 508349 507750 507150 506487 505761 505035 504214 503393 502573 501752 500963 500205
805270 499574 499037 498595 498280 498090 498027 498059 498248 498595 499069 499700 500521 501499 502636 503962 505414 506960 508633 510370
807838 512201 514126 516146 518293 520566 522933 525395 527952 530541 533161 535812 538496 541242 544051 546955 549954
810000 553048 556268 559677 563275 567095 571167 575460 579974 584646 589413 594211 599009 603712 608321 612772 617033
812162 621042 624736 628113 631112 633732 635942 637741 639193 640266 641024 641466 641561 641371 640803 639888 638562 636794 634616
814595 631964 628934 625462 621642 617412 612835 607911 602639 597020 591086 584867 578301 571420 564222 556804 549165
816757 541400 533603 525964 518577 511632 505287 499700 494965 491177 488399 486663 485937 486158 487294 489188 491745
818919 494776 498185 501784 505445 509107 512674 516146 519524 522838 526153 529467 532845 536317 539884 543546 547303
821081 551185 555100 559077 563086 567095 571072 574955 578775 582468 586035 589444 592664 595694 598504 601061 603397
823243 605480 607279 608826 610120 611130 611825 612172 612204 611888 611225 610183 608731 606932 604754 602134 599167 595852
825541 592190 588308 584172 579911 575555 571167 566779 562486 558288 554342 550680 547429 544683 542568 541179 540610
827703 540926 542157 544335 547429 551438 556299 561950 568263 575144 582436 590044 597872 605764 613656 621516 629218
829865 636763 644118 651157 657944 664383 670444 676158 681492 686448 691026 695256 699107 702642 705830 708703 711291
832027 713533 715490 717100 718425 719372 719972 720225 720130 719688 718931 717889 716563 714953 713091 711007 708671 706114 703400
834459 700527 697528 694435 691247 688027 684775 681650 678746 676158 674074 672654 671991 672212 673411 675558 678746
836622 682913 688058 694056 700843 708229 716058 724139 732315 740459 748445 756179 763597 770668 777360 783705 789608
838784 795069 800152 804792 809022 812904 816408 819597 822532 825152 827551 829761 831750 833612 835317 836895 838410
840946 839894 841346 842798 844282 845797 847344 848954 850627 852363 854162 856024 857950 859939 861991 864106 866315
843108 868556 870861 873165 875470 877742 879952 882067 884087 886044 887875 889675 891411 893147 894851 896525 898198
845270 899807 901354 902838 904227 905553 906784 907952 909025 910035 911014 911897 912718 913476 914202 914896 915559 916191 916822
847703 917453 918085 918716 919379 920010 920641 921241 921778 922283 922756 923198 923609 923987 924335 924650 924934 925187 925440 925724 926039
850405 926355 926671 927018 927302 927586 927807 927996 928154 928312 928533 928786 929101 929480 929859 930301 930711 931090 931406 931690 931879
853108 932037 932163 932226 932290 932321 932384 932447 932574 932700 932826 932984 933079 933142 933205 933268 933363 933489 933678 933868 934120 934373 934625 934846 935099
856351 935320 935509 935667 935793 935857 935920 935983 936046 936141 936235 936330 936425 936456 936425 936362 936235 936109 935951 935857 935762 935730 935730 935793 935857 935920 935951 935951
860000 935920 935888 935793 935730 935699 935699 935730 935793 935857 935920 935983 935983 935951 935920 935825 935730 935604 935478 935320 935194 935036 934910 934752 934594 934436 934278
863514 934120 933931 933710 933521 933331 933142 933016 932984 932952 932984 933047 933110 933205 933331 933457 933615 933805 933994 934152 934247 934373 934468 934625
866622 934846 935131 935478 935857 936267 936583 936898 937151 937403 937656 937908 938192 938477 938792 939076 939392 939676 939992 940244 940497
869324 940655 940781 940844 940939 941033 941191 941412 941633 941886 942138 942328 942486 942612 942675 942738 942833 942896 943022 943148 943243 943338 943338 943275 943148
872568 942991 942770 942580 942359 942201 942075 942012 941980 942044 942138 942328 942580 942896 943212 943559 943843 944095 944285 944443 944537 944632 944664
875541 944664 944632 944601 944537 944537 944569 944601 944632 944632 944601 944537 944474 944411 944380 944411 944443 944506 944537 944537 944537 944443 944380 944285 944222 944190 944222 944253 944316 944380 944443 944443
879730 944380 944316 944190 944095 943969 943874 943843 943843 943874 943938 944001 944064 944064 944032 943969 943906 943811 943717 943622 943527 943464 943369 943306 943243 943212 943180 943180 943180 943180 943180 943212
883919 943275 943306 943306 943306 943243 943180 943054 942959 942864 942770 942707 942675 942675 942643 942643 942612 942580 942549 942517 942549 942612 942707 942833 942927 942991 943022 943022 942991 942959 942959 942959
888108 942959 942927 942896 942801 942707 942580 942454 942296 942138 942012 941854 941728 941602 941570 941570 941633 941728 941823 941917 941980 942012 941980 941949 941886 941823 941760
891622 941728 941728 941728 941760 941823 941917 942044 942170 942296 942391 942454 942517 942486 942454 942359 942265 942138 942044 941917 941854 941791 941760 941728 941760 941791 941791 941791 941791 941760
895541 941728 941665 941665 941696 941760 941854 941980 942138 942201 942201 942138 941949 941665 941381 941065 940813 940623 940465 940371 940307 940276 940213 940181 940150 940118 940055
899054 939992 939897 939771 939645 939487 939392 939297 939266 939266 939329 939392 939455 939487 939424 939297 939139 938887 938666 938477 938350 938287 938382 938540 938761 939045
902432 939297 939518 939645 939708 939645 939487 939266 939045 938824 938698 938634 938666 938761 938824 938887 938855 938761 938634 938445 938287 938192 938161 938192 938287
905676 938413 938571 938698 938855 938982 939139 939266 939360 939424 939424 939360 939266 939139 938982 938792 938666 938540 938445 938382 938287 938224 938161 938129 938129
908919 938161 938256 938350 938477 938603 938698 938761 938792 938824 938824 938792 938729 938666 938603 938540 938445 938350 938224 938129 937972 937814 937656 937466 937340 937245 937182
912432 937214 937245 937309 937340 937340 937340 937309 937277 937277 937277 937309 937277 937245 937119 936930 936677 936425 936141 935920 935730 935572 935446 935320 935194 935036 934910
915946 934783 934657 934562 934436 934341 934215 934120 934057 934026 934057 934120 934215 934310 934373 934341 934215 934057 933836 933615 933394 933205 933047 932889 932731
919189 932605 932479 932353 932226 932069 931942 931784 931595 931406 931185 930932 930680 930459 930206 930017 929890 929796 929764 929764 929764 929733 929701 929606
922297 929480 929354 929228 929070 928943 928849 928754 928691 928691 928722 928817 928975 929164 929354 929543 929733 929954 930175 930396 930585 930774 930964 931122
925405 931248 931437 931658 931942 932290 932731 933173 933584 933963 934247 934436 934562 934625 934720 934815 934941 935162 935383 935572 935762 935888
928243 935951 935983 935983 935983 935983 936046 936141 936235 936393 936519 936614 936709 936709 936709 936709 936709 936740 936804 936930 937056 937151 937182 937151 937056 936898 936772 936677 936646 936677 936772
932297 936898 937056 937214 937340 937498 937656 937782 937940 938035 938098 938129 938129 938098 938098 938098 938129 938161 938224 938287 938350 938382 938382 938413 938445 938477 938571 938698 938855
936081 938982 939076 939139 939139 939139 939108 939076 939045 939076 939139 939234 939329 939392 939455 939518 939518 939550 939581 939581 939645 939676 939739 939802 939866 939960 940023 940118 940181 940244 940276 940276
940270 940276 940307 940402 940497 940655 940844 941033 941254 941507 941728 941980 942201 942391 942517 942580 942549 942486 942391 942328 942296 942296 942391 942517 942675
943514 942864 943022 943180 943275 943275 943212 943054 942896 942738 942643 942643 942738 942896 943085 943243 943401 943496 943527 943527 943496 943433 943306 943148 942959 942801
946892 942707 942675 942770 942927 943180 943433 943654 943780 943780 943685 943527 943369 943243 943180 943180 943243 943369 943527 943717 943938 944159 944411 944632
950000 944821 944948 945042 945074 945042 944948 944821 944632 944411 944190 943906 943622 943306 942991 942707 942422 942201 942075 941980 941980 942012 942044 942044
953108 942044 942075 942107 942233 942454 942707 942991 943306 943559 943811 944001 944190 944380 944569 944758 944885 944948 944916 944885 944821 944821 944853 945011
956216 945200 945484 945737 946021 946210 946368 946431 946400 946242 945989 945642 945200 944695 944222 943748 943338 943022 942801 942738 942770 942959 943212
959189 943527 943843 944064 944190 944222 944127 944001 943906 943874 943938 944127 944348 944601 944853 945011 945074 945074 944979 944853 944664 944474 944285 944064
962297 943874 943685 943527 943338 943085 942770 942265 941602 940749 939739 938698 937719 936961 936519 936425 936740 937309 938066 938887 939613
965000 940150 940497 940655 940623 940465 940276 940086 939929 939802 939708 939645 939581 939455 939266 938982 938571 938098 937561 936930 936267 935604 934878
967973 934184 933552 933016 932574 932290 932100 931974 931879 931753 931595 931469 931406 931532 931879 932542 933457 934562 935730 936867 937877
970676 938634 939171 939455 939518 939455 939297 939108 938950 938824 938792 938855 938982 939171 939329 939455 939550 939550 939487 939424 939392 939424 939518 939739 939992
973919 940307 940623 940876 941002 940970 940718 940339 939866 939392 938982 938729 938666 938792 939013 939266 939455 939518 939487 939360 939234 939171 939203
976892 939297 939424 939518 939518 939392 939076 938634 938129 937656 937277 937056 937025 937214 937561 938003 938477 938887 939171 939360 939455 939455 939455 939392
980000 939234 938887 938256 937340 936235 935099 934152 933552 933426 933805 934499 935351 936172 936804 937214 937466 937687 937940 938256 938698
982703 939203 939676 940150 940528 940876 941191 941444 941602 941696 941696 941633 941570 941570 941696 941949 942296 942612 942738 942612 942107 941223 940023 938508
985811 936835 935036 933205 931532 930111 929133 928786 929101 930143 931721 933584 935478 937088 938224 938824 938950 938792
988108 938508 938350 938382 938666 939171 939834 940528 941128 941665 942107 942454 942738 943054 943338 943654 943969 944285 944537 944758 944885 944885
990946 944758 944474 943969 943275 942391 941412 940434 939676 939266 939266 939613 940181 940718 940907 940623 939802 938571 937245 936172 935541
993649 935572 936204 937277 938571 939866 941033 942012 942864 943590 944316 945011 945674 946274 946779 947189 947505 947694 947820 947820
996216 947662 947378 946905 946305 945611 944821 944032 943275 942643 942138 941854 941791 941980 942391 942927 943464 944001 944380 944601 944632 944601
999054 944474 944380 944348 944316 944285 944159 943906 943496 942991 942454 941949 941665 941539 941665 941949 942296 942675 942991 943243 943433 943527 943496
1002027 943306 942991 942486 941823 941097 940307 939613 939045 938729 938698 938950 939487 940213 941065 941854 942517 943022 943243 943275 943117 942864
1004865 942580 942296 942075 941886 941696 941381 940939 940339 939581 938761 937908 937151 936488 935888 935383 934941 934625 934436 934436 934657 935067
1007703 935667 936330 936930 937403 937719 937782 937656 937372 936930 936393 935793 935131 934468 933805 933237 932826 932637 932700 933047 933584 934247
1010541 935004 935762 936456 937056 937372 937245 936551 935225 933331 931153 929164 927807 927491 928344 930175 932637 935194 937372
1012973 938887 939613 939613 939139 938382 937624 936961 936551 936425 936646 937151 937877 938698 939455 940086 940560 940813 940970 941002 940970 940876 940749
1015946 940623 940497 940497 940686 941065 941633 942296 942959 943496 943811 943906 943811 943590 943401 943243 943243 943275 943338 943306 943180 942959 942707 942517
1019054 942454 942580 942927 943401 943938 944474 944979 945390 945705 945989 946210 946368 946463 946431 946242 945926 945516 945074 944664 944380 944222
1021892 944190 944253 944253 944159 943938 943590 943180 942770 942486 942359 942391 942517 942707 942864 942959 942959 942896 942801 942643 942517 942359 942233 942170 942107
1025135 942107 942075 941980 941760 941381 940907 940402 939992 939802 939834 940055 940371 940560 940497 940086 939360 938413 937498 936740 936330 936298 936551
1028108 936993 937435 937687 937751 937593 937309 937025 936835 936804 936993 937340 937814 938319 938855 939392 939960 940560 941128 941602 941823 941696
1030946 941191 940371 939424 938508 937908 937719 937908 938287 938666 938824 938540 937877 936993 936141 935541 935351 935636 936267 937151 938035
1033649 938761 939266 939550 939613 939550 939455 939360 939266 939171 939076 938919 938729 938508 938350 938192 938066 938003 937908 937814 937624 937309 936898 936330 935667
1036892 934846 933994 933173 932447 931911 931658 931690 931942 932321 932731 933079 933331 933457 933552 933773 934184 934846 935793 936898 938003 938982
1039730 939739 940181 940371 940371 940307 940213 940055 939739 939045 937814 935983 933742 931279 929038 927365 926481 926481 927176 928375 929733
1042432 931090 932258 933268 934120 934846 935446 935888 936172 936267 936204 935951 935572 935067 934436 933773 933173 932731 932479 932447 932510 932510
1045270 932258 931690 930837 929890 929038 928502 928438 928817 929449 930080 930585 930837 930837 930711 930648 930774 931153 931784 932510 933205 933742 934057
1048243 934026 933742 933237 932700 932226 931942 931911 932163 932574 933016 933331 933394 933173 932763 932258 931816 931627 931721 932069 932510 932921
1051081 933110 933016 932637 932100 931595 931185 931027 931122 931437 931848 932321 932763 933079 933268 933268 933110 932731 932226 931658 931058 930553 930143
1054054 929890 929733 929669 929575 929480 929322 929133 928975 928880 928912 929164 929669 930364 931216 932132 932984 933773 934341 934752 935036 935194 935320
1057027 935415 935509 935636 935699 935730 935699 935541 935320 934973 934562 934184 933836 933615 933489 933426 933457 933489 933584 933647 933710 933773 933805 933710 933521 933205
1060405 932826 932479 932226 932132 932226 932447 932763 933079 933300 933426 933457 933394 933268 933079 932889 932637 932353 932100 931879 931784 931784 931879 932100
1063514 932321 932542 932700 932731 932700 932605 932447 932321 932163 932005 931816 931532 931216 930837 930490 930206 930080 930111 930301 930553 930837 931058
1066486 931185 931153 931027 930806 930553 930364 930206 930143 930143 930238 930364 930490 930648 930743 930806 930806 930743 930585 930396 930175 929954 929701 929512 929322
1069730 929196 929101 929007 928975 928912 928849 928786 928691 928596 928502 928407 928281 928217 928123 928091 928060 928060 928123 928217 928312 928407 928470 928470 928407 928281 928091 927839 927555
1073514 927239 926923 926639 926418 926197 926071 926008 925976 925976 926008 926071 926102 926102 926102 926071 925976 925818 925629 925376 925155 924934 924777 924682 924587 924556
1076892 924493 924429 924335 924240 924114 924019 923956 923893 923830 923767 923672 923609 923546 923514 923514 923546 923609 923609 923577 923482 923325 923167 923104 923135 923293 923546 923893 924208
1080676 924493 924650 924714 924650 924524 924303 924019 923703 923325 922914 922504 922125 921778 921431 921115 920799 920515 920231 920042 919915 919852
1083514 919852 919821 919726 919537 919221 918874 918495 918179 917895 917674 917485 917359 917232 917074 916980 916885 916790 916727 916664 916601 916538 916412 916285
1086622 916096 915906 915717 915528 915370 915180 915023 914770 914454 914044 913539 912939 912308 911645 911045 910477 909972 909498 909056 908646
1089324 908236 907794 907320 906815 906279 905710 905111 904479 903816 903185 902585 902017 901512 901007 900470 899839 899113 898261 897251 896146
1092027 894978 893841 892737 891695 890716 889769 888885 888033 887212 886423 885666 884971 884403 883929 883614 883487 883487 883614 883803 884056
1094730 884308 884529 884782 885066 885413 885918 886518 887244 888065 888949 889864 890779 891695 892579 893431 894252 895041 895798 896525 897282
1097432 898071 898892 899807 900723 901607 902427 903122 903690 904164 904542 904890 905237 905616 905995 906405 906878 907383 907952 908583 909183
1100135 909783 910256 910603 910824 910919 910919 910856 910824 910824 910856 910950 911077 911203 911329 911392 911424 911424 911424 911456 911519 911613 911740 911834 911929 912024 912087 912150 912245
1103919 912371 912529 912750 913034 913350 913665 913949 914202 914360 914454 914454 914423 914391 914391 914486 914644 914865 915086 915275 915433 915559 915622 915654
1107027 915685 915717 915717 915654 915559 915433 915338 915244 915244 915338 915528 915780 916033 916285 916443 916506 916475 916380 916222 916096 915970 915843 915749 915654 915559
1110405 915433 915307 915180 915117 915086 915117 915212 915338 915496 915685 915906 916127 916380 916632 916853 917043 917138 917138 916980 916759 916443 916127 915843
1113514 915654 915559 915559 915622 915717 915812 915875 915970 916064 916159 916254 916317 916348 916317 916191 916001 915749 915528 915307 915149 915054 915023 915023 915086 915117 915149 915149
1117162 915086 914991 914865 914675 914454 914265 914076 913886 913728 913571 913476 913350 913223 913129 912971 912813 912655 912529 912434 912403 912466 912624
1120135 912813 913034 913223 913350 913381 913350 913255 913097 912939 912781 912687 912624 912624 912624 912624 912592 912560 912434 912245 911992 911708 911392 911140 910950 910887
1123514 910919 911045 911266 911487 911677 911834 911929 911992 912055 912150 912245 912339 912403 912434 912403 912308 912213 912150 912087 912087 912150 912213 912308 912339 912371 912371 912371 912371
1127297 912371 912434 912497 912560 912655 912718 912813 912939 913034 913192 913318 913444 913539 913571 913539 913413 913192 912939 912687 912434 912245 912087 911992 911897
1130541 911834 911803 911740 911645 911582 911456 911298 911140 910950 910793 910666 910603 910603 910666 910761 910887 910950 910982 910950 910887 910761 910603 910445 910288 910130
1133919 910003 909909 909814 909751 909688 909656 909625 909656 909719
1135135I09814  $$checkpoint
##END=