##TITLE= ETHANAL
##JCAMP-DX= 5.00 $$From Command Line Converter 1.0
##DATA TYPE= NMR Spectrum
##DATA CLASS=  XYDATA

##ORIGIN= Exported from Command Line Converter 1.0
##OWNER= SVB
##$URL= http://wwwchem.uwimona.edu.jm:1104/software/jcampdx.html
##SPECTROMETER/DATA SYSTEM= NUTS EXPORT
##.OBSERVE FREQUENCY= 300.149506
##.OBSERVE NUCLEUS= ^1H
##INSTRUMENTAL PARAMETERS= 1H
##XUNITS= PPM
##YUNITS= ARBITRARY UNITS
##XFACTOR= 0.0000133267
##YFACTOR= 1.2708050000
##FIRSTX=  -1.558540
##FIRSTY= -1406.000000
##LASTX=  11.768100
##NPOINTS= 16384
##MAXY= 1252783.000000
##MINY= -18022.000000
##DELTAX=   0.000813
##XYDATA= (X++(Y..Y))
-116949a107R8r7j01J65L21m13j30K47l87N49j57J59l96J05M4k92L86l0J50L5m78
-115671a329J15k28K19M65m82m0L52l35L62J4j15J41l10k9O46m79j13K81m50Q5
-114451a230K44j19j40J84j09o9K59p7j00%OK1k92Q1K74j47J47K8j79L0j27L25
-113104i90l12NK5OJ39K6M51o63L97k10K22o4j08K37l18j75N46o0j95L79l47J37
-111763h72l05J01J33k98K40P4q3k62J94j53L2nJ96o45P42p81J060L93n25L20n31
-110483i75j64K05J34n86N93r3J03j85L50J13m52l25M75L97j04l13k08L96o79N42
-109258g76l18J98o15N60m8j20L50l63O7j7L58l13m2m0K10N9n8OR8rj69k5j48j16
-107795a271L58j92J41K69n87K78R9N8j17l5pJ4P6l01K92m68M52J22Pj12lp0m3
$$ y = [-1107, -1009, -1106, -1207, -1042, -721, -1134, -1264, -1017, -1404, -855, -1012, -853, -1249, -1144, -1100, -1392, -1006, -1036, -886, -851, -1329, -1214, -1442, -1223, -758, -1240, -1280, -928, -1263, -901, -887, -1002, -861, -1171, -1200, -554, -1033, -1146, -865, -1315, -1230, -986, -1105, -1245, -1061, -1170, -1239, -980, -1057, -1157, -1157, -1151, -1130, -1422, -1341, -1067, -1214, -1067, -1039, -1218, -1188, -1315, -990, -1302, -1297, -1272, -1266, -1127, -1101, -650, -1313, -916, -1126, -904, -968, -1076, -839, -1157, -1332, -786, -846, -1041, -662, -1009, -872, -1177, -1076, -943, -1241, -1001, -927, -1010, -1272, -1078, -1231, -1199, -1204, -1008, -1653, -911, -1692, -632, -239, -764, -444, -975, -1139, -934, -800, -1386, -793, -886, -783, -968, -618, -505, -957, -1282, -807, -410, -514, -827, -1035, -639, -1318, -776, -1094, -896, -1511, -951, -999, -1119, -769, -1132, -1065, -1082, -724, -1037, -1079, -1119, -909, -850, -908, -902, -804, -813, -982, -1007, -1155, -1271, -913, -1105, -964, -695, -1282, -1004, -905, -847, -964, -999, -1006, -992, -916, -1217, -925, -1393, -941, -819, -812, -924, -927, -997, -1040]
-106392a040P9k11L29q8R4J97k15k02J64nj35k00L69M0k97K75p8k86N25j98j86
-105106a069j13N90m79N02m28K1m2K16k4q9j22K20m85J42L66J91n10K67j23l39
-103887a308K62m7J42m7%o2p7J13k5N5k29N11n29M40k35o2Pl93M75J5j22J60l37
-102486a293L18k89q2L54p6J51j82m8K06R5j29j36L39k58j93K70m39N50j3k50J31
-101199i74J64j77k64K23pn4L06Kj26K97l18O3Nk82K05k8J66k47P5j86J7K23m03
-99797a320J50l6N0K42j12j08K02j06K79l04n8n7K60m77O34j26j89J71j1n37P19
-98518g34m0k80J35j41L34k52m29m6O36k38l8K62j96o2M6k16r7K96n4L05L2m3
-97177h20k62L12J06k51L20n43M26j85N9K11J93k89j60l92N41n19K75Q5j33L31
$$ y = [-1040, -961, -1172, -843, -931, -837, -640, -855, -1057, -893, -898, -1033, -1233, -864, -824, -1121, -846, -924, -1210, -685, -883, -1069, -1182, -592, -1071, -569, -997, -976, -1018, -802, -826, -915, -1037, -817, -1302, -1160, -794, -603, -1113, -846, -969, -1308, -1046, -1093, -951, -998, -998, -1060, -1137, -1024, -1049, -994, -1223, -712, -1241, -801, -1036, -1098, -1091, -1484, -1009, -994, -1116, -956, -1293, -975, -1264, -1346, -992, -1068, -917, -1099, -1147, -941, -846, -975, -1111, -772, -1030, -1223, -953, -1392, -842, -855, -1105, -974, -810, -987, -1251, -1028, -1035, -1089, -783, -781, -907, -610, -928, -865, -860, -1142, -937, -965, -799, -1046, -971, -1157, -1140, -917, -1320, -1170, -1206, -1156, -914, -1026, -1134, -932, -1038, -759, -1063, -1121, -1178, -918, -1395, -761, -887, -1076, -905, -916, -1453, -734, -774, -1054, -919, -1060, -726, -978, -1407, -1453, -817, -1055, -1093, -831, -1027, -1089, -1043, -1259, -1356, -1060, -1114, -809, -777, -820, -1082, -770, -664, -915, -595, -1138, -712, -897, -838, -627, -434, -723, -883, -1275, -734, -1253, -978, -893, -1026, -695]
-95952f95l80pN7J70k01J33m52K87K55k19K01m22J02K65L0j7N4k35R6J95j93J
-94611i75k83N28n27K00K22q1P3l87K00j26M03j67JP7k66J9M13n90L61k2mRk19
-93208a141L28j92K2K67j07k70L0J28j44o3L4O2M1J60l08J78K9Jj01k3P9K57k46
-91799i79j15r7L67j82lJ61j24n1K63j98J75l25K39j19J83l25m1K82k19K4K8p4
-90459a130K82k0l29KL7J12J48O7j9j58LJ18J07l95L66l84R6K27j72J79n3J14
-89118h02q9O7k06Q6k46M10l40J43l24L14P5J1m07M34l45K18J44j40K08k55L0
-87832a014O6K49j66m36J59k44M86l05n5O3%j3L05j55j07j90l6J91k37P6k74N47
-86491a090J33K29j87k75K88J2L7j66N4N10m53p1pj63j1J43J66j68K62j59J95
$$ y = [-695, -1075, -1082, -1025, -855, -1056, -923, -1375, -1088, -833, -1052, -851, -1273, -1171, -906, -876, -893, -839, -1074, -978, -783, -976, -975, -1258, -730, -1257, -1057, -835, -916, -843, -1230, -1030, -1156, -753, -920, -919, -842, -1108, -1089, -676, -1266, -905, -927, -931, -922, -1141, -813, -1005, -983, -716, -823, -1093, -1063, -935, -1079, -1142, -1108, -1046, -1005, -845, -1153, -975, -946, -945, -1046, -1069, -990, -733, -979, -1094, -1191, -824, -1006, -1009, -848, -972, -1023, -760, -958, -783, -1108, -869, -988, -805, -1130, -1171, -889, -1108, -1084, -1056, -1130, -848, -868, -1197, -1195, -1158, -1046, -898, -831, -850, -1008, -1005, -887, -780, -1175, -809, -1193, -1097, -870, -1042, -863, -916, -802, -891, -824, -1030, -944, -1190, -780, -1120, -977, -1301, -987, -912, -901, -1308, -874, -1219, -1001, -857, -997, -789, -1044, -1014, -948, -699, -865, -1301, -1142, -1386, -900, -1205, -1260, -1197, -1197, -1210, -905, -1060, -1167, -1357, -1393, -1202, -1439, -1363, -1637, -1090, -957, -728, -915, -1190, -902, -890, -853, -1019, -965, -455, -908, -979, -986, -1149, -1160, -1017, -851, -1019, -757, -916, -721]
-85210g21j44j06J91l55J64n1K76R9L03n33P1n5P7j03k95K88j79J91j34L15l04
-83932a005k01J1K05k13K99k79K08Mk36K23j5K7Qr3L70k30N1R7k93L56l07q6N4
-82522a045J24J0L57l24M3j19q3j4o1J88k93L64l20J13P1j48M9o5J20o9M4J20
-81181i38R6K44k78p3m31K74K0M6Mj21M94r6j74r7M4j14J4k14L92L02l40M1J84
-79780g21J5j96k74j10P88l02l74N16l75K77j73Q5l08K26k97K22j19K81j8j07
-78554i64J77j12l05M72o1k76J99K5l2N0k92K95l53l02P13l32J94J19j2l9K4J10
-77214g02m4l19j06L44o0l66M62k5r0j79K34J90k30k21kLk41M59k94J30MK80j95
-75812i68J05l03N30m57j74J43J70p5L51m51J53J95j77K21m41l8r1J19J09R1K11
$$ y = [-721, -865, -971, -780, -1135, -971, -1022, -746, -647, -344, -877, -806, -861, -784, -887, -1182, -894, -1073, -882, -1016, -701, -1005, -1206, -1195, -990, -1203, -904, -1183, -975, -971, -1207, -984, -999, -972, -964, -1057, -687, -917, -866, -769, -1062, -706, -1013, -1099, -1045, -921, -911, -554, -878, -835, -954, -1037, -1051, -1112, -924, -1217, -853, -1173, -1060, -989, -1137, -1088, -1153, -1033, -1102, -1058, -938, -842, -598, -876, -949, -1380, -1106, -1086, -1040, -1036, -1157, -663, -759, -933, -1030, -986, -1100, -1086, -1300, -908, -606, -946, -905, -721, -706, -902, -1176, -1286, -498, -800, -1174, -658, -1033, -756, -929, -844, -1152, -926, -1223, -1001, -1120, -839, -857, -964, -787, -899, -1204, -732, -793, -1069, -870, -845, -877, -827, -1119, -824, -1177, -1479, -766, -1098, -904, -785, -797, -836, -812, -702, -746, -1065, -1171, -827, -887, -1253, -791, -816, -906, -1085, -851, -661, -891, -1112, -1114, -1111, -1352, -893, -1187, -1057, -1053, -773, -968, -863, -1166, -636, -1093, -1267, -1124, -954, -1029, -678, -1129, -976, -781, -958, -737, -1178, -1216, -1307, -1188, -1079, -988, -777]
-74532g77j38j55K39J3J34m1j62J9J83j65p7M11m41M8n9l88J70l6K72k38j07m2
-73184a337L35n52K69M50k39k47M87j56m0J70n54J62L18n19L22K59l68L4L11j0
-71965i05J34j36l14j2k7M3M73R0j58pj36k33K57l07J21j96N22J08k54L67m42
-70687a012L94k30j24J00j54J9K59O4Q3q4K30n35K4o6j32L72O9k95K18J11k66
-69399i55k14P8O4K31l39K30m0k1q2j75L36j63J67l71N72k04J18K3k66K48k33
-68120i96O0l12M77l17j94M22l6QJ2K87j60l65J97K31j16L3k25K5J34n65M18j45
-66779a127K62J43j09K03k03J4J34k26j4p8J06J93j13Oj06q6J0q4P0J66L54l21
-65431h06J22o3L37k08P7J49n60J50m3n37M65k71M63k2k80K08q7m7J14q4k80J83
$$ y = [-777, -915, -1070, -831, -818, -684, -725, -887, -868, -685, -850, -927, -516, -957, -909, -968, -1356, -1186, -1222, -950, -1188, -1295, -1337, -1002, -1554, -1285, -835, -1074, -1321, -834, -990, -1030, -860, -1414, -1252, -934, -1453, -1131, -872, -1240, -1206, -895, -905, -771, -907, -1221, -1233, -1260, -1217, -744, -654, -812, -819, -955, -1188, -931, -1238, -1117, -1313, -791, -683, -937, -570, -1012, -618, -848, -972, -872, -1026, -1007, -748, -684, -601, -685, -455, -990, -966, -1032, -1164, -792, -723, -1018, -800, -689, -955, -1169, -1091, -1027, -796, -1135, -905, -945, -966, -1048, -1223, -887, -1050, -883, -1254, -682, -886, -768, -745, -1011, -763, -996, -936, -1248, -771, -1088, -1282, -860, -896, -888, -876, -589, -749, -1114, -917, -686, -802, -769, -994, -969, -835, -1400, -982, -1127, -865, -722, -831, -628, -831, -817, -683, -909, -923, -1001, -895, -702, -815, -809, -915, -1001, -991, -1075, -1005, -839, -485, -806, -684, -747, -410, -618, -541, -392, -952, -802, -845, -1382, -917, -1188, -725, -747, -1027, -819, -906, -953, -839, -923, -1203, -1020]
-64091a020K69L2m8q4K68j41j36M20n51J99k50P3j72k11K66O7K06l85J18O1j8
-62811a037R5j25k51M51j52J54m59K04m3K60K21k92J46R3K1j99K09K1l34P7j0
-61525i50K9j27l00O79k26L10p0k14p9k7J10j25J39l69L68r0J68j12K87k15J50
-60245f64j5r0k88J5J93j6J51j73J40l53k04L66l0r1K76K9m1k62J3J71L1j2K14
-58842f40l65J78k72J97l55M37l51J80K9N4K81k88nj43l9K74Rk81K02P6j91J71
-57495h42j40q2%j83N41j30j84L02J81n7r4l7Q1m74q3J38O85l19m34M07k42q7
-56154a053P2J31q8K48j20P1k14l9K8K10p7o5K37j45J43j80k33K03j65K00l77
-54875a213N27k36j41PL00j60k4M16r7k81k07L88p7q1Rk11L16p0k36M3J69n0K25
$$ y = [-1020, -751, -719, -767, -851, -583, -724, -860, -440, -991, -792, -1042, -969, -1141, -1352, -1086, -1019, -813, -1198, -1080, -1019, -1037, -942, -1067, -1318, -867, -1019, -865, -1324, -1120, -1163, -903, -682, -974, -828, -735, -714, -913, -704, -683, -1017, -940, -950, -921, -1048, -1348, -669, -895, -585, -655, -869, -948, -975, -865, -990, -851, -1220, -852, -942, -774, -886, -599, -814, -664, -679, -769, -1057, -1042, -849, -865, -714, -887, -747, -1100, -1304, -938, -968, -1059, -783, -754, -795, -1057, -1044, -873, -842, -854, -640, -1005, -827, -1099, -902, -1257, -820, -1171, -991, -962, -908, -627, -915, -920, -1063, -1102, -828, -819, -1100, -898, -822, -1013, -842, -982, -1064, -1064, -1247, -706, -836, -1020, -718, -537, -594, -688, -725, -644, -1118, -1201, -1063, -378, -697, -1131, -724, -966, -1053, -981, -850, -938, -690, -810, -739, -953, -992, -964, -754, -831, -896, -659, -804, -661, -841, -1074, -871, -1036, -836, -1213, -686, -922, -1063, -1056, -756, -916, -940, -524, -621, -902, -1109, -721, -798, -879, -870, -1081, -765, -835, -1071, -1028, -859, -909, -684]
-53473f84l62j1L44j55k78M1M45j53j63J70L0j56l1J81k47m2QJ1j43M61l12LK52
-52063g91j4r7j90J55j18J81N4l2J01J52l47O1p6J15m1J15k12J93k73M09k27K42
-50722f40j50j07M20m05J65j48j35K06o5J7J34j12l4K29k84k59J41L53j37k0R1
-49444g40Qp7l01L18k2J67j1j14R7J48m38K58m06L84j39l71N31l02K76K07k41
-48156g68j38Q9n0Q4J36l16j63M47j78K20j25j54J44r3p7l9J51J05r6l01J41K82
-46816f99l36M60m73K32J74l82n1q9L40J7j74J65m2j38J62K5l7J21j06J14p64
-45536a481R23k15p3Q1J2Q4j98O9l5M8j76O1kM04l59O5q0k54J58J11Mn05J94K36
-44073i28K8J47r6J7j14J98l4L00p3k08k93l6L31l38P4J7K10J99l66J71j10J43
$$ y = [-684, -1046, -1057, -713, -868, -1146, -1105, -660, -813, -976, -806, -776, -932, -963, -782, -1029, -1071, -1063, -1052, -1195, -734, -1046, -1043, -791, -805, -902, -1092, -937, -1055, -874, -820, -852, -751, -599, -946, -885, -961, -846, -887, -772, -984, -791, -1064, -655, -882, -640, -790, -897, -477, -882, -717, -865, -1000, -794, -859, -842, -708, -820, -854, -625, -909, -1168, -1027, -674, -811, -831, -740, -732, -809, -1110, -792, -814, -647, -658, -772, -675, -527, -965, -707, -1113, -729, -868, -1239, -708, -1010, -734, -527, -768, -906, -817, -867, -783, -647, -963, -1126, -679, -857, -637, -762, -916, -772, -865, -942, -981, -830, -725, -821, -1122, -981, -699, -1035, -575, -1048, -816, -642, -1024, -1075, -1164, -824, -807, -981, -816, -858, -996, -834, -809, -846, -725, -831, -717, -1481, -558, -773, -846, -765, -753, -669, -867, -798, -833, -785, -961, -900, -902, -498, -857, -792, -872, -1126, -968, -857, -853, -1358, -1164, -928, -900, -753, -849, -832, -946, -748, -782, -482, -555, -763, -1056, -1092, -761, -1099, -1025, -1008, -798, -599, -965, -794, -904, -761]
-42724g61l21K32k01j46J92K59jM6j19p7K82M2j18P0p8J04l07Q1P5k8mk88n7K89
-41261h34K71l72P8k82K15l45J58p1N93m09J13j79M4l6%j70K92K47j67k44L60
-39982g38l86O47ol14LM0j5M87p96K43P7j61k10L94k02L24k00k05L88j49M47o81
-38641a013J40j83j56J02R8K21j1J67k71j41K59p5L11J54m28J58K08K7l24N7m8
-37355g48K4j81M22k86N20q19K99l89r3M00M62j77k65O3l75J85R7r9k38J62J71
-36075h65N5Jk36K80L44k18j41J86l22K86k16K84l47o3j03J76Q6N42l69k86m0
-34789i66k8R2P1J11k05J32K23j25J50l77K37k78J84q9J87l4m95O94J07k4n65
-33509i98N3k9j47P57k86k34P4q7K06m4m69J70M37r9l7j90K65k52q4M01l56Kj36
$$ y = [-761, -1082, -850, -1051, -1197, -1005, -746, -747, -701, -820, -897, -615, -573, -691, -621, -699, -595, -902, -821, -746, -774, -778, -1066, -1123, -834, -563, -935, -857, -1139, -924, -1269, -1111, -1182, -589, -998, -885, -1064, -1020, -1056, -1056, -1226, -934, -687, -854, -1098, -738, -1124, -477, -483, -797, -794, -754, -769, -282, -1078, -835, -758, -919, -1129, -735, -937, -613, -813, -1018, -630, -779, -332, -1013, -873, -1056, -1212, -1110, -1012, -791, -802, -635, -906, -1047, -788, -863, -552, -398, -826, -668, -460, -433, -757, -700, -748, -724, -905, -483, -769, -249, -1068, -769, -1158, -1251, -851, -389, -566, -831, -768, -1143, -958, -861, -960, -1198, -1036, -865, -810, -809, -1045, -765, -421, -639, -780, -594, -916, -630, -846, -562, -909, -972, -1075, -899, -813, -271, -640, -926, -966, -994, -902, -831, -720, -925, -793, -570, -695, -545, -922, -685, -963, -779, -868, -681, -715, -1210, -516, -409, -433, -998, -945, -974, -1121, -364, -650, -884, -810, -897, -691, -735, -1204, -1034, -597, -696, -733, -923, -658, -910, -994, -593, -949, -947, -1083]
-32107a083k21L60j05q8N8J48k0M24n2l1m75Ok2j97j6L49J89k50J20j96L63M6
-30767f93N2J13k95J29m47K92L3J10K32k73j9k39K32K07j44r5k64J02o5L37j55
-29479h50N68m09Km3j63M9k14K16L11k57L43J06m45J20rQ0j82j56mJ42K62l74
-28139i07J1J16L16k69j39LJ75n1j63J72K45j57L6j36KJ8k81J65L35j75R3J18
-26798d73n00J45K89l48P2k67K65j51J96j51R9K4P6m25N48l65J49q2J82K14l87
-25511h90j29M85m44P0l0K60M3n95L52O0O5n3r8L09j48P5Ll7L7N5m5j21j07K42
-24048f41j06j05N9k12K08OJ19p9j39o7M4L73k51M1q5n8P8l5M37k19j07m0N3J96
-22584e30m15J16M8q7j38M17k62p5j31K44J57n2j05K67j37J0Q9k19l65M73l32
$$ y = [-1083, -1304, -944, -1049, -1137, -1079, -931, -951, -527, -579, -610, -1085, -1079, -1101, -1298, -1314, -965, -776, -1026, -906, -1102, -739, -693, -641, -528, -823, -694, -1141, -849, -816, -706, -474, -747, -766, -1005, -773, -566, -710, -805, -1069, -967, -1032, -695, -850, -282, -691, -689, -732, -895, -846, -1060, -844, -533, -790, -447, -341, -786, -666, -675, -595, -777, -933, -937, -795, -533, -907, -896, -780, -464, -733, -872, -869, -694, -745, -908, -736, -491, -648, -612, -748, -746, -728, -1009, -844, -509, -684, -591, -473, -973, -828, -539, -887, -815, -1082, -817, -968, -772, -923, -824, -800, -724, -1149, -601, -966, -817, -899, -717, -503, -890, -1019, -534, -978, -908, -938, -678, -635, -1230, -878, -818, -753, -806, -904, -595, -743, -668, -665, -702, -665, -610, -655, -776, -883, -641, -747, -852, -793, -1005, -797, -791, -672, -751, -890, -957, -913, -540, -791, -750, -835, -893, -815, -850, -413, -632, -739, -779, -726, -530, -945, -829, -781, -868, -1006, -589, -851, -926, -1057, -813, -656, -708, -813, -546, -683, -673, -584, -803, -1168, -695, -1027]
-21306a027K4N06k72J00o2j60j0k11N07j90j47J51J81p3ml3k57j80K40j2K63K9
-19957f37J27k40K22k44j44j70O5J14K54j64J62k03J6K80j99q7J52L1j5l02L94
-18678e88k83Q5K83l72J13k53l8M75m20P7Q6P4j48L39j83K09K7k28K16K2L8r5
-17337e64k39J90ql36L75l56M0k15J63K02Q9p3J06N1k53J31j6R4k13j39K14L9
-15988g18K77k81J05j89K81l51L07j33K52l08j73N35L9j62k17j9K08L41q9l92
-14771f87R5k58L40N3l84N30M3k29o2j15k0KK37m8J15k10Q8j03%o3m1J72L56j98
-13308c87j99o7m6o0j73M76kN1k21k14L43j46K45l50R0k93J04K26k01k24K87J07
-11966f54N0M63m49j13Q3J3J94m65L08q1N18j17p57M98k03P3k76J80j9nJ15j06
$$ y = [-1027, -1003, -497, -769, -669, -731, -891, -901, -1112, -605, -795, -942, -791, -610, -683, -687, -720, -977, -1157, -917, -929, -666, -637, -510, -750, -528, -772, -916, -1086, -1021, -907, -653, -817, -655, -858, -842, -562, -761, -848, -696, -665, -680, -982, -588, -871, -786, -503, -875, -762, -1015, -1053, -578, -998, -921, -835, -761, -909, -570, -753, -544, -517, -745, -529, -507, -469, -564, -803, -613, -621, -957, -582, -938, -898, -1113, -950, -748, -659, -732, -626, -575, -828, -697, -713, -619, -832, -971, -757, -718, -441, -722, -617, -806, -525, -876, -569, -702, -450, -758, -931, -396, -357, -519, -736, -755, -547, -206, -295, -687, -592, -850, -510, -457, -841, -311, -268, -497, -559, -674, -694, -692, -455, -503, -388, -598, -510, -613, -613, -676, -717, -545, -189, -387, -586, -653, -699, -759, -932, -456, -458, -407, -628, -842, -499, -645, -400, -750, -660, -953, -849, -623, -824, -1048, -761, -654, -604, -141, -590, -703, -620, -607, -413, -878, -570, -651, -133, -250, -1007, -509, -712, -639, -915, -735, -754, -759, -644, -750]
-10619g50L5J68l42N30j81K20p6K37k02jp4k7j43r3M13o90K30k80L76Nl5Qp3J55
-9156e90J25k63M24k93J79K1j65P7O4O5Jj07k29L32l41l97O15J1k51Q9J20k19
-7815g32K0K63l2k9K33L6j59k32M23j81K65m39L73J7j5l3l1M1J27pk81K92p40
-6413h21J57L24j19K30l0J7k87M73l82J05j6K03l53J81j54J21j29K5J30q9L0
-5127c84N7k96L2p1L47J07l41K51K61n6r7l17M1l7M53j13J3p3j9j02Q2j93Q5
-3724c70J28k2K62M1l40L30k87J33J45O7j26j61J03K47l48K68L14l04j12L56
-2499C24%M9j36J39k60J65K00J57Q7j64o7j88j40l40O04K75Q53m03k23p9k31
-1219F22L60O90N57J174J017J081j95o61r09K447L458K650J608K263L341M038
$$ y = [-750, -715, -547, -889, -359, -540, -320, -396, -159, -361, -362, -436, -463, -606, -699, -286, -976, -746, -1026, -650, -645, -680, -672, -745, -590, -465, -728, -304, -597, -418, -397, -562, -485, -421, -356, -355, -462, -691, -359, -700, -1097, -482, -471, -722, -633, -513, -732, -712, -449, -481, -510, -277, -241, -400, -632, -209, -390, -125, -564, -191, -174, -189, -222, -253, -212, -85, -92, -373, -81, -821, -664, -340, -459, -229, -259, -242, -529, -56, -438, -333, -349, -146, -499, -318, -472, -351, -480, -455, -325, -414, -384, -327, -623, -591, -662, -315, -208, -549, -298, -37, -93, -190, -507, -466, -503, -50, -163, -150, -223, -242, -344, -262, -455, -370, -242, -264, -2, 39, -301, 29, -258, -125, 20, 87, -39, -200, -97, 150, -198, 70, 384, 80, -32, 324, 324, 373, 237, 376, 116, 281, 481, 638, 725, 561, 494, 306, 166, -174, 430, 705, 1558, 1155, 932, 853, 622, 982, 1672, 2229, 3403, 4420, 5501, 5306, 4645, 3736, 6183, 9641, 12291, 13899, 16162, 19503, 23541]
-246B3541N923K1465L2087K2743k0813l8796l1018m737l137k013j020J53j61
551D217q27m09O54P24Q95p46j861p29l19m90j44J55J76P94j52l30n32l05O37
1707A408j97L03N8J75k02k04k2l53K41J93M23n80j39l29M40k2j8j0Q3m13K96
2993A131J29k9r1j40L19J15k68K7P18k83J08o08K32j44l5k05K62j48jJ15m22
4274G82P9k12j30m1N47l71K35n59J86k21L2q2m2J62l34J01n6j29N03k55n7J81
5615C19j96k0K10k38k71K9K7J53m9m87p7M89Rl36J68L4j81L38k2K41k27j02
6962a89J09J40j38J6K51k30j84M01k02k5k08j23K6j40o7P1J53J86K3K75j45
8242@j61l05M54o08R6L20J02mp8J97K74k88n57K10j8k99K64j9J7R0r1L25m53
$$ y = [23541, 29464, 50929, 83016, 105759, 84946, 46150, 15132, 10395, 7258, 5245, 4225, 4378, 4217, 3390, 2981, 3635, 4359, 5254, 4508, 2647, 1918, 1599, 1109, 965, 1120, 1296, 2090, 1938, 1608, 1076, 771, 1408, 1211, 1514, 1572, 1747, 1545, 1341, 1319, 966, 1207, 1400, 1823, 1243, 1104, 775, 1215, 1193, 1175, 1165, 1248, 835, 1131, 1260, 1231, 1140, 1000, 1319, 1434, 1166, 1193, 1911, 1628, 1736, 1128, 1360, 1216, 1181, 976, 1238, 1090, 1089, 1204, 782, 861, 649, 519, 478, 1025, 654, 889, 330, 516, 295, 327, 245, 203, 365, 31, 132, 76, -53, 450, 195, 138, 319, 123, 103, 313, 75, -196, -167, -140, 13, -36, -523, -600, -111, -102, -438, -270, -236, -417, -79, -101, 140, -87, -189, -80, 60, -78, -62, 189, -41, -225, 176, -26, -51, -259, -382, -356, -496, -563, -492, -339, -153, -130, 145, 0, -161, -466, -12, -620, -524, -204, -102, -106, -184, 13, 287, -1, -558, -348, -366, -665, -401, -420, -403, -313, -404, -79, -532]
9644e32K66J20k9o2q3N4K2n4K8j68L87k51j82P9j27k11N69m17K22O2l74K96
10984c85j11q8j9P7o2L76j40J76k05L57l61J32n8m8k2j54k43K30k81M32l49N2
12333f94K17k04k54K88K39K72m4l30k55J52J03K90m38J22P8J90l2j88k62j87
13550i37L40K48l01l33K81J18K21p9r7nn2R0RN6O6K89q6K01j92j07J40l93m39
14952i62L9K33J62l80K90m3J01K64k75K41n04N8J51l8o9j01J25J14jl88L04P7
16301f02M0K2j55L00j92J51k55m1n9J71J69M29l52j29M5k77L25m32L62O3l17
17580g34N73l14k75J86j37j05O6j02J45q0K23Pj81K49j68m47N28jK4j36K51N8
18921c70m11O1l3m0k3j37J37J9J75k71j41L86j91K46j46P4K16l34J75J9r2K69
$$ y = [-532, -266, -146, -175, -237, -320, -266, -244, -298, -270, -438, -51, -302, -484, -405, -532, -743, -174, -591, -369, -307, -681, -385, -496, -584, -603, -526, -588, -212, -352, -176, -381, -24, -385, -253, -311, -359, -381, -535, -778, -548, -829, -397, -746, -694, -477, -681, -935, -647, -408, -136, -180, -510, -765, -613, -510, -220, -658, -536, -458, -268, -300, -488, -750, -937, -597, -349, -650, -983, -702, -584, -363, -442, -539, -544, -596, -506, -497, -441, -375, -86, -172, 29, -163, -270, -130, -523, -962, -923, -690, -528, -908, -618, -661, -560, -296, -571, -330, -834, -776, -625, -663, -732, -833, -708, -594, -595, -983, -679, -602, -562, -540, -695, -395, -587, -436, -691, -732, -791, -620, -451, -22, -374, -503, -458, -735, -410, -842, -480, -417, -734, -161, -475, -750, -564, -701, -806, -740, -842, -697, -777, -554, -547, -728, -479, -647, -1094, -566, -567, -543, -679, -428, -370, -781, -720, -753, -793, -816, -953, -816, -797, -622, -893, -1034, -648, -839, -593, -739, -665, -449, -783, -608, -589, -681, -412]
20262d12k04j81J61j43l9L63k68J66k1j32L5J98l61J96j55j59L6N66l98J39M0
21548e73o7Q9l08J44j3L14n75M82k65n3J27J44j0k29K99j21j07r9K91l78L61
22828e47J26k23K7L05j83j01K0j85L14k14k07J64j31L96j08j18j59L02k0k4M9
24107e17j92m1M1o7qJ4j90L55l78L88R9l11L03j43n5k42L97j11p0J87k23K02
25456e62j33l6k26L65k95J08j10O48m63J12M7p9K9k25m3K16p9j22Q1L15j39j29
26795g20k00J87K49Rk02q9K3L4l1P1j26J63Q3k63K21j22o1J98j00K38p9m0j75
28198g32J9J86k26L07l28j7l18M73N1o2M3J32j19q3J29l6k11M30l94J68j4J33
29546d69m42J94J66j59J92l98M26j03j94J36j32l4L64L5l36K7jK02k8L2k86J63
$$ y = [-412, -616, -797, -636, -779, -818, -455, -723, -557, -578, -710, -675, -477, -838, -642, -797, -956, -920, -354, -752, -613, -573, -640, -551, -859, -715, -728, -414, -989, -507, -772, -825, -698, -554, -564, -793, -494, -615, -722, -821, -530, -908, -547, -421, -644, -617, -312, -495, -596, -576, -761, -447, -661, -868, -704, -835, -439, -547, -665, -824, -522, -542, -566, -517, -709, -750, -709, -776, -784, -770, -960, -605, -983, -595, -496, -807, -504, -647, -702, -944, -547, -658, -728, -541, -764, -562, -695, -731, -957, -592, -887, -779, -889, -241, -704, -592, -545, -624, -595, -820, -863, -647, -726, -848, -767, -452, -591, -720, -920, -733, -484, -475, -677, -766, -743, -709, -740, -669, -795, -632, -549, -812, -591, -713, -774, -576, -676, -438, -517, -557, -732, -713, -527, -753, -446, -774, -791, -1109, -636, -585, -647, -604, -472, -591, -674, -545, -581, -792, -362, -756, -588, -602, -469, -911, -717, -551, -710, -518, -916, -490, -593, -787, -651, -783, -817, -453, -418, -754, -727, -728, -526, -554, -522, -808, -645]
30887f45l83K08L73m17M06m5j33j91M45k50j92o8J09j11N17l50K2j77M62o49
32105a069L56K58k25l61K61k2M77l36Q8j42K17k01k46k52O80l05j06M37j43R2
33330e42q3o2L9j80M91j30K56k88O3L2j84J37k3n1j35j2j1K27m68L34Q7j4k25
34732g42p7K3K75N0k34j55L33r2Rj5j25j79L03j4j01K59K30o91J18M39k98o2
36073g46q6L07M8J13m90K56n7R7K37l48j84L99k01K3J12l1k07O3M6K04j13K56
37413c02j95n6J57q1j33Q5k71j04J46p2m7L74l9J74n18j84o6M23l6N48r6j36
38762d29L70J03n89NL05l75J7j89l85N60P6K20j13k99L8J2P1J09P8k76l1j1l7
40164g70J39j15o3l5j0P0L26j4m11L36l07l6k86L51J0J42k88l50M31N27m81L40
$$ y = [-645, -1028, -820, -447, -864, -458, -503, -636, -827, -382, -632, -824, -892, -783, -894, -377, -727, -705, -882, -420, -1069, -713, -455, -680, -1041, -780, -802, -325, -661, -573, -715, -498, -699, -945, -1197, -517, -822, -928, -491, -634, -542, -625, -687, -648, -828, -337, -467, -211, -499, -436, -404, -588, -451, -474, -525, -660, -672, -683, -456, -924, -590, -503, -517, -742, -819, -796, -521, -471, -705, -860, -527, -619, -610, -625, -750, -929, -626, -640, -741, -482, -252, -943, -825, -386, -684, -746, -832, -525, -477, -364, -854, -598, -655, -558, -321, -669, -853, -454, -655, -632, -520, -551, -758, -695, -649, -445, -558, -302, -497, -553, -396, -477, -610, -525, -796, -900, -754, -826, -873, -499, -538, -364, -882, -1066, -1132, -709, -745, -197, -293, -429, -59, 44, -545, -540, -235, -610, -593, -782, -1167, -607, -531, -311, -424, -723, -685, -673, -602, -493, -415, -691, -722, -733, -770, -631, -746, -809, -844, -854, -784, -458, -472, -883, -547, -854, -890, -1176, -825, -815, -673, -961, -1311, -880, -353, -834, -494]
41505d94Rj29K46L5l9K41k95k28R4l1k5Rp0r2R3j85k77J91L04N32K1l57L01k5
42968a71m6k47p8K81l29M4r8j86L19oK5J57l67K2M67k67N3j24J62P5j52n7l12
44377h35j39Q0L7m15L53J64m30N11K18k5J02m00J62N1rJ7J64k75p3j58L01k46
45718h45p8M42L6k02O81p10M24l42K8k16N38m14%J8J75k46J11M9n73M66j8j64
47059h40L36k68Q4q5K07ml86l5K70K74j18L24l49L2J55k43l24O5K29J57k20L96
48406c43k26N09n00J28L8n00m10M17J38J02O8l1P6J39J9J8j94o8K52Q3j5J78
49747a22k63k65O78k53J6m3l80J03R1j89J2j0J78J39k50P4p0J79n8N0K18l72
51088e37L3N1R8J73m42K36k39l9M87k87K44k73k78M60J96o87M89j8j07j34J52
$$ y = [-494, -485, -614, -368, -333, -372, -131, -426, -654, -560, -591, -616, -607, -677, -769, -676, -861, -1138, -947, -643, -111, -90, -447, -146, -171, -217, -464, -542, -261, -590, -546, -644, -830, -511, -517, -492, -335, -702, -680, -213, -480, -427, -551, -389, -314, -466, -523, -835, -974, -894, -857, -1272, -919, -755, -1185, -674, -456, -481, -379, -779, -617, -566, -575, -558, -394, -669, -742, -900, -599, -845, -923, -481, -445, -647, 34, -676, -252, -594, -566, -782, -244, -658, -658, -640, -465, -711, -600, -551, -1124, -658, -676, -840, -504, -772, -688, -773, -566, -570, -956, -991, -721, -447, -565, -241, -590, -558, -403, -646, -970, -905, -676, -519, -739, -343, -569, -60, -560, -432, -394, -894, -1304, -887, -749, -647, -579, -610, -534, -395, -376, -358, -552, -620, -368, -285, -300, -122, -385, -650, 28, -225, -209, -252, -632, -529, -438, -627, -615, -625, -447, -308, -558, -484, -554, -375, -433, -383, -165, -537, -504, -453, -355, -182, -624, -388, -627, -666, -179, -466, -222, -495, -773, -313, -117, -804, -315, -333, -440, -574, -422]
52375d22J79k73R5l06M71l39J6K15L2K02m35p7OK58l20K58r2J81j6K16m81J66
53716d66j5j02L88m35J84l23L16J6J50R4k01j79L25m33L33J6j12j29L98n46M96
54994b25j12j9j83K66l9K2J87K5k07j53j5L53j52k62l5R5k1K51l56R1j93J21
56336e61N7l55J3Q84n78k9J10p0r6K55R9l90J26L1L31l03r5P9j53L49l06%LJ79
57806d20j63J57J32j18R6J14k20k2M69l62p5j36J62L69j82p4k37L06j45kj19
59086d70J26j63j47L29J2k48M54l96L86j31j60n6M0J32R3k87J46j44L3N68m39
60365c22j55R2O9J94m95M39O9k16k35M28o8J42k49J07Q0l24K57k28R1J17l5q6
61714c28l47M49k32L03j6n5Ql34M44l51O52l87j30K37K15J25m27j84K69k22J48
$$ y = [-422, -243, -516, -421, -727, -256, -595, -579, -364, -332, -130, -565, -642, -636, -378, -698, -440, -532, -351, -367, -151, -632, -466, -481, -583, -195, -630, -446, -769, -453, -437, -287, -193, -394, -573, -248, -681, -348, -332, -444, -573, -175, -721, -225, -337, -356, -539, -273, -312, -290, -103, -78, -285, -438, -453, -100, -252, -514, -549, -454, -475, -224, -580, -489, -682, -561, -504, -859, -846, 38, -540, -569, -459, -529, -625, -370, -271, -661, -535, -504, -173, -476, -571, -492, -645, -296, -602, -602, -599, -420, -583, -426, -294, -412, -316, -202, -422, -444, 25, -337, -412, -548, -386, -17, -199, -273, -510, -204, -349, -351, -470, -344, -507, -654, -325, -313, -561, -107, -503, -117, -248, -408, -464, -424, -292, -199, -486, -340, -484, -451, 117, -322, -477, -385, -316, -122, -617, -178, -109, -325, -560, -132, -200, -58, -307, -200, -120, -444, -187, -415, -324, -207, -242, -328, -675, -226, -458, -155, -171, -226, -218, -552, -108, -459, 193, -194, -324, -87, 128, 253, -174, -358, -89, -311, -163]
62992a63j26L96k62rL33n63O13k1l50J87n98M42Nl4j27q7J79j63j90L45j50K91
64333e2N9m33QK11r1J89k23K87l02J4N4kk40j9K27J60J26J61K76q9p88N58j53
65736f2l8j35K27j49n4K17LL70l39m13L27J81l84K48n1M2J04l17L19j45L6j62
67083a75Q5k91N57l37J61q2k74K42K8r8J35r5k64M73m06J07J08M5n29N99j34
68363a45M99o82M7%q5L75l61J56l64Q7K36K29q7P1K43n52K93j16J31O3p9l70
69704d11K97p5p3J88N5k26K64p4k39J05O2l32M27k12m6J15J63j8k17J04k14N23
71051A66j11j74k46N6jj42M52k45P1l5l51N78K2l20n7K01n8J01k17N36l29R8
72392ej17O5J05m69j0Q7J54O0R0J17k97J38l60K47J20l22Q8J64l4JJ97l1k20
$$ y = [-163, -289, 107, -155, -164, 169, -394, 219, 198, -152, 35, -563, -121, -116, -150, -277, -364, -185, -348, -538, -193, -343, -52, 7, -426, -418, -207, -298, -109, -332, -45, -347, -333, -279, -281, -521, -540, -313, -153, -27, 134, 410, 321, -467, 91, -62, -100, -235, -8, -157, -211, 6, 9, 379, 40, -373, -46, 135, -249, -1, -52, -10, 94, -223, 96, -49, -13, -175, -90, -381, 176, -161, 0, -82, -356, -114, -86, -184, -49, -144, -408, 65, -341, -234, -126, -81, -610, -11, -145, 354, -328, -281, -281, -366, 9, -352, -196, -560, -473, -237, -8, -95, -24, 219, -333, -40, -156, -25, 38, -41, -411, -114, -189, -262, -74, -19, -245, 19, -55, -294, -189, -127, -459, -32, -244, -290, -175, -12, -30, -247, -143, -357, 166, 55, -119, -365, -309, -310, -452, 0, -245, -174, -209, -560, 18, 40, -280, -337, -136, -194, -93, -310, 226, -103, -5, -122, -57, 48, -421, -431, -344, -190, -130, -40, 77, -220, -82, -442, -195, -75, -397, -309, -145, -179, -178, 19, -12, -232]
73795b32J87j31J64l32K49J0R1ok15J78O7P4r8p4J81m50K60j93L29o3k28J16
75142a16k13N43k25k37J58k02Q5O3O3R1r5R2j52M09j80l7m65M08l96O9J54m30
76483f13K19j2L99K71j68L27m05q1N0K23J03k26L51n60K36J87m3J2l22J53l54
77763b53J92K72k00P8k05J19M01l63Q8p4J43j34L51k52L35l99O13m59J1N2L5
79042C51K31PO7j37J12m4M05J23J12j66j6m69k16k58k0J54K14J20J78j58j63
80329D27l91M36l25Q5oL24J70m27K10O2K34J62K87l79M8k48k21n97K57l76M40
81608A72P55J42o55l92j52k12o8k20m9k84L31m02k2N0L65L48M61k54J36j67K09
82888I2L29j5m17l96j60P60K96J86j9k54J70N27O80k93n43k38m77M5Q8K83m36
$$ y = [-232, -45, -176, -12, -344, -95, -85, 6, 0, -215, -37, 30, 104, 6, -68, 113, -337, -77, -270, 59, -4, -232, -116, -329, 214, -11, -248, -90, -292, -207, -144, -81, 10, -85, 7, -145, 264, 84, 47, -418, -10, -406, -337, -183, -613, -394, -406, -7, 264, 96, 423, 18, -63, -13, 210, 313, 87, 438, -122, 114, 301, 258, 270, -52, 101, -253, -61, 211, 11, 89, -116, 3, 404, 41, 129, 55, 198, 64, 415, 163, 498, 99, 712, 253, 264, 316, 351, 582, 589, 656, 519, 631, 587, 992, 1115, 1227, 1061, 1045, 576, 360, 102, 82, 236, 450, 570, 748, 590, 427, 36, 472, 147, 232, 226, 550, 720, 293, 503, 565, 799, 961, 1248, 869, 917, 669, 448, -149, 108, -268, 172, 927, 1069, 414, 22, -130, -342, -410, -630, -679, -963, -632, -1034, -1056, -1006, -641, -293, 168, -86, 50, -117, 92, 421, 406, -11, -407, -567, 193, 489, 675, 656, 402, 572, 1099, 1779, 1486, 943, 705, 228, 273, 361, 644, 208]
84174B08m07K37M17O08J3k99n01K90l82J27n18K43J09m93n1q1K68M48K0k64J74
85454A66Q9K48r8K27J31j38n95M25n3Mj13O9j90qJ82k20K09j44O6l22PO00k13
86855C29L53l42j08L7J85P9J84j30q2k49o6k44L55m12K78o4J70N39l77J35j7
88143E53K2k32j07M1k56L63j07L45k73p4K04N0nl53K72j59J09r3K55L09j81K87
89484I70n53R7j67l1r5K66k8K05l57J36J12J64k1k89J93k04J83M6J6J84j36l70
90824C21K38L32j57K0j20K16j71J23K4j96L94n54K75j81M04j27J92l60j31K27
92050G69j54M41J4m31M57Lk21Mk32N8K12j09nJ87J20m58J79P9k45J31Q6j65l2
93451F88K58k30K33q8K18j5r5q1k09M49j06k40K30J8k41J12J80l44N30l29K69
$$ y = [208, -199, 38, 455, 1063, 1076, 777, 276, 566, 184, 311, -207, 36, 145, -348, -399, -480, -212, 236, 256, -8, 166, 255, 503, 405, 632, 763, 625, 30, 455, 402, 406, 293, 362, 172, 164, 346, 126, 335, 191, 257, -65, -58, 542, 329, 682, 340, 232, 269, 454, 533, 717, 587, 505, 256, 190, -54, 301, -111, 167, 103, 273, 812, 435, 570, 553, 575, 343, 236, 277, 21, 384, 277, 622, 349, 275, 479, 529, 524, 171, 443, 284, 393, 300, 555, 864, 683, 970, 417, 514, 347, 316, 221, 487, 459, 664, 307, 443, 555, 719, 698, 409, 602, 398, 581, 627, 643, 827, 691, 321, 559, 891, 734, 754, 634, 850, 679, 802, 826, 630, 1024, 470, 745, 564, 968, 841, 1033, 673, 542, 769, 615, 1056, 1070, 639, 1096, 1099, 878, 882, 650, 708, 920, 811, 806, 993, 1113, 655, 834, 913, 668, 799, 885, 720, 688, 946, 716, 949, 861, 1079, 1064, 969, 888, 679, 1128, 1022, 782, 1012, 1030, 789, 901, 1081, 737, 1267, 938, 1207]
94731A207R9J35%j98n1l71K27J39K30l54j8J80L8R3M61r6M7M60j40j57k69P67
96072B429n49R8m12K28p4o2M39K55l76O6M02p58N27N22R10l9m33j544N44m91
97297A682L70K83k40k79k6R4q1K90k36K07l16N0K2K53R66l4M33l42r49J71K08
98576B526J00O36L7k04o33q48M76o0k00o0k04k6j69K42q4O2m4M58n9jO8J28P6
99978B217K79L4m12j18J23j57k86j82L65j35m8qq5N99m44j6O0q1J24j0k36Q7
101327A670K68k78K89l08M11m13J99j64J51J43m47L82l28J95M6O5K45m94M89j83
102545A938p0P0J38Q1l36K3l43K01K37k04L48j0L08p9J46n89Q0LP6n6l17K70j28
103947A787L32k97j88R7J20j72K10p3J95l24L07j5qkL38m90L32j57k82K69n4l33
$$ y = [1207, 1306, 1441, 1441, 1243, 1192, 821, 1048, 1187, 1417, 1063, 1045, 1225, 1263, 1356, 1817, 1721, 1768, 2228, 2088, 1931, 1662, 2429, 1880, 1978, 1566, 1794, 1720, 1658, 2097, 2352, 1976, 2042, 2444, 1686, 2213, 2735, 3645, 3606, 3173, 1629, 2173, 1682, 2052, 2335, 2095, 1816, 1790, 1884, 1803, 2093, 1857, 2064, 1748, 1798, 1820, 2073, 3039, 3005, 3438, 3096, 2147, 2318, 2526, 2626, 3262, 3299, 3095, 2462, 1614, 2090, 2030, 1830, 1770, 1566, 1540, 1371, 1613, 1529, 1591, 1547, 2005, 1946, 1945, 2013, 2141, 2217, 2496, 2530, 2118, 2000, 2123, 1966, 1680, 1498, 1863, 1728, 1680, 1672, 1587, 2186, 1742, 1726, 1786, 1705, 1829, 1819, 1583, 1670, 1938, 1660, 1949, 1641, 2052, 1639, 1838, 1674, 1825, 1968, 1521, 1903, 1575, 1770, 1816, 1881, 2126, 1632, 2121, 1938, 1868, 1938, 2076, 2157, 1821, 1844, 1501, 1702, 1939, 1735, 2083, 2073, 2381, 2302, 2448, 1859, 1939, 1942, 2018, 1962, 1645, 1915, 1787, 2119, 1822, 1634, 1731, 1851, 1679, 1889, 1816, 2011, 1687, 1994, 1979, 1971, 1969, 2307, 1817, 2149, 1992, 1710, 1979, 1925, 1592]
105295A592J27M80l35J56J22k78K50k9K8j19K9M34k51J36N19N80L8J408J339K82
106513F508L7J19O27j65j154l00k084M30L29R64J376p0n2N48j53J01j664j022
107609D375k231K42k63J66k11J74r1M02K11j38K67M13j99j90o5j03k67L61J9P86
108834C658M00R5J665J046Q43J10J88o06j428j209k24L06O9m41J347Q96O77O14
109929H006l89o68j962o94P2o85j10l02K52j20L10l31K40J83l08j01J47j8m0j85
111148C297K41j01M71N3J38m40j47N86k3J40n38J62M0K59M9O68l77K27J44j81
112373D668M17o0m58K91j61N77n17J18m9m73N78j16L49m90J09n9K20j29K6K14
113591E055k04j30M34J03q5P3M30j6j17o3j9P7J79j05j30K03j43J19k8J36m71
$$ y = [1592, 1719, 2199, 1864, 2020, 2142, 1864, 2114, 2085, 2113, 1994, 2023, 2457, 2206, 2342, 2861, 3441, 3479, 4887, 6226, 6508, 6545, 6664, 7291, 7126, 5972, 5672, 3588, 4018, 4347, 5311, 6687, 6617, 6565, 7113, 6960, 7061, 5397, 4375, 2144, 2386, 2123, 2289, 2078, 2252, 2161, 2563, 2774, 2636, 2903, 3316, 3117, 2927, 2862, 2759, 2492, 2853, 2872, 3658, 4058, 4153, 5818, 6864, 7707, 7817, 8005, 7399, 5971, 4762, 4538, 4844, 4913, 4472, 5819, 6715, 7392, 8006, 7617, 6949, 4987, 4293, 4365, 3680, 3570, 3268, 3520, 3400, 3710, 3379, 3619, 3802, 3494, 3393, 3540, 3522, 3482, 3297, 3538, 3437, 3908, 3961, 4099, 3659, 3512, 4098, 4075, 4215, 3677, 3839, 3879, 4138, 4187, 4855, 4478, 4705, 4849, 4668, 5085, 5025, 4567, 4858, 4697, 5274, 4757, 4875, 4826, 4353, 4931, 4815, 5164, 4674, 4783, 4724, 4944, 4815, 4841, 5055, 4851, 4721, 5155, 5258, 5173, 5246, 5676, 5660, 5543, 5480, 5461, 5538, 5717, 5612, 5482, 5685, 5542, 5661, 5633, 5769, 5298]
114879E298K07M46k5K15L10k47L05J55J29N11K12Q66L87J312J491k14p81r52k60
116035I365k74p39L59r7Q57N87J544K147j732q26o34k05l44n90%k84J71K63j47
117192I421Q5Q4K47N3k0L68k93M42r0j80J70J67K95J44M29m9L67M83q12M24L50
118479A2085K7K02K01o8N47N16K57K18o5J33L74N34Q8K10J06L09N81r5J80K60
119697A6600J68M43N50jJ384M63J267L81j78N61O18J183R18L17J81O57M40j59
120793B5793M86L71J266J35P40J189J186J673J551K918J685L060N832N448M770
121713E8103M253O926O931N690N683Q102K4051M2573N5350P1401J58739K10758
122440F58560J69367l6622K6929J67584j18245m4801j63472k44311j13457O0227
$$ y = [5298, 5505, 5951, 5926, 6141, 6451, 6204, 6509, 6664, 6793, 7304, 7516, 8382, 8769, 10081, 11572, 11358, 10577, 9625, 9365, 9091, 8352, 8711, 8614, 9471, 10058, 11602, 13749, 12017, 11191, 10557, 10352, 10008, 9418, 9418, 9134, 9305, 9568, 9421, 9506, 9590, 9837, 9890, 9870, 10238, 9945, 10387, 10297, 10117, 10287, 10454, 10749, 10893, 11322, 11273, 11640, 12123, 11311, 11735, 12085, 12112, 12314, 12515, 12447, 12994, 13510, 13767, 13985, 13920, 14053, 14427, 14961, 15049, 15259, 15365, 15674, 16255, 16160, 16340, 16600, 16768, 17211, 17761, 17760, 19144, 19607, 20874, 21255, 21077, 21638, 22256, 23439, 24357, 24674, 24855, 25512, 25952, 25793, 26279, 26650, 27916, 28051, 28791, 29980, 31166, 32839, 34390, 37308, 38993, 42053, 47885, 53333, 58103, 62356, 69282, 76213, 81903, 87586, 95688, 119739, 162312, 217662, 289063, 447802, 658560, 827927, 791305, 818234, 985818, 867573, 822772, 659300, 414989, 301532, 361759]
123052C61759J78265K40209M3071j0681M4761Q6717m2263j62063r6737m65267
123665A77771l3277j5133j4001q318l716l017l698m158l790k357l026l068n050
124462G5162l781j457k252j961j081nL44l92j091p66l47R6J74N12l3l61m21p19
125557F1621m37l07O2O82R14O69K906j666r94p56p76j040q65j89l97J71k87J229
126653F0540J561k780j758j813j664j367j520j503j728j280j501j201j325j404
127510D1257j131j241j195p82j064j011j182o72m78j188q41j082n30r77o69q45
128484B6369m65n58p8o20p64m6n38m25l84K34k2j134n47o3l99k33j92k11L2p4
129709A9882M13O80q44l49k58l34O1j23k49q7O64l67k46J48j00N26k81m70Pl20
$$ y = [361759, 540024, 780233, 823304, 812623, 857384, 944101, 901838, 739775, 643038, 177771, 144494, 129361, 115360, 107042, 103326, 100309, 96611, 92453, 88663, 86306, 83280, 80212, 75162, 71381, 69924, 67672, 65711, 64630, 64625, 64969, 64577, 63486, 62720, 62373, 62469, 62643, 63155, 63122, 62761, 62340, 61621, 61184, 60877, 60939, 61621, 62535, 63204, 66110, 64444, 63450, 62694, 61918, 60878, 60013, 59824, 59427, 59598, 59311, 60540, 62101, 59321, 57563, 55750, 54086, 52719, 51199, 49696, 47968, 46688, 45187, 43986, 42661, 41257, 40126, 38885, 37690, 36908, 35844, 34833, 33651, 32979, 32501, 31313, 30472, 29390, 28860, 27883, 27214, 26369, 25904, 25346, 25268, 24648, 23884, 23838, 23300, 22875, 22491, 22725, 22703, 21569, 21022, 20959, 20560, 20327, 20135, 19924, 19956, 19882, 20295, 20975, 20131, 19782, 19524, 19190, 19251, 19128, 18879, 18792, 19456, 19089, 18843, 18991, 18891, 19417, 19136, 18666, 18673, 18353]
130928A8353m98j088M07n73l22r9J96n82J35MOkl91J08J68k16k77m12K3j07J3
132207A4846K5k74k45R7Pn84o4n3n45o8k07j11M89o08Q4L20o89j72k09mn03q1
133555A1451M8l78j05J76l44k60J79k84j84l9l75J61J08l60k53n90P5q8R8m0m00
134834H596k6k2Q5N5Q9j65J62J48J31N22N96J498K685J469O66m71j689m167k319
135992G843r87k36j71n00N3r7l69K02q1J1l23l91Kl76J52Q4l03L68k18R6j26N72
137339E205l40n88L7M19n2L1r9K79k40M47J59O65R17R13J383q57N26Q55q49k89
138558H522j064j716k92j5R02J539M27l65L45O50m43r35k87k918k21k71K63l99
139654C722j78J06l4L7k21j59O8m54J86O9J77j64j95k40K94j7l10j26J2m0o3k05
$$ y = [18353, 17855, 16767, 17174, 16601, 16279, 16180, 16376, 15794, 15929, 15933, 15939, 15937, 15546, 15654, 15822, 15606, 15329, 14917, 14940, 14833, 14846, 14871, 14597, 14352, 14449, 14456, 13872, 13808, 13755, 13210, 13142, 12935, 12824, 13313, 12705, 12789, 13109, 12420, 12248, 12039, 12035, 11532, 11451, 11499, 11121, 11016, 11192, 10848, 10588, 10767, 10483, 10299, 10260, 9885, 10046, 10154, 9794, 9541, 8951, 9026, 8938, 9036, 8996, 8596, 8570, 8548, 8633, 8688, 8777, 8612, 8774, 8922, 9053, 9575, 10171, 11669, 14354, 15823, 16489, 16018, 14329, 10162, 7843, 6856, 6620, 6449, 5949, 6002, 5905, 5536, 5738, 5657, 5668, 5345, 4954, 4956, 4580, 4732, 4816, 4513, 4881, 4663, 4759, 4633, 5205, 4865, 4277, 4314, 4733, 4681, 4712, 4613, 4892, 4652, 5099, 5258, 5923, 6840, 7753, 9136, 8279, 8805, 9660, 8811, 8522, 7458, 5742, 5450, 5435, 6337, 7876, 8303, 7938, 8283, 8933, 8490, 7555, 7268, 4350, 4129, 3858, 4121, 3722, 3544, 3650, 3616, 3653, 3432, 3273, 3341, 2887, 3073, 3142, 3319, 3155, 2960, 2720, 3014, 2997, 2687, 2561, 2573, 2533, 2470, 2265]
141001B265J30Oo8K39k67J96o56j7K27Q1l57L34l10l7K42Ko4k55l0l3l81L34J24
142403A705j87Q8l40J32j71O6O3k01o07K150j457J88k44J15k06P7k96J1l7p0j52
143683F27J60l0j3j94M5r3K94k83l3p4J52O3l0j23J40n68K59p9m5J95j4m18L31
145092B69L7j70O1o7qj26K84j89k01K46m26J73n7l2K19l66M62o57M24k76J67m02
146433f35K68N4j63kJ77m28L73J16m08Q3N2l58N25k31K77k99J89k58n07N81j28
147713g22J5j49O03n34R9J92l99Q6J64k17K0m87L13L31k4Pm63Q0J28j62K28l15
149060a206J88L06m96L92k17r5r7L06j88Rk25K07O1O7k88p6K59q0j34K11J58j37
150401a075j89k80mK40L57n54L16J89j48M6j7m66J33J9J87n7k3J31k76J95j67
$$ y = [2265, 2395, 2401, 2333, 2572, 2305, 2501, 1845, 1828, 2055, 2136, 1779, 2113, 1803, 1766, 2008, 2010, 1946, 1691, 1661, 1628, 1247, 1581, 1705, 1518, 1606, 1266, 1398, 1227, 1293, 1356, 1155, 548, 2698, 1241, 1429, 1185, 1300, 1094, 1171, 875, 886, 849, 779, 627, 787, 757, 744, 550, 595, 502, 796, 513, 480, 406, 558, 621, 591, 468, 608, 40, 299, 220, 175, 370, 356, -62, 269, 306, 136, 197, 130, 122, -4, 280, 91, -110, 136, -290, -117, -174, -206, 13, -353, 109, -548, -124, -400, -233, -635, -367, -313, -476, -478, -301, -729, -356, -240, -648, -565, -513, -871, -346, -577, -300, -599, -410, -668, -1175, -594, -722, -707, -856, -253, -787, -688, -496, -895, -809, -645, -862, -842, -1329, -1016, -685, -709, -702, -1165, -1085, -957, -1119, -891, -1206, -1018, -712, -1208, -816, -1033, -1128, -1225, -919, -1107, -1098, -1323, -1116, -1055, -988, -1276, -1352, -1093, -1173, -1307, -1096, -938, -1075, -1264, -1544, -1548, -1308, -951, -1505, -1189, -1000, -1148, -1102, -1119, -1585, -1452, -1433, -1246, -1303, -1326, -1195, -1471, -1276, -1443]
151680a443l93M62j92K2N4L1k4k74L11j36l4O5J63M5r9J86l00K66m6nk65q2K37
153082a451M9M34p57K34K23k32p4o6q9q3j09J30K80l17J14k51K15K07j94K44j84
154370a677q9l4M7r4L29j67m23O01l41q8L41k91J55P2j37m2M68p28N01k21K22
155648a596P6j68j22K39Qn76L98r1k58J32M36r6Q6m11M99n28K06R2K73l44k11
156929a956R0j32K64l57Q9k45M23N0O4P9k42k22Q7N42O2n87L95j18k96K58j74
158215a926L01k08k7rj62mk81LK07k93m54O28K75J43K53q2l03J53L84l96L85j57
159556a570L08m41R0o18m9k2K19j5m6J18Q2M45n90l77j35O76L9K01O4k24K94j62
160897a713k93l87l2K45P53K9m67o61M75k20M71j68l1O7M77j56j66l5p72p5j415
$$ y = [-1443, -1836, -1374, -1566, -1544, -1490, -1459, -1483, -1757, -1446, -1582, -1616, -1551, -1388, -1343, -1442, -1256, -1556, -1290, -1336, -1341, -1606, -1688, -1451, -1402, -968, -1725, -1491, -1268, -1500, -1574, -1640, -1729, -1812, -1921, -1791, -1511, -1828, -1714, -1965, -1750, -1543, -1737, -1493, -1677, -1766, -1800, -1753, -1847, -1518, -1685, -2108, -1507, -1848, -1936, -1595, -1886, -1731, -1659, -1796, -1838, -1370, -2098, -1597, -1818, -1596, -1520, -1688, -1810, -1571, -1563, -2139, -1741, -1832, -2090, -1958, -1522, -1618, -1532, -1943, -1444, -1972, -1766, -1674, -1401, -1745, -1956, -1866, -1998, -1734, -2091, -2002, -2247, -1824, -1774, -1710, -1631, -1873, -2095, -2008, -1466, -1404, -1991, -1596, -1714, -2010, -1752, -1926, -1625, -1833, -1860, -1869, -2031, -2035, -2316, -2313, -2106, -2399, -2853, -2225, -1950, -1807, -1554, -1636, -1939, -1786, -1402, -1798, -1413, -1570, -1262, -1703, -1613, -2231, -2280, -2302, -2083, -2098, -2144, -2026, -1944, -1499, -2089, -2466, -2601, -1925, -1886, -1685, -1621, -1845, -1551, -1713, -2006, -2393, -2425, -2180, -1427, -1398, -1865, -2526, -2051, -2271, -1800, -1968, -1999, -1932, -1455, -1611, -1777, -1812, -2584, -2659, -4074]
162183d074j207N18Q6P46P06N14j061J536J987J338j08j561j582k2K33J08k54
163218b097m14J48J809J472O48K7M11m69k39j041n78n47j05J52On05r67L13P21
164374a255m30J62k01J32l0K57l56J42K87k80j83j29J70R2J65l57R4l21M00J61
165599a480L7L6r4M23j14j42l6k70j51J52k67p8l41L9K73o0n4R2Jp1J96j64L33
167002a740K10k28j35J83q8K21m21m5L00m77k04L14N2q9J21r3J94k13K11n23N24
168282a926p0j45M16j01j80J67m69M30L00m58L90l74om2K77k29J26J51k30J55
169507a818J56n86K27P1K40l78N01k93m52K47L68n6k71M62n46L72k91K15l53K13
170724a972N9j77k07J95L01k34J45l0r5K08n46K92j3m2Q2J48j5R2k62J84j03L56
$$ y = [-4074, -5281, -4763, -4677, -3931, -3225, -2711, -3772, -2236, -249, 1089, 981, -580, -2162, -2184, -1951, -1843, -2097, -2511, -2363, -554, 918, 1566, 1593, 2004, 1535, 1296, 255, -323, -870, -975, -823, -817, -1322, -2289, -1976, -1255, -1685, -1523, -1724, -1592, -1622, -1365, -1721, -1579, -1292, -1572, -1755, -1884, -1714, -1622, -1457, -1814, -1720, -2041, -1641, -1480, -1443, -1407, -1501, -1078, -1192, -1334, -1370, -1640, -1791, -1639, -1906, -1984, -2325, -2286, -2013, -2073, -2127, -2035, -2034, -2105, -1909, -2073, -1740, -1530, -1758, -1893, -1710, -1798, -1577, -1998, -2043, -1743, -2220, -2424, -2110, -2058, -2147, -2026, -2119, -1925, -2138, -1927, -2450, -1926, -1996, -2141, -1725, -1826, -2006, -1839, -2308, -1878, -1578, -2036, -1646, -2020, -2026, -2068, -1791, -2020, -1894, -1743, -1973, -1818, -1662, -2248, -2021, -1950, -1710, -2088, -1587, -1880, -2332, -2085, -1717, -1773, -2044, -1582, -2128, -1756, -2047, -1832, -2185, -1972, -1913, -2090, -2297, -2102, -1801, -2035, -1890, -1920, -2015, -1807, -2353, -2061, -2074, -2116, -2034, -1886, -1901, -1809, -2071, -1887, -1990, -1634]
172066a634m91K38o0L14k12r9M17n8j70J24J05m4k57R9K73j185O39k78K38K31
173291a810k95M26j64l0j84k25J91L57J39n23J09Q6k83M66o39K48O10n03kk8K49
174571a805k80K68j33k2L2k50L22r6L2K0rk38J95J21o4J6j59O7J8L9k68N02k03
175973a895J91j94L17k92j30M17k77L8k71K8k92J58L93k48n0J97J8j14J1M00k00
177259a795q9k35J54o4K29k69o7L37j40J77k32j4K27P4l39P3J20q4L0j0k25K15
178600a927k31n2J74R8J50j35k20J41O0P7k34j02P20j53l85j15mL50j04K41n26
179879b177P7M9J0m95P85k23R1j15k46M66m7r4l78M55k08M96l4kl31l27O4K36
181228a948J38j26Q4l12M02l17R6p7J99k41N2L65n8q5p7M7o2p8P8L98k48j30J2
$$ y = [-1634, -2125, -1887, -1947, -1633, -1845, -1944, -1527, -1585, -1755, -1631, -1526, -1570, -1827, -1728, -1455, -2640, -2001, -2279, -2041, -1810, -2105, -1679, -1843, -1873, -2057, -2282, -2091, -1734, -1595, -2118, -2009, -1923, -2206, -1740, -2379, -2131, -1521, -2024, -2026, -2054, -1805, -2085, -1817, -1950, -1972, -1940, -2190, -1868, -1964, -1932, -1912, -1921, -2159, -1964, -1843, -1907, -1891, -2050, -1983, -1965, -1926, -2194, -1692, -1895, -1704, -1898, -1581, -1873, -2003, -1586, -1863, -1825, -2096, -2068, -2360, -2202, -1809, -2057, -2107, -1910, -1892, -2006, -1995, -1595, -1795, -1884, -2119, -1965, -2029, -1800, -2069, -2136, -1799, -1939, -1762, -1994, -2008, -1781, -1707, -2046, -1973, -1853, -1937, -1907, -1917, -2142, -1927, -2158, -2210, -2036, -1938, -1788, -1923, -2143, -2002, -1942, -1865, -2099, -2201, -1481, -1634, -2019, -2134, -2138, -1788, -1892, -1651, -2177, -2100, -2051, -2041, -2536, -1751, -1974, -1883, -1998, -2244, -1778, -1825, -1919, -2297, -1842, -2050, -1554, -1588, -1590, -1921, -2248, -2184, -1948, -1810, -1936, -1852, -2164, -1762, -2079, -1983, -2060, -1861, -2102, -2050, -1685, -1743, -1828, -1905, -1858, -1920, -1998, -1920, -1522, -1770, -1900, -1888]
182630a888M16o8m04K36k13P2l25K35M10j74K29j83L67n6j17Jk78o5j07k76M12
183908a776j13L7m45M55j75K81k89n2J32l1k33J20m13O87q3q8p7N02j81j12M8
185189a806j00J42l52J66j08J94J34l53m5L59l38L86j03r0J08j7j85K98l35N8
186414a987j52N43l64k0j62k6j1K73J15j76J65L0n3k94K82j80K60O5o3p0j64m38
187755b427N31k02K4R4Q5L58j48j12k94J06J07o15L58J44j1K25m31N44l44Q9K7
189034a892j17P6N2J15J28p74O21k93J86j11R4j24R6J71q9Q8Mj14K12k83k3K15
190382a762O7k67L46m76M3K55Q4p3o1p6j60J09J21k14L28l0k88K15j19j53J68
191662a943K20k52K98l95K44j44j04K07J0M0j5k95K22j24P3K09l9K7j02q1R1J70
$$ y = [-1888, -1472, -1540, -1944, -1708, -1921, -1849, -2174, -1939, -1529, -1703, -1474, -1657, -1290, -1346, -1463, -1462, -1740, -1805, -1912, -2188, -1776, -1889, -1852, -2297, -1842, -2017, -1736, -2025, -2077, -1945, -1976, -2209, -2089, -2502, -1815, -1898, -1986, -2063, -1561, -1742, -1854, -1806, -1906, -1764, -2116, -1950, -2058, -1864, -1730, -2083, -2128, -1769, -2107, -1721, -1824, -1914, -1806, -1823, -2008, -1710, -2045, -1987, -2139, -1596, -1960, -1980, -2142, -2168, -2179, -1906, -1791, -1967, -1802, -1772, -1825, -2119, -1837, -2017, -1757, -1692, -1755, -1825, -1989, -2427, -1896, -2098, -2074, -1980, -1895, -1537, -1685, -1797, -2091, -1985, -1878, -2493, -2135, -1991, -2002, -1777, -2208, -1664, -2008, -1919, -1892, -2009, -1933, -1881, -1766, -1638, -2412, -1791, -2084, -1898, -2009, -1915, -2039, -1943, -1772, -1861, -1773, -1769, -1883, -1671, -1954, -1977, -1762, -1695, -1962, -1616, -2092, -2049, -1794, -1710, -1783, -1844, -1920, -2080, -1971, -1850, -2064, -1736, -1766, -2054, -1839, -1958, -2111, -1943, -1723, -1975, -1677, -2072, -1828, -1972, -2076, -1869, -1859, -1819, -1834, -2129, -1907, -2031, -1958, -1749, -1788, -1761, -1863, -1944, -1853, -1683]
193002a683k06o8J47q7J88k26L34o03j6L35l57L02l64K79K51k44L29j18p3Q1J92
194290a607j51j69P0l42L37k30J89k1j49L8j46J68K65o7K1n7k73j14J77p4J30
195568b005J95k83p1K11j81l38N71n3Q5nl53K40K07J6m06J33m9J00J66l39L10
196848a849k43L04M18l40L64m19j60P3L14j71j66J40k37m0N02k04k22L07k27P9
198074a777J25l63K7k1J87P5K71j37o9k27Q6k56K54l4M2NJ81O0n1n51R6J43L31
199476a603k21L03m03J09k05J52M99p20J46m4m3K63L00q7k62j48k2L75l50l1J5
200754a977l7L08k36O4L89k32K29Q3Q2j10pP4k26o9l59J5M4L43j47p3p5j47K05
202164a859J01R8o37L73j20J23K90k34j00j47l46K34N73k157J778k00q6J44K93
$$ y = [-1683, -1889, -1957, -1810, -1897, -1709, -1935, -1601, -2204, -2220, -1885, -2242, -1940, -2304, -2025, -1774, -2018, -1689, -1807, -1880, -1799, -1607, -1758, -1927, -1857, -2199, -1862, -2092, -1903, -1924, -2073, -2035, -2181, -2013, -1748, -1815, -1794, -1851, -2124, -2238, -2061, -2135, -2005, -1810, -2093, -2164, -1953, -2134, -2472, -1901, -1954, -1869, -1874, -2227, -1987, -1780, -1764, -2170, -2037, -2086, -1986, -1820, -2159, -1849, -2092, -1788, -1370, -1710, -1346, -1765, -1925, -1852, -1538, -1709, -1875, -1735, -1972, -2012, -1510, -1714, -1936, -1629, -1856, -1777, -1652, -2015, -1988, -2009, -1822, -1747, -1476, -1613, -1682, -1909, -1823, -2079, -1825, -1859, -1817, -1812, -1631, -1571, -1622, -2173, -2077, -1934, -1603, -1824, -1521, -1924, -1815, -2020, -1868, -1369, -2089, -1943, -1987, -2030, -1767, -1467, -1554, -1816, -1964, -1986, -1611, -1961, -1992, -1977, -2014, -1706, -1942, -1878, -1489, -1721, -1492, -1409, -1327, -1437, -1444, -1370, -1596, -1665, -2024, -2009, -1965, -1622, -1769, -1842, -1917, -2064, -1859, -1758, -1660, -2297, -1924, -2044, -1921, -1631, -1865, -1965, -2112, -2458, -2224, -1651, -3808, -2030, -2230, -2316, -2172, -1879]
203321a879O9P1m46K81J04K49l1k07M5j89M08j87j24J02L48j5M5l74J59K44j76
204601a503r0j08M20J43l65L80p69L37o2k36j6n4l21M03J17j99K3J35k64L55n1
205887a725J33J99k34o85Q05J06J5J7Lk30k41L92m19K80l34M11l21J78M42o69
207106a877lJ96J35l36O14k07o9p2l78K16p0K37J75o9k59P3J9l8r9K69k94l20
208446b157O42j38l5j11j57L69j58j21R1j31k37K86k0Q0n48P86j66J97j60mJ59
209726a533r2J59q1j51m3k05N13k44K76j12j24m04J95Q4N07o96J75O6j16K24k
211012a604k73O2J73j32R4N1j52K34J03m6k76j38N3m4J63J88j00p6K01k98k95
212292b112K13J1L9R4q1P0p7j52N28j7j71j50K56j71j81L17O0l10J92j05k8K60
$$ y = [-1879, -1810, -1739, -2185, -1904, -1800, -1551, -1582, -1789, -1744, -1933, -1525, -1712, -1836, -1734, -1386, -1401, -1356, -1730, -1571, -1327, -1503, -1593, -1701, -1281, -1138, -1503, -1123, -1892, -1555, -1617, -1853, -1869, -1923, -2244, -1841, -1724, -1923, -1900, -1765, -2029, -1674, -1725, -1592, -1393, -1627, -2312, -1507, -1401, -1386, -1369, -1366, -1596, -1837, -1445, -1864, -1584, -1918, -1507, -1828, -1650, -1208, -1877, -1880, -1684, -1549, -1885, -1271, -1478, -1547, -1619, -1997, -1781, -1851, -1614, -1439, -1508, -1767, -1694, -1675, -1713, -1812, -1543, -1837, -2157, -1515, -1653, -1688, -1799, -1956, -1587, -1745, -1866, -1775, -1906, -2143, -1857, -1877, -1797, -2345, -1559, -1725, -1528, -1688, -1692, -1533, -1625, -1466, -1547, -1698, -1741, -1946, -1433, -1677, -1401, -1513, -1637, -2041, -1846, -1762, -1255, -1951, -1776, -1710, -1826, -1602, -1604, -1877, -1815, -1642, -1774, -1680, -1629, -1781, -1547, -1444, -1490, -1766, -1904, -1851, -1895, -1732, -1544, -1644, -1720, -1519, -1817, -2112, -1899, -1888, -1849, -1755, -1836, -1766, -1843, -1995, -1467, -1484, -1655, -1805, -1549, -1720, -1901, -1584, -1524, -1834, -1642, -1747, -1775, -1515]
213633a515n20J61J86K43k80k76L46P2j00q6j5j21J33Q9J4N5l77N21j59l09K76
214919a662L74n21J62j33L09l23O7j17K55k15j0J20N5l49K27L21j16Lkq3J24N1
216261a463J0l19K32o3J10k83q7P4o2N5n0K13q3j49p3J28n6K50%p0J31m3k53K22
217724a629Qj18J89J0J54j72k67L19j6j53l58J31L39k69K03K13n41K17l31P41
218949a330m26n0K31R0k33r9O0r0L07l09M90j19j39j82j15J88R5j21K43l97L37
220229a569P3M8l43k39K46R4k3J62K06n81rM72j78JN5j82k4L20k65L21n02K50
221569a667r3k15L19M9p6k4j01M4M3k59L79L1l06K33J32R3l07K26m28N1K10R5
222917a571l1k1P6Q1j19O8k34M14k12J58kj81K04j71j49r4L48K48l49p6L8k41
$$ y = [-1515, -2035, -1874, -1688, -1445, -1725, -2001, -1655, -1583, -1683, -1769, -1784, -1905, -1772, -1683, -1669, -1614, -1991, -1470, -1629, -1938, -1662, -1288, -1809, -1647, -1780, -1471, -1794, -1727, -1844, -1589, -1804, -1814, -1694, -1639, -1988, -1761, -1440, -1556, -1553, -1555, -1638, -1514, -1463, -1453, -1772, -1540, -1603, -1493, -1776, -1863, -1789, -1851, -1796, -1846, -1633, -1716, -1865, -1938, -1810, -1866, -1616, -1616, -1686, -1555, -1598, -1851, -1629, -1621, -1739, -1550, -1540, -1386, -1558, -1825, -1506, -1522, -1675, -2033, -1902, -1563, -1832, -1629, -1416, -1957, -1740, -2071, -1330, -1756, -1806, -1575, -1485, -1718, -1817, -1757, -1847, -1540, -1849, -1359, -1478, -1617, -1799, -1914, -1726, -1631, -1752, -1509, -1906, -1569, -1496, -1448, -1791, -2030, -1784, -1690, -1713, -1551, -1345, -1926, -1935, -1463, -1641, -1640, -1585, -1767, -1791, -1471, -1736, -1415, -1917, -1667, -1760, -1975, -1656, -1607, -1683, -1707, -1808, -1764, -1721, -1980, -1601, -1570, -1876, -1643, -1511, -1418, -1725, -1499, -1927, -1876, -1666, -1571, -1602, -1623, -1547, -1466, -1585, -1517, -1751, -1337, -1549, -1391, -1393, -1574, -1370, -1541, -1690, -1784, -1436, -1188, -1537, -1613, -1575, -1816]
224259a816N38j73j37k57J36k6R1p7L3K43l96M52l41j17m1Q1o3L82j23J81k84
225537a714K2N11k89m9j8j15n5j08J28J18k11o2K36r9J56k35R2L94k09j13o4o7
226878a751Q4K67k8k36QK34l33J33q1M7J34P7m7k20O1n8R4J44k24J20j05j65J09
228288a736J36K06J65k67k98K55N9J72n20L28j48j47L14j83kK22k47j89J90R5
229506a595o7J08K53m58M71r5K16k17m80J72j55J61R4J29n91N32R9j69J12M6j17
230784a551R8k91J31k1j45L05l95K82J5MJ14j63K03m43J05J41N6k64M18J6k97
232072a682%M02m23N6j26r8K31n3n2J7j86P1J13j91q72K519j008j2J54m11J2k49
233413a788K97j94K90k53Q9Lj80L03J1oK04m51M74l99j75K95j04k8J18j02J30
$$ y = [-1816, -1278, -1451, -1588, -1845, -1709, -1735, -1644, -1721, -1688, -1445, -1841, -1389, -1730, -1847, -1888, -1807, -1870, -1488, -1611, -1430, -1714, -1692, -1181, -1470, -1519, -1537, -1652, -1707, -1815, -1687, -1569, -1780, -1842, -1606, -1705, -1549, -1784, -1692, -1298, -1507, -1620, -1684, -1751, -1667, -1400, -1428, -1664, -1656, -1422, -1755, -1622, -1703, -1656, -1522, -1445, -1492, -1712, -1651, -1709, -1615, -1471, -1695, -1575, -1680, -1845, -1736, -1600, -1394, -1229, -1496, -1794, -1539, -1480, -1308, -1828, -1500, -1648, -1795, -1481, -1664, -1666, -1444, -1691, -1880, -1690, -1595, -1662, -1554, -1301, -1759, -1288, -1383, -1167, -1384, -1864, -1692, -1847, -1686, -1592, -1463, -2054, -1522, -1423, -1592, -1480, -1434, -1551, -1453, -1744, -1613, -1634, -1779, -1474, -1869, -1587, -1572, -1568, -1454, -1617, -1414, -1857, -1752, -1611, -1555, -1819, -1401, -1385, -1682, -1682, -1280, -1703, -1647, -1773, -1871, -1640, -1693, -1745, -1728, -1914, -1843, -1730, -1921, -2793, -274, -1282, -1294, -1140, -1551, -1539, -1788, -1491, -1685, -1395, -1648, -1559, -1556, -1736, -1433, -1422, -1428, -1224, -1675, -1201, -1600, -1775, -1480, -1584, -1612, -1494, -1596, -1466]
234692a466J60m18K54J05l32M15m03l82M81q5jN3K05j37M5k30J14j01m9M33N5
235979a284k63J01n21J98n9n2r6k29O42k83L62n30L19J50k45n5K32l63R4Q2K36
237258a564N86l88J51l36j84K33j9m26PkJ49M9K82J14K4j98q7L42m09L79m20j56
238599a873L58l69L3M22j15NJ06N3J38j92j75J90k12K59l4J74k32L7j08K34L3
239885a268j69j73m7j77L58R8r5k04O4J69Qj22n7M6j8K51j86J0r2L70l29Q3k16
241288a696n9L4N97l21J18J88o72M07J21k38l92L25L80l69J94L53m11j12J18m1
242505a476k25J26K78N1k64l27J16K74j66%M7k66j28l3J23J64J22K09m0J59Rj75
243854a422K89o4l80J65j30M2n35L03j04N7k33L61Nj57K14M50j01J52p00nM23
$$ y = [-1466, -1306, -1724, -1470, -1365, -1697, -1282, -1685, -2067, -1586, -1671, -1672, -1619, -1414, -1551, -1506, -1736, -1622, -1723, -1772, -1339, -1284, -1547, -1446, -1967, -1769, -1828, -1880, -1976, -2205, -1563, -1846, -1484, -2014, -1695, -1545, -1790, -1845, -1613, -1976, -1882, -1800, -1564, -978, -1366, -1215, -1551, -1735, -1502, -1521, -1947, -1940, -1942, -1793, -1744, -1462, -1348, -1324, -1522, -1609, -1267, -1676, -1297, -1717, -1873, -1515, -1884, -1851, -1429, -1544, -1539, -1433, -1380, -1242, -1434, -1609, -1419, -1631, -1372, -1406, -1232, -1464, -1427, -1535, -1301, -1268, -1437, -1610, -1657, -1834, -1476, -1378, -1473, -1677, -1613, -1444, -1436, -1558, -1615, -1569, -1587, -1336, -1522, -1512, -1604, -1234, -1563, -1480, -1696, -1755, -1721, -1124, -1445, -1327, -1139, -1811, -1404, -1283, -1521, -1913, -1588, -1208, -1577, -1383, -1030, -1441, -1553, -1435, -1476, -1701, -1575, -1297, -1246, -1510, -1837, -1721, -1447, -1613, -1613, -1566, -1832, -1960, -1993, -1870, -1706, -1584, -1375, -1415, -1256, -1247, -1422, -1133, -1197, -1577, -1412, -1542, -1500, -2035, -1732, -1836, -1779, -2012, -1651, -1646, -1803, -1589, -1139, -1240, -1088, -1788, -1793, -1370]
245134a370L83j51j80k21L8Q2j51J32l88P78j0j77R5k0J7J6R6l04l05j12J19P4
246474a559m2J75m1j77P4K54j37j4L03q4n62k92K50M2P39k08l49j8m3j58K71J7
247815a559J59M40n25J69R0Q0j68K2k59m07%M48J68q6O1m32j68j18M44L7m4K85
249163a363n3J27n77N1M78M96o60J80k86j2L05l89l7K6L50l24J20L1J27j27j04
250442a641K74j33L1K55Q0l39L05l02O8O6j99k4K79k08K4r7L2k16K57K62j63j02
251783a491mq2M0j32K20k13p2J71L36j5m60K34M4K7O3l21RL35j50k60M54l30L8
253185a559J68k29K41M40m15m6K08m44o4J93L4j06M4P9j4j61J79m34L00O10nl71
254533a352k66L92j97M5m04L31j8j12M09m30K83p3J32q0l46J46J79j70J10J17
$$ y = [-1370, -987, -1138, -1318, -1539, -1501, -1419, -1570, -1438, -1826, -1048, -1058, -1235, -1140, -1160, -1143, -1127, -1031, -1335, -1640, -1752, -1633, -1559, -1601, -1426, -1467, -1644, -1570, -1316, -1453, -1467, -1164, -1248, -1810, -2102, -1852, -1810, -1071, -1279, -1628, -1646, -1689, -1847, -1576, -1559, -1400, -960, -1485, -1316, -1226, -1146, -1314, -1292, -1551, -1958, -1958, -1510, -1342, -1428, -1367, -1799, -1967, -2085, -1641, -1604, -1648, -1363, -1416, -1289, -1866, -1815, -1337, -841, -1501, -1321, -1607, -1619, -1314, -1703, -1740, -1714, -1364, -1688, -1568, -1537, -1410, -1537, -1641, -1367, -1500, -1469, -1214, -1134, -1473, -1168, -1470, -1402, -1336, -1535, -1559, -1280, -1488, -1464, -1561, -1529, -1745, -1488, -1226, -1389, -1491, -1495, -1577, -1537, -1669, -1449, -1662, -1734, -1563, -1227, -1242, -1702, -1468, -1424, -1397, -1334, -1655, -1646, -1311, -1461, -1721, -1267, -1597, -1559, -1391, -1620, -1379, -939, -1354, -1400, -1192, -1636, -1700, -1507, -1473, -1579, -1535, -1456, -1470, -1631, -1452, -1886, -1586, -976, -981, -1352, -1618, -1226, -1423, -1378, -1782, -1451, -1469, -1581, -1172, -1602, -1319, -1392, -1260, -1340, -1686, -1540, -1361, -1531, -1421, -1304]
255752a304Q4r5j92L65j27j06k52J65L39k30j26J12J44l24k12L24m30J08L73j48
256977a532K46k11P6P5m49N03K18n00M21k54l9k8m8q8L96j24k77M1o0k18M12j32
258318a572J00K73j31j66J66k58P7PJ7J21K02k07j11K48p8m1j87M5L1j05L21J47
259658a101l58l4J38j51j56mK64l33M66j88J83k08K22m02P2L06m0l9k0K64m29
260938a548L28l16k70M19L6j15r5J64R3O2O4k15R4k06J93o9j00J84l15M00j36
262224a348j58O6j9k15M6J49J27K93m27JK75l43K827k385o73L56k11r9J76J20
263443a442j43K23n0n60N95m0m6j5L3J9r5k7L55O3k49l4n7N6K55l86L11j07R2
264851a249L4J12j11j76k65K96j81R9m73N26q2k01J64j17J15K85k59L19pj37j34
$$ y = [-1304, -1220, -1315, -1507, -1142, -1269, -1375, -1627, -1462, -1123, -1353, -1479, -1367, -1223, -1547, -1759, -1435, -1865, -1757, -1384, -1532, -1286, -1497, -1421, -1346, -1795, -1292, -1074, -1574, -1153, -1407, -1446, -1474, -1522, -1610, -1214, -1338, -1615, -1574, -1634, -1852, -1440, -1572, -1472, -1199, -1330, -1496, -1330, -1588, -1511, -1504, -1487, -1366, -1164, -1371, -1482, -1234, -1312, -1353, -1540, -1495, -1464, -1569, -1248, -1101, -1459, -1493, -1355, -1506, -1662, -1666, -1402, -1735, -1269, -1457, -1274, -1482, -1260, -1662, -1590, -1284, -1324, -1363, -1383, -1119, -1548, -1220, -1536, -1806, -1387, -1351, -1466, -1561, -1397, -1304, -1242, -1178, -1393, -1299, -1505, -1312, -1381, -1481, -1297, -1612, -1212, -1348, -1506, -1440, -1459, -1674, -1628, -1479, -1352, -1059, -1486, -1485, -1210, -1553, 1274, -1111, -1784, -1428, -1639, -1738, -1562, -1442, -1585, -1362, -1412, -1972, -1377, -1417, -1463, -1478, -1445, -1426, -1521, -1548, -1193, -1130, -1379, -1413, -1470, -1414, -1159, -1545, -1234, -1341, -1249, -1215, -1103, -1214, -1390, -1655, -1359, -1540, -1441, -1914, -1388, -1470, -1671, -1507, -1624, -1509, -1224, -1483, -1164, -1171, -1308, -1442]
266131a442K34k24J41l90L46k5n27O22q6j79j46N4J59L0m72L65j45Q0M20l87m2
267410a614M80n47L44l41O3K14L11l07Qk13k64O35j00l14L06N9k65j06J83J72
268629a296k01Q8l6j85L42j56K4j09K66k97k28L47k91L47l25R6R2r0kL24l01n0
269976a641N68l86J18j98N0j5M3J4k68L9Q09o20K13j06j79P8m90L53K06R3j06
271256a425q2R2j00j81N44k38j3r5P1J64k00O3j04om4O0J17l02m0K27k01J29M7
272659a517K8P2R0K85m91R2k89L91j90Jq3N72l09P7j16k78L60M0k16Q8j25L47
274006a171l84L04J09m6j90p7P9p4L32m50J04J31R2J29o4k34l23J86j77L60J78
275286a186j58n2j8j3j89R0J7R8k73N76j13k8L1J21j11n96K59R9l5n6L95Q6n32
$$ y = [-1442, -1208, -1432, -1291, -1681, -1335, -1360, -1887, -1265, -1351, -1530, -1676, -1622, -1463, -1433, -1905, -1540, -1685, -1605, -1185, -1572, -1614, -1134, -1681, -1337, -1678, -1615, -1401, -1090, -1397, -1389, -1602, -1866, -1231, -1331, -1645, -1339, -1280, -1545, -1651, -1468, -1296, -1497, -1409, -1445, -1630, -1288, -1444, -1420, -1529, -1263, -1560, -1788, -1441, -1732, -1385, -1710, -1614, -1522, -1612, -1614, -1290, -1591, -1641, -1073, -1459, -1341, -1539, -1489, -1504, -1461, -1447, -1715, -1676, -867, -1487, -1274, -1380, -1559, -1481, -1971, -1618, -1412, -1319, -1425, -1507, -1415, -1515, -1696, -1152, -1390, -1403, -1498, -1427, -1263, -1463, -1400, -1504, -1510, -1554, -1494, -1377, -1679, -1719, -1492, -1693, -1564, -1517, -1489, -1417, -1327, -1042, -1533, -1441, -1730, -1339, -1529, -1528, -1611, -1039, -1348, -1271, -1387, -1665, -1305, -1265, -1481, -1393, -1518, -1171, -1555, -1251, -1142, -1188, -1378, -1455, -1376, -1450, -1118, -1568, -1464, -1333, -1241, -1112, -1176, -1410, -1733, -1547, -1724, -1364, -1186, -1344, -1396, -1414, -1427, -1616, -1526, -1509, -1411, -1684, -1108, -1221, -1249, -1218, -1097, -1208, -1804, -1545, -1446, -1481, -1537, -1142, -1056, -1588]
276688a588J30j8n7j18j06K9K55J32o6L61k91j5m9j21o6ol98M88L83K61o39K76
278035a223J9m06j77M65m07L88j49J29l06L27J36J47j73j85k97M43Ll42R9J43
279254a366k63j24N63l69k06J22j4K57L6j79K14L06o30J59J72n9r2J20m4o9J35
280533a331J71k74NjL4L14j85K13n8n23P6L16M7k17J82l6l73L65k76l2m0J11J73
281935a339k27l46K92J38O0J18k83q3J55K58k82J85k31N5o4N25J4J78k52k20l0
283223a379k02K29m00K78J19j51k76J11j35J81K53l49Q02k37J83k40l3q0O0l08
284440a574LK50K57j18n9k24k74r3M7j58K88M73J85j5l00m36R1M86j19j51j56
285719a597n65M32J05N91o5k60N39O8n30R14o41j05m58j01J24J45J44j19L14j0
$$ y = [-1588, -1458, -1476, -1533, -1651, -1757, -1728, -1473, -1341, -1407, -1046, -1337, -1352, -1401, -1522, -1588, -1594, -1992, -1504, -1121, -860, -1499, -1223, -1204, -1610, -1787, -1322, -1729, -1341, -1490, -1361, -1667, -1340, -1204, -1057, -1230, -1415, -1712, -1269, -1266, -1608, -1509, -1366, -1629, -1753, -1190, -1559, -1765, -1643, -1657, -1400, -1364, -1543, -1329, -1023, -1653, -1494, -1322, -1381, -1473, -1353, -1397, -1466, -1331, -1160, -1434, -1429, -1430, -1396, -1082, -1267, -1054, -1112, -1635, -1559, -1243, -1196, -1413, -1231, -1267, -1640, -1275, -1551, -1583, -1623, -1512, -1339, -1566, -1912, -1620, -1482, -1422, -1304, -1587, -1670, -1515, -1257, -1539, -1354, -1585, -1530, -1594, -1069, -1055, -877, -1129, -1349, -1379, -1581, -1352, -1752, -1474, -1355, -1506, -1782, -1671, -1806, -1625, -1372, -1721, -919, -1156, -973, -1213, -1246, -1326, -1266, -1574, -1571, -1321, -1064, -1182, -1241, -1465, -1739, -1832, -1785, -1943, -1655, -1182, -997, -1012, -1312, -1748, -1657, -1171, -1290, -1441, -1597, -2162, -1730, -1625, -1034, -1099, -1359, -820, -752, -1282, -368, -1009, -1114, -1572, -1673, -1549, -1404, -1260, -1379, -1065, -1075]
286946a075m23j92J42M8J33K44n61N59K83p94L28j81P4l21J17K52k72L08L85k33
288163a179j22j63l1m8L50K41j87p8j57Oj76JM00j34jk51j34j18j20M57j53j76
289504a773K54mL85k44j88L41J47N8m2o6l26L12J10l64L26n49K1Q9l14M49q5P9
290852a384R1l52M70k84O2L23m00J1l21N84k6J3k90M11m96L67l87K85j85J61k17
292132a564J32n1j28L64k40J32m99J55K86j95k43j18m0j783N197j772k05n19o7
293288a158NP3k39K23n64J40O0K81J26m83K02q4j15K05l01O16j84j59K14K75m87
294576a354j69J97k44M27k61N4Q1N0O0q3l38Q2L1j71J3L53j38j88M74k71j24J31
295916a388jK84j25l18K64j38J80l15N69J3p72K99j70J85J03o0k64M1P3RL37q9
$$ y = [-1075, -1498, -1690, -1548, -1500, -1367, -1123, -1684, -1125, -842, -1636, -1308, -1489, -1415, -1736, -1619, -1367, -1639, -1331, -946, -1179, -1301, -1464, -1495, -1543, -1193, -952, -1139, -1217, -1374, -1368, -1544, -1543, -1143, -1277, -1278, -1529, -1663, -1781, -1901, -1444, -1597, -1773, -1519, -1523, -1138, -1382, -1570, -1229, -1082, -1024, -1066, -1132, -1458, -1146, -1036, -1400, -1074, -1623, -1602, -1513, -1827, -1378, -1463, -1384, -1293, -1645, -1175, -1459, -1397, -1074, -1474, -1463, -1784, -1200, -1226, -1213, -1503, -1092, -1588, -1221, -1608, -1323, -1508, -1347, -1564, -1432, -1483, -1611, -1247, -1487, -1355, -1854, -1699, -1413, -1608, -1851, -1969, -2009, -3792, 1405, -367, -572, -1091, -1158, -1153, -1080, -1319, -1096, -1660, -1520, -1460, -1179, -1053, -1536, -1334, -1418, -1533, -1328, -1629, -1013, -1197, -1356, -1142, -867, -1354, -1523, -1326, -1570, -1143, -1404, -1350, -1269, -1219, -1159, -1242, -1580, -1498, -1467, -1638, -1625, -1272, -1410, -1598, -1124, -1395, -1519, -1388, -1389, -1105, -1230, -1548, -1284, -1422, -1242, -1557, -988, -975, -1747, -1448, -1618, -1433, -1330, -1390, -1654, -1613, -1540, -1531, -1194, -1283]
297257a283K90l81J44j08k39M14l01m5L54l37M03k12k84M79k62J58j23m34M88
298421a279j19K8K59Jn22K98j3J1k24K49j00M06l28j54O3L61j74l06K17N6L5k78
299762a513o1l7J68O1J53l14K45P6j90R7k70L10K0N1J32L4l80K11M6l21L51lq3
301164a217j42j89K83L8m01K83j7m3JrQ3N7k22L05j64l9pJ62m4j17k45L68j37
302573a413j72J30K09k06R9ml59K46j9O11k05j18J40n37N20n31K72l3j50P4k0
303853a466j32j53O46l22J21P2O1m89L10L6k05K65n9j37L33k35J7j02j9M75l22
305131a305K62k87J2oOP1K1q7j25N6Rl50L49J96M9r6M2K30l25J18l18j10N26m75
306595a537K69J04k42o6KL42l94L47j44n0k38L39r1j89K82KO4j52n1J91l7r9K71
$$ y = [-1283, -993, -1374, -1230, -1338, -1577, -1163, -1464, -1509, -1155, -1492, -1089, -1301, -1585, -1106, -1368, -1210, -1333, -1767, -1279, -1398, -1370, -1111, -1110, -1632, -1334, -1347, -1336, -1560, -1311, -1411, -1005, -1333, -1487, -1424, -1063, -1237, -1543, -1326, -1270, -1235, -1513, -1574, -1611, -1443, -1382, -1229, -1543, -1298, -1222, -1412, -1315, -1585, -1275, -1255, -1204, -1072, -1038, -1418, -1207, -1161, -1482, -1131, -1134, -1217, -1359, -1548, -1265, -1227, -1628, -1345, -1362, -1405, -1404, -1413, -1330, -1273, -1495, -1190, -1354, -1393, -1400, -1238, -1282, -1399, -1644, -1276, -1413, -1585, -1455, -1246, -1452, -1353, -1357, -1716, -1470, -1489, -878, -1083, -1201, -1061, -1598, -1078, -1609, -1337, -1370, -1520, -1446, -1466, -1598, -1751, -1105, -1427, -1306, -1234, -1173, -1662, -1352, -1316, -1521, -1256, -1315, -1452, -1119, -1354, -1337, -1439, -1458, -983, -1305, -1043, -1330, -1318, -1324, -1318, -1247, -1226, -1313, -1438, -1382, -1373, -1723, -1374, -1178, -1129, -1225, -1183, -953, -1278, -1160, -1478, -1588, -1062, -1537, -1268, -1164, -1406, -1472, -1470, -1128, -1522, -1175, -1319, -1369, -1607, -1268, -1359, -1548, -1266, -1264, -1200, -1352, -1403, -1212, -1249, -1348, -1077]
308004a077k52L74o8J95K51o68k0j33k10N18m22N8j82K61M9N9J99m32J36K96m56
309284a524K13pm9L08l07m1K44k77J46j7j14L42j74K2m27K50K56j02n23J69J02
310563a510K28P8n3k13N9J49n85M26l01K92n1M01m48L89m05O3L3M14m84M17l60
311851a461m6j45M21j56K3k5M10m69N20j80p0n89M55J36m9j3k5J06kk11k48L1
313190a587k4K79K32m63O10o4l53K14l0l6q7N03p79L59N2J23n28M14m01L17q1
314470a330L0O8K31m26K12n43K40r7N04k78j10jK71k0K3k82r2J59M51j70O6j80
315812a274J16k41K43n02l4L11l22K60N07l95K25m8J2l47R7j84L57l58j05K54
317037a428Q1j09J93J39j32J08k19M36l29J30N5j44k04j82j08P41q0N4l62L20
$$ y = [-1077, -1329, -955, -1023, -828, -577, -1245, -1265, -1398, -1608, -1090, -1512, -1454, -1636, -1375, -1326, -1267, -1068, -1500, -1364, -1068, -1524, -1311, -1318, -1367, -1059, -1366, -1407, -1163, -1440, -1294, -1311, -1425, -1083, -1257, -1235, -1662, -1412, -1156, -1258, -1781, -1612, -1510, -1282, -1204, -1257, -1470, -1411, -1262, -1847, -1421, -1722, -1430, -1481, -1080, -1528, -1139, -1544, -1481, -1448, -1034, -1518, -1101, -1461, -1507, -1652, -1231, -1387, -1364, -1389, -979, -1448, -928, -1108, -1178, -1767, -1312, -1176, -1225, -1238, -1263, -1157, -1159, -1370, -1618, -1587, -1611, -1332, -1100, -1563, -953, -1017, -1370, -1156, -1186, -1222, -1309, -806, -1585, -1226, -1174, -1051, -1579, -1165, -1566, -1249, -1330, -1300, -1232, -1001, -1427, -1215, -1758, -1518, -1615, -1111, -1389, -1499, -1500, -1229, -1249, -1226, -1508, -1600, -1441, -990, -1160, -1094, -1274, -1158, -1399, -1156, -1658, -1692, -1381, -1703, -1443, -936, -1331, -1106, -1154, -1142, -1489, -1392, -1576, -1219, -1577, -1682, -1428, -1347, -1456, -1263, -1124, -1256, -1148, -1367, -931, -1260, -1130, -1075, -1219, -1423, -1605, -1713, -972, -1052, -998, -1360, -1040]
318254a040k66K78J36l90P0k3k5K34j46M6K44o4l16p2J26n9pJ94k63Q3j38J44
319603a254j76J28k26K35r2L03k37J74j78j84K55p3J23l32RkJK13k4K76k49J20
320944a190K6j78Q2m35K82J68o0L57J42o74J95j61J3J44l18J63n5j33N93o12J56
322223a495R1j41J66p3K32l68k65M03m19K76l83l05r329J1649q58J12j76k92J41
323387a034k19K2j09N1n14N23l46R8L55j64J32r7K9p85P54q8j75K99j37M41P7
324667h87l07j65L4k82M88On9m72J44p0J55K55r2K03k92k33L14N9m0l82k8J42
326007a509K16L60j21j96o0J84j21j4l02j88Q42m50L36m04K26l45L82j66j86K55
327226a261O5J47j34J16l63O5j9P1J4Q6k8J33j89k36L38k44J6K32l10R2J57j38
$$ y = [-1040, -1306, -1028, -892, -1282, -1212, -1235, -1260, -1026, -1172, -1126, -882, -946, -1262, -1334, -1208, -1267, -1274, -1080, -1343, -1260, -1398, -1254, -1430, -1302, -1528, -1293, -1385, -1082, -1319, -1145, -1323, -1507, -1252, -1325, -1202, -1534, -1525, -1527, -1526, -1313, -1337, -1061, -1310, -1190, -1164, -1342, -1260, -1695, -1413, -1245, -1305, -948, -806, -1480, -1285, -1446, -1433, -1289, -1607, -1444, -1499, -1632, -1039, -1651, -1495, -1404, -1545, -1379, -1452, -1220, -1588, -1853, -1450, -1869, -1593, -1976, -2281, -11610, 39, -819, -707, -883, -1175, -1034, -1253, -1231, -1340, -1289, -1803, -1280, -1626, -1528, -1173, -1337, -1205, -1302, -1273, -2058, -1304, -1392, -1567, -1268, -1405, -964, -887, -1194, -1359, -1325, -1607, -1119, -1113, -1172, -1644, -1500, -1570, -1415, -1160, -1252, -1049, -1341, -1574, -1260, -1201, -1241, -1623, -1651, -1509, -1293, -933, -1054, -1250, -1310, -1126, -1247, -1261, -1563, -1751, -909, -1359, -1023, -1427, -1201, -1546, -1164, -1330, -1516, -1261, -1196, -1049, -1183, -1067, -1430, -1365, -1384, -1313, -1299, -1213, -1241, -1108, -1297, -1533, -1195, -1439, -1423, -1191, -1501, -1409, -1252, -1390]
328573a390n8k07M31j07k54K29l08J42L56l31MK84M6j67N4J94m40M42j5j83O3
329853a215m75L04l85L22p7j06K43l8pO36l51n84L75O2l05L27j9l36N21m38j00
331139a646M16j42K19r15O23J80K16j46k46K77l65K58R3N8%rl74K40j95j58Q8
332419a528J50N2l82K1J13L83o15M31J57n01L67j19J97k32r2J40m21L12J56J11
333637a300mK11j98j39k69P24l31j01N02n88N55m73K70k04K5n1J43p6M3l67K02
334917a426K73j87L22l06J60j98j33N99p54J54L21j8k81N9Jj85K42r1k07P13k16
336203a158n15M50J05p1j89q4KL63j15N4m24M18rj15k38L88m9j91K04k72J68m25
337544a703K0J94M7P9J99j26L18l36l27M34k1j93K96o5jR8J72k01q3K13m28J74
$$ y = [-1390, -1448, -1655, -1224, -1331, -1585, -1356, -1664, -1522, -1166, -1497, -1493, -1209, -1163, -1330, -1276, -1082, -1522, -1080, -1095, -1278, -1215, -1690, -1386, -1771, -1449, -1526, -1632, -1389, -1427, -1434, -798, -1149, -1733, -1358, -1296, -1601, -1274, -1293, -1629, -1108, -1546, -1646, -1230, -1372, -1153, -2068, -1445, -1265, -1049, -1195, -1441, -1164, -1529, -1271, -1178, -1120, -1120, -1129, -1503, -1263, -1458, -1616, -1528, -1378, -1326, -1708, -1687, -1574, -1191, -1806, -1375, -1218, -1719, -1352, -1471, -1274, -1506, -1598, -1458, -1879, -1567, -1411, -1300, -1304, -1093, -1291, -1430, -1699, -975, -1306, -1407, -905, -1493, -938, -1411, -1141, -1345, -1320, -1371, -1228, -1304, -1261, -1628, -1426, -1153, -1340, -1018, -1324, -1164, -1362, -1495, -896, -1650, -1496, -1175, -1193, -1474, -1415, -1414, -1599, -1357, -1448, -1655, -942, -1158, -1673, -1223, -1118, -1189, -1378, -1462, -1460, -1097, -1212, -1158, -1582, -1164, -1173, -1288, -1526, -1138, -1187, -1378, -1174, -1446, -1278, -1703, -1683, -1489, -1442, -1363, -1164, -1290, -972, -1308, -1635, -1201, -1222, -1415, -1119, -1184, -1185, -1087, -915, -1116, -1199, -986, -1414, -1240]
338886a240J26j85L24k70L6l72J63K21J05k9m67L83K42j75l7L90p83K58n1n8L75
340172a044n01J33K4K54k40m0j96L36n5J13J53l55L95m80K56K14m92M38j26J01
341389a112j16ok41L86j06j07K93q9k21q3J06N08k02r3Q6k83k71q6L84j10O2K9
342730a272J32K83l76N7j24J06p54M70j0J74K25J27kj61O9k87K93j33j25k15M27
344018a096K02p04J73jJ27L58m11k15K79K72k42L0R0j1k47N14k34j35j55J3m9
345297a442j26M98j63j04j54j38M29p9j00J27K44r4j99K89m04K67j30r5R7j66
346514a443J20j77L69j51j84K99o28P03l08N10k92N3L77n04K47O9o19L82l80O06
347741i51J6lo15L73k17O0K21q5q9k78M94j93O1J05K34o50K03j36O21m7k11j36
$$ y = [-1240, -1114, -1299, -975, -1245, -1209, -1581, -1418, -1197, -1092, -1121, -1588, -1205, -963, -1138, -1175, -785, -1568, -1310, -1361, -1419, -1044, -1545, -1412, -1388, -1134, -1374, -1414, -1610, -1274, -1329, -1216, -1063, -1418, -1023, -1503, -1247, -1033, -1525, -1087, -1213, -1112, -1228, -1234, -1475, -1089, -1195, -1302, -1009, -1098, -1319, -1402, -1296, -788, -990, -1083, -997, -1280, -1551, -1637, -1253, -1363, -1301, -1272, -1140, -857, -1233, -1176, -1300, -1194, -1948, -1478, -1488, -1314, -1089, -962, -964, -1125, -1056, -1343, -1050, -1183, -1308, -1523, -1096, -894, -1598, -1425, -1426, -1299, -941, -1352, -1567, -1288, -1016, -1258, -1228, -1138, -1149, -1396, -882, -1116, -1251, -1406, -1393, -1442, -1568, -1070, -1233, -1337, -1491, -1629, -1200, -1279, -1379, -1252, -1008, -1102, -1301, -1012, -1416, -1149, -1279, -1374, -1277, -1443, -1323, -1500, -1131, -1282, -1466, -1167, -1795, -1092, -1400, -890, -1182, -1129, -752, -1256, -1009, -940, -1559, -1177, -1557, -951, -935, -938, -1553, -1180, -1397, -1337, -1116, -1201, -1290, -1568, -1074, -1267, -1206, -1101, -867, -1517, -1314, -1450, -829, -876, -1087, -1223]
349081a223K1R5J59j58k61K77o3K82l5q7O1n4k2J0m24L03O4j17N64m53m77N41
350422i97k49J24J70m36r7J75P8j31L63O0j13N5k34N5j45j38P60r51M88NR2j17
351770a183j87M65l15j99R8j73K93l21L80j14K69m12o8r9K20J64l29M84O6M65
352988d96r94k59M96N5j3j43N9K3rQ8J41k56m5j25J50L52j80m5k77R5p1N86o64
354390a532K58Q5k46J76K21l00L50J11l15k83N47n9l72j71N40k15J00k11k06j18
355615a640M31q1l73M07M1j5m0K24O5n33N35m51N54m10k22j30m6K8M27k34nK81
356957a187j07M73l62L74l91k57L02o98M13n45J054m84K64k25K54r7K60l60o2
358113a381M08k33m2k04J11j59K95K91j91k88J48K32k02M13n83Q05j1m08L41n18
$$ y = [-1223, -1202, -1107, -948, -1106, -1367, -1090, -1153, -871, -906, -993, -932, -986, -1008, -998, -1422, -1119, -1055, -1172, -608, -1061, -1538, -997, -1246, -1122, -952, -1388, -1485, -1310, -1232, -1363, -1000, -940, -1053, -998, -1232, -1177, -1322, -1460, -700, -1651, -1163, -1158, -1066, -1183, -1370, -905, -1220, -1419, -1321, -1494, -1201, -1522, -1142, -1256, -987, -1399, -1467, -1566, -1346, -1182, -1511, -1027, -961, -496, -1490, -1749, -1253, -1198, -1211, -1354, -1295, -1272, -1281, -1193, -1052, -1308, -1353, -1478, -1328, -976, -1156, -1201, -1478, -1383, -1454, -868, -1532, -1274, -1189, -1435, -1259, -1038, -1338, -988, -877, -1192, -1475, -928, -987, -1359, -1530, -990, -1205, -1105, -1316, -1522, -1640, -1209, -1290, -1663, -1256, -1215, -1230, -1270, -1046, -981, -1514, -979, -1430, -876, -1286, -1508, -1638, -1684, -1656, -1229, -1463, -1468, -1187, -1294, -821, -1183, -809, -1200, -1457, -1155, -1853, -1440, -1985, -931, -1415, -1151, -1376, -1122, -1219, -959, -1319, -1381, -973, -1206, -1248, -1452, -1341, -1500, -1205, -914, -1105, -1393, -1245, -1013, -1215, -802, -1385, -580, -591, -999, -658, -1176]
359338a176N19m17j64J88m9k24J39j22j3m5N48k50P0M2p5j46m91L32k40M08q2
360618a248J69j14qN7j75M12n93L50Q4n04K68J78k72J71l33N21m38J15j75P27
361836h08p15O56m63k29K35M9P4OK46l68l04O7J85j0K94j30q7K98n44P00k21l93
363185a462K74J97j23j95J76L82n92P43n42L77l01k45O84o25j52K55N84k52n53
364341a370J57m17K40L83m57J53l05P4O63j001J024l07l6k07M01k88l06N4o7Q38
365559g74j94o19K80p1j15K31j06J66K6n47N24L69l37j44L85o99N48n3l99N5m1
366846a515j14L78K85L5j150J026m56J26J72J07o14qN47J13N8n89P01K89o87k41
368064a537m5K30J89P39j179O38o29K08k60K04K23K46K12l33j63J9k44j8L77n3
$$ y = [-1176, -657, -1074, -1238, -1050, -1099, -1323, -1184, -1306, -1319, -1364, -816, -1066, -996, -954, -1029, -1175, -1666, -1334, -1574, -1166, -1248, -1079, -1193, -1201, -1144, -1319, -907, -1500, -1150, -1066, -1570, -1302, -1124, -1396, -1225, -1558, -1037, -1475, -1360, -1535, -808, -1523, -867, -1330, -1559, -1324, -1275, -1201, -1195, -949, -1317, -1621, -1554, -1369, -1379, -1085, -1215, -1302, -1004, -1548, -848, -1069, -1462, -1188, -991, -1114, -1309, -1133, -751, -1343, -600, -1142, -765, -1066, -1311, -627, -1252, -1404, -1149, -565, -817, -1370, -1213, -1630, -1390, -1007, -1464, -1311, -1616, -1542, -879, -1880, -856, -1163, -1199, -1406, -1005, -1293, -1599, -1545, -1612, -774, -968, -1587, -1307, -1378, -1493, -1262, -1368, -1202, -1176, -1723, -1199, -830, -1167, -1311, -926, -1625, -1077, -1130, -1529, -1474, -1515, -1629, -1251, -966, -931, -2081, -1055, -1511, -1385, -1213, -1106, -1720, -1728, -1181, -1068, -1010, -1599, -898, -609, -1296, -1537, -1582, -1352, -1163, -424, -1603, -965, -1594, -1386, -1646, -1442, -1219, -973, -761, -1094, -1257, -1238, -1482, -1500, -1123, -1176]
369283a176k00Qj98M00l7Q7m82L33o7O64q4j13l09j25l16L85M84m35j3k7J8l55
370630a558M90M93m57m01K60J13r09K94N45l1k89O29l84M5O03n00k75K6q13J018
371849a101k76j69J3M18K4J91l73P15q51O48o30j31m24Q20n68N39l54M15O9k12
373067a237p83O56N40m46Q8l21k7K19Q61p30qQ3M67j47k55j85o4l98K51N2Q7r3
374416a390L04J32l33J28jj26P81m96NJ44L4q15P05J7m8l95M67l80P95o44o4N72
375755f08j006l4K56L26m97L25L84l40j4K14P53j460Q8j18M30l67M52m91P55O91
376975b61o71j04K29k68L29j063J092q9n54J341k169J096J7J16k58k67K44m88
378078a728L24m47J504j56l72q72P33o98M42j4L03n55J88L21J83n56J254j76q70
$$ y = [-1176, -1376, -1368, -1566, -1166, -1203, -1116, -1598, -1265, -1332, -668, -752, -865, -1174, -1299, -1615, -1230, -746, -1181, -1194, -1221, -1203, -1558, -1068, -575, -1032, -1433, -1173, -1060, -1969, -1675, -1130, -1161, -1450, -821, -1205, -1160, -557, -1057, -1332, -1306, -2119, -1101, -1377, -1546, -1533, -1115, -1091, -900, -1273, -558, -1409, -761, -1391, -1522, -1946, -1126, -1694, -1155, -1509, -1094, -1025, -1237, -2020, -1364, -824, -1270, -1182, -1503, -1530, -1311, -450, -1180, -1188, -1105, -638, -785, -1040, -1225, -1289, -1687, -1436, -1384, -1297, -1390, -1086, -954, -1287, -1159, -1160, -1286, -505, -1001, -996, -852, -818, -1633, -928, -911, -959, -1354, -887, -1267, -472, -1116, -1180, -608, -1614, -1648, -1392, -1066, -1563, -1238, -854, -1194, -1208, -994, -241, -1701, -1613, -1731, -1301, -1668, -1216, -1707, -952, -261, -932, -1036, -807, -1075, -746, -1809, -717, -806, -1360, -19, -2188, -1092, -1075, -959, -1217, -1484, -1240, -1728, -1404, -1851, -347, -503, -875, -1747, -1014, -1712, -1270, -1284, -981, -1536, -1348, -1027, -844, -1400, -146, -322, -1192]
379234a192n48J016j06q30R04p90J13L21k29K72p10O85l72Q8J445j736M94l21
380330a496j54K74n85l8m71K66J820j208M24J221l62n76q38Q43p25O29r69J165
381433g80k14r89J527j405p5K164j207M0m3r40J043Q67l182K953k180L408l373
382467b386N82q63K667J004j50l268P151n113K369r800L905M450r69Q86l610K066
383447a079P02o29J37j186J659M47r74j498J915J045j984J134j149j103R68Q40
384420g55j639K453j557J930j976J167j758R42M45N45n25m50j323O57J055j608
385401b397J219p44R21K73q39R15m88k02m43r2J126j239Q26j16J253j307j07O25
386497h16o75K09k04N97p33L25r36J373l36K91m09J04l3m31Q99m34p86Q60l8q4
$$ y = [-1192, -1740, -724, -830, -1660, -756, -1546, -1433, -1112, -1341, -1069, -1779, -1094, -1466, -1378, 67, -1669, -1175, -1496, -1650, -1376, -1961, -1999, -2470, -2204, -384, -1592, -1168, 53, -309, -885, -1723, -880, -1605, -976, -1945, -780, -994, -1983, -456, -1861, -1936, 228, -979, -939, -982, -1922, -879, -12, -3194, -241, -2421, 987, -2386, -1804, -2667, 0, 1004, 854, -2414, 4737, -376, 1993, -7807, -3902, 548, -421, 465, -3145, -1079, -377, -1006, -869, -2055, -396, 51, -923, -2421, -506, 539, -1445, -311, -1460, -2563, -1595, -755, -2394, 59, -1498, 432, -1544, -377, -2135, -1193, -748, -203, -728, -1178, -2501, -1844, -789, -2397, -1178, -1922, -1001, -728, -1567, -652, -1140, -1342, -1785, -1877, -751, -1990, -1164, -1280, -27, -1334, -1441, -816, -1491, -1282, -1486, -889, -1622, -1297, -2233, -860, -1196, -905, -1314, -1210, -1243, -1674, -775, -1209, -1995, -1135, -1173, -1257]
387722a257k85Q78n36N13l95M28m95m80M56Q9l51L37o62O29j19k35k07P08n67
388878a551J65j6j05J03Q5l01P00k20M59o39pL849m206O20J01p16J022j172M34
390035a395J0o54R62o03K61P15m30k05N2m4J43M1J71l26N56j134O35K59m26R61
391262d51j374J215n76P2k47K79k86M36M5l25j01M89m73j92O8J34M49k18k0o69
392479a745P56j07P47j658P81m15M78J37p40O28N2o69J90J34L9K83J40m31O70
393636g30l57M0l67N43p8l66L50m02J15M13n76K59k70j47O73j69l09j7l0L98j7
394923a044M1n3m70J58P0J33O0j90J69l50Q8k73R92j12k24m05r0R3L34j61j9j65
396263a418J91J63r5j3L93m62k44J55K84M5r5L4m6P0k31m49M52J37K6K18j88n38
$$ y = [-1257, -1542, -664, -1200, -687, -1082, -654, -1149, -1629, -1173, -1084, -1435, -1098, -1760, -1131, -1250, -1485, -1692, -984, -1551, -1386, -1402, -1507, -1404, -1319, -1620, -920, -1140, -681, -1320, -1327, 2522, -1684, -1064, -963, -1679, -657, -1829, -1395, -1385, -2039, -1077, -1680, -1419, -704, -1134, -1339, -1287, -1331, -1188, -1147, -976, -1302, -746, -1880, -1245, -986, -1412, -451, -1825, -610, -1186, -1114, -1361, -1082, -1368, -932, -887, -1212, -1313, -824, -1297, -1489, -1421, -1287, -838, -1056, -1076, -1745, -989, -1096, -349, -2007, -1226, -1641, -1163, -1026, -1766, -1138, -1086, -1755, -1565, -1431, -1392, -1109, -969, -1400, -730, -1087, -1047, -1414, -871, -949, -1315, -965, -1367, -1252, -839, -1415, -1156, -1426, -1573, -900, -1069, -1378, -1395, -1425, -1027, -1044, -1003, -1056, -1526, -1368, -1298, -1165, -1105, -1295, -1126, -1476, -1388, -1661, -669, -781, -1005, -1410, -1500, -1407, -1073, -1234, -1253, -1418, -1227, -1064, -1159, -1172, -779, -1241, -1485, -1330, -1046, -1001, -1096, -1062, -1108, -1038, -1269, -1718, -1266, -1129, -1103, -885, -1073, -1611]
397604a611O6K17J09K3k97K64o01J024p70Q67m61k16j38J17rJ89L0L12k27j1j81
398890a304j08M40j55k73M33o80O17J73m42N1N03m62j9Nj61Mk73K04L28q7L8J36
400232a032J50K13m62l69K39q0J07R9k66K55K52m6K42Q23j691M34l71K9L68N6
401449a050m94K33L79J23n60p6pM51K10l53L2P5j06J50j89o1k32j26L50j80L47
402737a084K96p14j20M22K98K00q61K82k34K00N97n83j30L49k59L15l0m1j94M56
403954h35m39k29M51j87j57O80o69N9K52j21m72M41O2k71J75L37l28J57r0j45
405174a329J8L70k18j93m65K04P3K73L29l37q4K54j30j57k58O05j15J26M4m99
406399a489L62J96j03l92L49l71J90M50k67K56l13J53j62J18J06L9k38Qk10%Q2
$$ y = [-1611, -1545, -1328, -1219, -1196, -1493, -1229, -1830, -806, -1576, -709, -1170, -1386, -1524, -1407, -1416, -1227, -1197, -885, -1112, -1123, -1304, -1412, -972, -1127, -1400, -967, -1647, -1030, -857, -1299, -1248, -745, -1207, -1226, -1221, -1382, -1378, -1651, -1447, -1119, -1206, -1168, -1032, -882, -669, -1131, -1500, -1261, -1341, -1234, -1135, -1401, -1146, -894, -940, -698, 125, -1566, -1132, -1503, -1474, -1106, -1050, -1544, -1311, -932, -809, -1369, -1445, -1452, -1001, -791, -1144, -1112, -1037, -1143, -993, -1182, -1243, -1475, -1601, -1251, -1431, -1084, -788, -1502, -1622, -1200, -902, -702, -1563, -1281, -1515, -1315, -718, -1301, -1431, -1082, -1341, -1026, -1056, -1097, -1291, -835, -1274, -1503, -1052, -1239, -1396, -716, -1385, -1326, -1074, -1195, -1667, -1226, -1164, -1435, -1260, -923, -1251, -1094, -1184, -1329, -1311, -941, -1159, -1352, -1817, -1613, -1540, -1267, -938, -1275, -1359, -1105, -1235, -1392, -1650, -1045, -1160, -1034, -990, -1489, -1127, -931, -1034, -1426, -1077, -1448, -1258, -808, -1075, -819, -1132, -979, -1141, -1023, -917, -878, -1116, -1108, -1318, -1318, -1236]
407677a236R3J19m34P35l75J69m99L2K58J52l29J78k13K8j2J89k00oM26k05o7
408957a197J48J47m3k24j72K25K00k84J13l09L54j3j86K33k63O2l6k13N47R5l38
410244a154k93M42j69J58j9K62l98O6P1J31m76m8j1L85Q4j53O5o2k15K9j63K93
411585a175k05m9K74O1p3j75J91k90K11l7K58k48J60Ln34M83j73L28k91M1k19
412865a459l18j57K973j844o29L52kK26l49M78k66l87oL40k44N0J02n6K06j11
414090a101r6l07K11M54j31n19M97n82N85k48j30L62m57N09J63M5l77l44N64j07
415308a009p3j45J89k79N6l95l1Q13m15k80Q05l33l96PK05k16J45L28J22k37l2
416588a171k29P14n00J25o6p2p1M28m91K42o1L0k06J16n3J50K44m90P8Q2q7J72
$$ y = [-1236, -1143, -1024, -1458, -723, -1098, -929, -1428, -1396, -1138, -986, -1315, -1137, -1350, -1322, -1334, -1145, -1345, -1351, -925, -1130, -1197, -1049, -902, -945, -1169, -1341, -1116, -916, -1200, -1087, -1396, -1042, -1055, -1241, -1008, -1271, -1209, -1245, -1458, -911, -816, -1154, -1447, -1005, -1174, -1016, -1035, -773, -1171, -1105, -1034, -903, -1379, -1427, -1438, -1053, -969, -1122, -1057, -1119, -1334, -1305, -1468, -1175, -1380, -1429, -1155, -1094, -1167, -1342, -1151, -1441, -1230, -1267, -1009, -1257, -1097, -1094, -1628, -1145, -1318, -990, -1281, -1240, -1459, -1777, -1934, 1039, -805, -1434, -1082, -1084, -858, -1207, -729, -995, -1382, -1388, -1048, -1292, -1242, -1140, -1196, -990, -1101, -1197, -1504, -1293, -839, -970, -1489, -992, -1574, -989, -1237, -1367, -1005, -1462, -953, -790, -745, -1122, -1466, -902, -1009, -1082, -1227, -1038, -1317, -1261, -1656, -1687, -874, -1289, -1569, -764, -1097, -1493, -1486, -1281, -1497, -1352, -1024, -902, -1139, -1171, -1400, -686, -1186, -1061, -1127, -1199, -1270, -842, -1333, -1091, -1152, -1122, -1328, -1212, -1265, -1115, -871, -1361, -1283, -1201, -1288, -1116]
417935a116P7k68LJ64M12n04J4r7k03K47j53J32r8J03n5J56Q9k81K40J2j51m3
419276a320K48k06j7R9k9k37N2p7K30K48n24M11j6k19J23L6m4K37o4j21k02Q0
420617a312j10N54j50m43J93k19l35K23M91l62K73j73L92l06K71k48q0l6j95Q37
421842g35j90r7l80J56l0L07LK01n77k12Q49o47L43j5o6K36k44K19o20J66J45
423122a188j39o0Q0k57J58J4k85N83j50L6j40r6O2J67K73j91l80P2L7K3r9l31
424462a811M9L91pr2L31j39j35K46l14J04K33qK62o23M08j46J17L5l72L52n2J47
425803a024k24J88P3j47J07m7k8n8k75j22L49k72Q88q2k26l96J17K77m88L12k11
427089a289M07j4l45k1r3l52M40Q0j99M14m36M92q6k16j05j49J22L56l07k28K30
$$ y = [-1116, -1039, -1307, -1304, -1140, -728, -1232, -1218, -1315, -1518, -1271, -1424, -1292, -1390, -1287, -1342, -1186, -1097, -1378, -1138, -1126, -1277, -1320, -1072, -1278, -1295, -1196, -1225, -1462, -1410, -1487, -1257, -1009, -1533, -1122, -1138, -1357, -1234, -1198, -1242, -1005, -1069, -1190, -1392, -1312, -1422, -868, -1018, -1461, -1268, -1487, -1822, -1599, -1108, -1470, -1197, -1370, -978, -1284, -1013, -1261, -1341, -1377, -1572, -735, -925, -1022, -1402, -1246, -1276, -969, -966, -765, -1342, -1554, -705, -1352, -1009, -1024, -1090, -854, -1098, -879, -1499, -1333, -1188, -1327, -1387, -1307, -1564, -1406, -1392, -1677, -1094, -1244, -1208, -1348, -1444, -1382, -1215, -942, -1133, -1513, -1441, -1404, -1381, -1480, -1811, -1762, -1371, -1378, -1470, -1139, -1278, -1413, -1167, -1481, -1377, -1144, -1152, -890, -1513, -1105, -1251, -1134, -1099, -1471, -1119, -1171, -1024, -1248, -1060, -987, -1134, -1027, -1074, -1102, -1160, -1435, -1557, -1208, -1480, -592, -674, -900, -1296, -1179, -902, -1390, -1078, -1289, -882, -896, -1241, -1262, -1355, -1707, -1267, -1187, -1386, -972, -1408, -916, -1002, -1218, -1323, -1472, -1350, -994, -1301, -1529, -1299]
428370a299k26k83L23M6K85n12j63M11P0j89L62o9k98M41l15K92j54J84lk33J04
429656a226JJ60j43j66J66r6J91l6l36N2J99L73l43K6J62J53o50J69M87l73j72
430936a402L66l9l32L5m1K23k83J06K06l00R1j89n5L69J97k49O8J38J71l08m16
432215a644N06k32j59M56l8j97R3K95l02n8J12l30M45n5k91K52j68j11n6L5J69
433495a278j37K33l73L09k04lN14j47n2k50J52k56j3M50k36k71P43o25K74l13
434720a483L82j38j69M55k7R3r2k51j15k08N29J30l44k59J25J3j22N08r40P94
435939a119l30M7K74j79K39r2K7j63K67j87n6L75n14M85k98k50K2K38l82M91J99
437217i06l92k5J22L96o94J95j81J92P3k19J49n1N1j99J45M4l03R9J35L2J79k27
$$ y = [-1299, -1525, -1808, -1485, -1439, -1154, -1666, -1829, -1418, -1348, -1537, -1175, -1244, -1542, -1101, -1416, -1124, -1278, -1094, -1097, -1330, -1226, -1225, -1065, -1208, -1374, -1208, -1304, -1113, -1149, -1485, -1433, -1234, -861, -1204, -1178, -1016, -863, -1513, -1344, -857, -1230, -1402, -1036, -1075, -1407, -1372, -1413, -1190, -1473, -1367, -1161, -1461, -1370, -1559, -1614, -1245, -1048, -1297, -1229, -1091, -920, -1228, -1644, -1138, -1370, -1529, -1073, -1111, -1308, -1215, -920, -1222, -1280, -1168, -1498, -1053, -1108, -1399, -1147, -1315, -1426, -1482, -1447, -1278, -1415, -1182, -1555, -1246, -1450, -1453, -939, -1086, -1138, -1388, -1236, -1492, -1505, -1055, -1291, -1562, -819, -1444, -1170, -1483, -1101, -1239, -1408, -953, -980, -887, -979, -1230, -1345, -1553, -1024, -894, -1238, -1497, -1372, -1359, -1481, -973, -1913, -1119, -1449, -1402, -1128, -1307, -1068, -1160, -1133, -1296, -1029, -1216, -1272, -897, -1411, -926, -1224, -1474, -1452, -1214, -1596, -1105, -906, -1298, -1323, -1201, -805, -1499, -1304, -1485, -1293, -1220, -1439, -1290, -1341, -1290, -1489, -1344, -1300, -1603, -1504, -1369, -1337, -1158, -1385]
438566a385j79K97K06m73K54l49M60k32J9l3O25n34n74L35J99k32L25r4K60j65
439784a270j80L05p0m62Q2N85k92J49k77L40k54M5l4j00J81k88L98k28M90m87
441009a367J24j09R9J48j21j11o7K07k30M9L7pj59Mn6J73o00J50K88j33N5l53
442350a979M4L14r8j85k0mj37l57n17j463r780J9531m256j213K3k04m0k30m39
443507a010L88k59M1l65J90k61L86j33n0M19j29k6o2k63J68J95K7j32k75L6j73
444787a288JJ0K66O0J14l56o2L6J72J00j29m1k24J9N21j16Nj79rOn8l44O5j33
446257a564M45k42J95J3J99J57m94J2l02L70M6Q9k06L88l37o2K17j32j08M26j18
447536a008lj79L57m95J27M95o55kKJ07r2L49k2k90J42Q5l6k13M53m45K48qL4
$$ y = [-1385, -1564, -1267, -1061, -1534, -1280, -1629, -1169, -1401, -1382, -1415, -790, -1324, -1898, -1563, -1364, -1596, -1271, -1365, -1105, -1270, -1450, -1145, -1215, -1677, -1595, -1010, -1302, -1153, -1430, -1090, -1344, -1299, -1333, -1433, -1252, -1540, -1142, -1370, -880, -1367, -1243, -1352, -1253, -1105, -1226, -1337, -1404, -1197, -1427, -1378, -1341, -1348, -1507, -1503, -1559, -1386, -1986, -1836, -1548, -1681, -1626, -1979, -1935, -1621, -1719, -1904, -1924, -1928, -2065, -2422, -2939, -4402, -14182, 5349, 1093, -120, -97, -301, -341, -571, -1010, -622, -881, -840, -1205, -1015, -1276, -890, -1023, -1073, -654, -783, -809, -871, -1134, -966, -771, -744, -876, -1151, -1115, -1288, -1287, -1277, -1011, -951, -837, -1193, -1255, -1219, -1047, -947, -1076, -1117, -1341, -1322, -801, -917, -912, -1091, -1100, -1094, -1152, -1496, -1431, -1564, -1119, -1361, -1166, -1153, -954, -797, -1291, -1279, -1581, -1211, -1165, -1076, -1282, -894, -1231, -1293, -1076, -1208, -1316, -890, -1008, -1011, -1190, -833, -1328, -1201, -706, -1361, -1363, -1361, -1254, -1346, -997, -1019, -1309, -1167, -1082, -1118, -1331, -878, -1323, -1075, -1083, -1049]
448938a049o9R3k8M4k77j24K75j43K9P4p1J39J04j09K5m3j41l7L17Jk07m05L32
450348a270O27m73j43j6L45n94N10l73L73Pj64r5r7L7K37l87j52O42j48n6K03
451627i87l6M5o7J41k75J04k29K62L23m00J04j39j68L73n4q2j41L1Lm6q3l80K82
453029a419K31R3r3J02MJ7k06L12m45J74J03j11Q0k38N98l63J04K77m01k7K02
454309a006k08L21j34k80M22l51K24l07nk9l58O21k04j24Q1L91k88J46l35M44
455534i79j72Ll45K99L5j15K06L13l68K79n34L2K46L0q6J01K84Oo42J82J31j09
456875a203o2n4j13J64J2r2P6Q6P0q4J64j98k72N74q0j87P0j35K41q2J8J2k66
458277a341q5J22J77k02K5j06Q1j12M82l92L73o1j20J76l25K66p3q2k20P01k78
$$ y = [-1049, -1118, -1025, -1053, -1009, -1286, -1410, -1135, -1278, -1249, -1175, -1246, -1107, -1003, -1112, -1087, -1130, -1271, -1308, -991, -990, -1197, -1602, -1270, -643, -1116, -1259, -1275, -930, -1524, -1014, -1387, -1014, -1007, -1171, -1266, -1363, -1326, -1089, -1476, -1628, -986, -1134, -1190, -987, -1023, -978, -1045, -904, -1179, -1075, -1304, -1042, -719, -1119, -1015, -1154, -1322, -949, -1003, -1085, -1226, -1195, -1192, -1238, -1321, -1701, -1419, -1188, -1095, -1188, -1086, -1082, -1065, -1271, -959, -1404, -1230, -1127, -1238, -1158, -1396, -798, -1161, -1057, -780, -1181, -1208, -1006, -1214, -893, -1027, -1307, -885, -1236, -1012, -1319, -1324, -1353, -1711, -1090, -1294, -1418, -1337, -946, -1234, -1088, -1423, -979, -1151, -1148, -1493, -1194, -1159, -1274, -1068, -755, -1123, -844, -1378, -1346, -1100, -1070, -1156, -1055, -771, -765, -1407, -1225, -1094, -1203, -1265, -1319, -1432, -1268, -1256, -1348, -1272, -1186, -1116, -1200, -1036, -1234, -1506, -932, -1012, -1199, -1129, -1264, -1023, -1105, -1087, -1075, -1341, -1426, -1304, -1127, -1329, -1304, -1410, -1329, -1441, -959, -1351, -978, -1039, -1159, -983, -1308, -1042, -1115, -1197, -1417, -716, -994]
459564i94l56K05K67l00K39m8P0l34k2j93K92K64p0kj30j85K78j9N2m20j79P06
460905h79k89j4j13P3O2j9j50k27J23L01j79J98L07n02L38k81J85j87Q7M0K2q9
462244a193N5o2K2N8K59r1m55l7M88m07J48m59L15j26L47J22j18j44m1J72l75
463532a522J07j56M5L82J62l8k81K34k4j18J57K29k08j24j2k11j1n0R3k72J51
464811a467L56j3r3N0K48k42J25m50L26j56R0r6P4J88m47L9k0J44K26k20j82J33
466152a387r1N25k96j42j38L57k05J85l20J78n5J44j08M31N2j47Q1m86K82K42
467377h98k09q6Nq0M9j48j03K38N7j89M74l02R9n4r8J18j46J06n90N07l0M23j15
468779i72l68K44k19l60P28k84r4r0L12j80J34n7K10n45J26L10Pj69j38j48K99
$$ y = [-994, -1350, -1145, -878, -1178, -939, -987, -917, -1251, -1273, -1466, -1174, -910, -980, -982, -1112, -1297, -1019, -1038, -986, -1406, -1585, -879, -1168, -1182, -1295, -1222, -1160, -1179, -1329, -1556, -1433, -1132, -1311, -1113, -806, -1308, -970, -1251, -1066, -1253, -1166, -1126, -1104, -1193, -1138, -1200, -1178, -1120, -861, -952, -1407, -1444, -956, -1363, -1215, -1674, -1359, -1485, -1138, -1016, -1134, -1278, -1319, -1147, -1522, -1415, -1571, -1526, -1144, -982, -1020, -1301, -1067, -1091, -1209, -1052, -823, -1031, -1155, -1167, -1378, -1389, -1439, -1346, -1618, -1467, -1111, -1124, -1217, -1167, -919, -1161, -1036, -1486, -1160, -1316, -1226, -1322, -1248, -1060, -1507, -1468, -1488, -1344, -1118, -1338, -1520, -1387, -1478, -953, -1249, -1391, -1529, -1172, -1377, -1192, -1512, -1334, -1389, -1245, -1353, -922, -870, -1017, -936, -1422, -1140, -898, -1107, -1193, -1188, -1268, -1219, -1367, -1470, -1232, -1175, -1364, -890, -1192, -1093, -1147, -1245, -1127, -1273, -1167, -1757, -1250, -1280, -857, -972, -1340, -1096, -1315, -1675, -947, -1231, -1325, -1415, -1103, -1283, -1149, -1206, -996, -1541, -1415, -1105, -1098, -1267, -1405, -1553, -1254]
470059a254O0k10L44j41K50l10J49j48J58k74k7j66J14L21J7J44k41k6r7L35k23
471345a225q1j81L77k98K79j57l90N15Q1p5Q5k52R8l2K25j92l43K80J16J0l54
472626a514M83k60l1M4P0m95N159m461r2M19n01J71k55J56k92j0K93q3L43m32
473843a288jK0N3l06K17J15j58L03j36j8J22j65j04J05K2j59M63m89L51L14l16
475123a055O1l20J73j93K56k96O46q87J17M33j14m2o8N8n7J37OkK61j63K72k74
476471a051j40J34l13K97k24J00J17m56M18l4j41J57l64P8L17k69M24k97j17o1
477690a425L69k64n3j25M16J89j13n05N58k72k0K16j75k99M17J59n73L68m4j36
478907a312Q6j67J48M91k68n7M3l94L24l38J58n4j9j30L28k9m8J77o3j13j29j37
$$ y = [-1254, -1194, -1404, -1060, -1201, -951, -1261, -1112, -1260, -1102, -1376, -1403, -1569, -1455, -1134, -1117, -973, -1214, -1240, -1337, -1002, -1225, -1306, -1487, -1110, -1408, -1129, -1286, -1676, -1161, -1080, -1155, -1070, -1322, -1224, -1256, -1031, -1223, -1566, -1286, -1170, -1160, -1514, -1031, -1291, -1322, -1278, -1208, -1703, 3456, -1005, -1097, -678, -1179, -1008, -1263, -1107, -1399, -1409, -1116, -1199, -856, -1288, -1289, -1269, -1216, -1522, -1305, -1190, -1348, -1045, -1181, -1199, -1077, -1242, -1346, -1241, -1219, -1378, -915, -1404, -1053, -739, -1055, -994, -1314, -1141, -1334, -1078, -1374, -728, -1615, -1498, -1065, -1179, -1221, -1289, -1231, -1288, -1151, -1145, -1147, -886, -1049, -777, -1051, -1191, -1057, -1370, -1073, -1297, -1197, -1080, -1536, -1118, -1152, -1293, -1136, -1500, -1422, -1105, -1374, -950, -1247, -1364, -1425, -1056, -1320, -1373, -1498, -1082, -893, -1006, -1511, -953, -1225, -1245, -1029, -1204, -1503, -1086, -927, -1500, -1132, -1176, -1312, -1226, -1393, -1245, -754, -1022, -1079, -1036, -1430, -1106, -1444, -1286, -1340, -1359, -1489, -1161, -1190, -1238, -1061, -1124, -1237, -1366, -1503]
480256a503k1M95n00K52N4j6Q3n5m36K00k77O39PR3j07K54o22N70l21j09Jq2j27
481657a528L86K05k89L3j34M5J81J92k09j68j51K09J15j08l9J62n1O3r6J76m0
482937a046n8k6O6j70Q7j53k36K2L57j1K4J88k93j31M49l81L27o2o51M34K26M
484285a034n6K30p6k30q6K07L05j80k21j42J09j6K0j18K56k79J13o9N32n93L10
485564a018j64Qr3RJ37K22l22J49k35K65k6k88K48l29O16l91J29J40k41R0J56
486844i38k56j88J49k2j65L17l79L30l5p3K2J19K7p2P2m6P6J36Rj80j41n3p9J41
488307a229j2k99J90J48J08p7k48nK5K60J3J09k39J27n9k08p2j46K46jj10P8L49
489716a052k7j15l2k71J58o8K54P1K47r6j48J3l3l93J82k00J62r8L32J90O3j78
$$ y = [-1503, -1524, -1029, -1529, -1277, -1223, -1239, -1156, -1211, -1647, -1447, -1724, -1085, -1078, -985, -1092, -838, -1460, -890, -1211, -1320, -1319, -1401, -1528, -1142, -937, -1226, -1193, -1327, -1282, -1101, -909, -1118, -1286, -1437, -1228, -1113, -1221, -1260, -1098, -1149, -1086, -1182, -1006, -1046, -1104, -1130, -1064, -1234, -1147, -1300, -1536, -1514, -1157, -1168, -1144, -956, -1249, -1380, -931, -1312, -985, -1047, -1698, -1264, -1038, -1034, -1090, -860, -936, -1166, -1252, -1045, -740, -920, -1141, -1283, -1174, -1190, -1170, -1288, -1032, -1311, -1198, -1267, -735, -1328, -1018, -1182, -1174, -1267, -1258, -1121, -899, -1221, -1072, -1307, -1042, -1068, -1356, -1108, -1437, -821, -1212, -1083, -943, -1184, -1094, -938, -1194, -1382, -1233, -1255, -1420, -1103, -1482, -1152, -1187, -1260, -1238, -1119, -1092, -1164, -1092, -1138, -1062, -926, -917, -1097, -1238, -1291, -1370, -1229, -1241, -1540, -1350, -1202, -1094, -1171, -1419, -1424, -1399, -1139, -1126, -1017, -1256, -1129, -1188, -1396, -1468, -1614, -1368, -1369, -1479, -1401, -1052, -1079, -1194, -1226, -1497, -1339, -1407, -1153, -1082, -835, -931, -1079, -1066, -1099, -1492, -1310, -1510, -1348, -1446, -1114, -924, -861, -1039]
491057a039k32K62O8l58N4K71k68q9M02j92j48k12K77k01M09k25k9L08J18j66
492282i90k72L6J30j93R9L77o13L51J65l18j53N1J1K33j14L6n28P28k98K6J40
493562a096j88k4r7J88kl47N52j70K14j64K76k86J43j33k39Q5L2L78k9k13K22
494841h98k14O2lJ30k24J48M8l98Q2K31k95J86K93o42K56l4J81k83L94l40q3o9
496182a472L81Pr1K35k97m9J56J32m21K48J96or5J70l54O7Q7k08K43p1j30q3J20
497592a235L91l13J71k94j18M00Mj07k84n8K39P7J15L75m13m20M91j37r6K2R6
498870a094l44K95K64nk46M8J05n99L87PM04k97j3j53R6j06o1j43kr8J18N95k66
500272a108o7j33K11L6J5k46L18m9qjK58o1r5l40J67k0r9K9M06m11J31J36Q8k63
$$ y = [-1039, -1271, -1009, -941, -1299, -1245, -974, -1242, -1331, -929, -1121, -1269, -1481, -1204, -1405, -996, -1221, -1250, -942, -824, -990, -1262, -1226, -1096, -1289, -1190, -813, -1426, -1075, -910, -1228, -1381, -1330, -1319, -1086, -1200, -1164, -1692, -964, -1262, -1236, -1096, -1284, -1308, -1405, -1217, -1219, -1566, -1014, -1184, -970, -1134, -858, -1144, -1001, -1134, -1373, -1288, -1256, -878, -907, -1120, -898, -1112, -1050, -1053, -923, -1147, -999, -951, -1349, -1267, -1036, -1331, -1145, -852, -1494, -1238, -1272, -1091, -1374, -980, -1320, -1403, -1472, -1091, -1084, -1175, -940, -1237, -1286, -1130, -998, -1419, -1171, -975, -981, -1076, -906, -1260, -1193, -1106, -1314, -1071, -1142, -1272, -1355, -1235, -844, -1157, -986, -1280, -1398, -998, -994, -1101, -1385, -1443, -1204, -1127, -1012, -637, -1050, -1470, -979, -1116, -1212, -1190, -1094, -1438, -1143, -879, -884, -1130, -1082, -977, -1576, -1189, -1182, -778, -1075, -1088, -1241, -1145, -1251, -1312, -1455, -1457, -1555, -1437, -842, -1108, -1175, -1308, -1097, -1061, -1046, -1292, -974, -1023, -1031, -1032, -774, -835, -930, -1270, -1103, -1123, -1222, -1193, -787, -1198, -1067, -931, -843, -1106]
501736a106n0j14L83k4r1J60l42K87r7m4j10K21K72n46L47j15J84P8L92N12K894
503023C091p301K148N18j13K35N4P3RO0j23N3J51r4k46N13n8j57J86K2j03j14
504302a196N24j20j54J45l83N7L50J95M2M1l43Q0Q2M34j50m06n63J08l03O68J68
505582g24l7m68k16M64L52j73l1p41l25L72M00k21K5l13J14J26K73j40k17q3j0
506868a573N72K64l64m84l9l77L16N95m03J38J88R7rk27qj31J96p8M4l8K44l01
508209a378J81k55O96p25J09J82O9n19M62j94j54J96J95k19Ok39R5M0N89k71J59
509488i75J04m06L09k58J76j80j48j00K60J12J04j17j66k89p3L76j33L49r2m7
510715a194lq9Q5l47N30k53K4q8K68k49L33N5J81p52N01k25j11j8N9L1j64J93
$$ y = [-1106, -1156, -1270, -887, -911, -1002, -842, -1184, -897, -994, -1038, -1148, -927, -655, -1201, -854, -969, -785, -707, -315, 197, 3091, -4210, -2062, -1544, -1657, -1422, -1368, -1295, -1286, -1226, -1349, -1296, -1145, -1239, -1485, -972, -1030, -1187, -1001, -979, -1082, -1196, -672, -792, -946, -801, -1184, -1127, -777, -582, -540, -499, -842, -762, -680, -246, -396, -802, -1365, -1257, -1560, -892, -724, -761, -1229, -1445, -981, -629, -802, -833, -1574, -1899, -1527, -1127, -1348, -1323, -1636, -1522, -1396, -1123, -1263, -1480, -1563, -1573, -1001, -737, -1101, -1585, -1624, -2001, -1685, -1090, -1493, -1355, -1167, -1070, -1079, -1306, -1314, -1445, -1249, -1327, -1283, -1321, -1077, -1378, -1197, -1452, -756, -1481, -1372, -1190, -1121, -1640, -1178, -1372, -1526, -1330, -1135, -1354, -1348, -1587, -1492, -1452, -863, -1134, -975, -871, -1277, -968, -1226, -1050, -1230, -1378, -1478, -1218, -1106, -1002, -1119, -1285, -1574, -1647, -1271, -1404, -1055, -1147, -1194, -1197, -1286, -1201, -1548, -1018, -1271, -1247, -1335, -1067, -1316, -983, -928, -747, -1499, -998, -1223, -1334, -1352, -1293, -1262, -1426, -1233]
512054a233L6p3k07J53l0L9J82l83L42j50M37Qj21k48P6nk30K31M8k31%L36j55
513456a178l04N39j18K19l67k1L71j65n49L62J32ok32N1j19O26p20J20K32K54
514683h73m06M27k38J73J9j09l16J92j93K71n3J54k72O6j01J07j15p6J02J58j21
515962a204K41k17J84J50l69JOP4j75R4K47j9o51M04k6K75k82Q1j00R0K63j46
517303a079j83K03J58k61k90M51k57j60J81l7L14k14N4O8j36R8k00K63k5l55m
518589a411J72L66l71p2K04J52j31l40K22L69k20l0j84j33M98j25Q5j93j48K68
519808a022k61N55r5K58l40J21k26m42K84P8Qo3M8R7k07J76L50n32M9J29m49L66
521148a118j1J26K7j35J10mL03p77L05P9j12L0J6K3J26l51L16j88k1K68P3l50
$$ y = [-1233, -1197, -1270, -1477, -1324, -1354, -1315, -1133, -1516, -1174, -1324, -887, -879, -1000, -1248, -1172, -1177, -1407, -1176, -1128, -1359, -1359, -1023, -1178, -1482, -943, -1061, -842, -1209, -1230, -859, -1024, -1573, -1211, -1079, -1085, -1317, -1266, -1385, -759, -1479, -1359, -1127, -873, -1279, -852, -1090, -917, -898, -1007, -1323, -1131, -1324, -1053, -1106, -952, -1224, -1158, -1259, -1152, -1267, -1343, -1241, -1083, -1204, -963, -1180, -996, -846, -1215, -1214, -1208, -1134, -1309, -1215, -968, -987, -1638, -1234, -1260, -985, -1267, -1186, -1286, -1196, -933, -1079, -1262, -1059, -901, -1162, -1452, -1001, -1258, -1418, -1237, -1274, -960, -1174, -1120, -1052, -1188, -1090, -1290, -1027, -1052, -1407, -1411, -1239, -873, -1244, -1316, -1112, -960, -1091, -1431, -1209, -840, -1060, -1090, -1274, -1407, -909, -1034, -949, -1142, -1290, -1022, -1283, -728, -823, -565, -905, -784, -1010, -1452, -1168, -1090, -1082, -1145, -1097, -1000, -1207, -1031, -681, -1213, -1164, -1035, -1484, -1118, -1129, -1003, -976, -1111, -1001, -1005, -702, -1479, -1174, -1095, -1207, -1177, -1161, -1138, -1012, -1363, -1047, -1235, -1256, -988, -915, -1265]
522489a265K5J57J47m24Q1M41j63N1k67J91r7l11J82K23j20k47K92l41J17J27
523714a201J84k32kq8M43j50N6l20K98K5j16Q9j33k4k7K52K66n62L44q3k42J00
525055a123j70K52jK11n10j8L84k43N5j51J8k01M35L7N2j43j62j02K08o6L01k66
526396a203K23L02m99K0M04l82K09j18k09J44L87l49j70K62O7k09j50J93M34m36
527621a080l98J52J97j99J53k3j2J35j9J08mk83K72J58k76J57J67l68K20l24l9
528900a306j3r6J66J50J7K47j54j6j59K34m08K94j20M36m52J91k63K70m9K0o8
530180a079j29k0K00n8p1l98L15M25m24J18Q1k06K78m45l4Q2k12O42q5N7k0K70
531529g13j74J48j48j16r1j0Q8J35j00pr4n1p6K33Q1j51L6k77K81J55k83Q7Q0
$$ y = [-1265, -1240, -1083, -936, -1360, -1279, -838, -1001, -950, -1217, -1026, -1123, -1434, -1252, -1029, -1149, -1396, -1104, -1445, -1328, -1201, -1017, -1249, -1251, -1339, -896, -1046, -990, -1310, -1012, -987, -1103, -1014, -1147, -1171, -1198, -946, -680, -1242, -898, -981, -1223, -1123, -1293, -1041, -1042, -831, -1341, -1359, -975, -1218, -1163, -1314, -1296, -1497, -1062, -1025, -973, -1116, -1278, -1380, -1172, -1238, -937, -1203, -980, -678, -1177, -1157, -753, -1135, -926, -1044, -1253, -1109, -722, -1071, -1241, -979, -912, -1121, -1271, -1078, -644, -1080, -1478, -1326, -1129, -1328, -1175, -1198, -1210, -1075, -1094, -986, -990, -1273, -1001, -843, -1119, -962, -795, -1163, -943, -1267, -1306, -1319, -1415, -1249, -1099, -1082, -835, -989, -1005, -1164, -930, -1338, -1044, -1164, -728, -1180, -989, -1252, -982, -1031, -1011, -1079, -1208, -1228, -1028, -1086, -1157, -1555, -1240, -815, -1239, -1121, -1040, -1246, -968, -1413, -1447, -1365, -1577, -935, -1020, -963, -983, -713, -887, -739, -887, -1003, -1094, -1104, -1016, -881, -981, -988, -1082, -1133, -1209, -976, -895, -1046, -1010, -1287, -1006, -851, -1134, -1047, -967]
532930i67lM052m166J86J07j82R6J22m20R9L98n00j08K17R4k42K00r5L94j02p95
534210a615O45rk27L07j96j34M92j46Q1n88K26K11L19q8p4j82j36j42M83j17j89
535496a079l3K6Q2j6M91m01n1k56L17k25K48J00q3k05P7k2L94o88K29j06N42j22
536837g81l77K60k69K56l71O20r0J22rk52J00K10k57k44L43L7j5N4J20L21n45
538117g67j86K11mk18L43K04k81p4j11L39N5k8P4J17J74J20K82N3N90k6J149P49
539464B765R05J779J539K373J886K020K210J690K420J878J248J424J070O49k20
540377B5636j431j629k399j581j839k022k202j524k134j480k119j302q69p11J3
541295B407p64J78m94K51m10K68j02j10l38Q4K27l56r7l9l0J75M0m6j84j03R6
$$ y = [-967, -970, 3082, -1084, -898, -791, -973, -877, -755, -1175, -1076, -678, -1178, -1286, -1069, -975, -1217, -1017, -1112, -718, -820, -1615, -970, -979, -1206, -899, -1095, -1229, -737, -883, -802, -1390, -1164, -953, -634, -722, -796, -978, -1114, -1256, -773, -890, -1079, -1112, -1086, -1004, -1020, -529, -930, -981, -1237, -920, -1145, -897, -797, -880, -1085, -1008, -1030, -636, -1324, -1095, -1201, -659, -781, -1158, -898, -1167, -911, -1282, -662, -752, -630, -639, -891, -791, -581, -838, -1082, -739, -702, -717, -663, -543, -222, -767, -953, -742, -746, -964, -621, -417, -698, -772, -883, -544, -489, -517, -443, -326, -152, -32, 250, 303, 893, 867, 2016, 2765, 3670, 5449, 6988, 9361, 11247, 13267, 15477, 17167, 19587, 21465, 22713, 24137, 25207, 25856, 25636, 24205, 22576, 20177, 18596, 16757, 14735, 12533, 11009, 8875, 7395, 5276, 3974, 3105, 2394, 2407, 1643, 1821, 1327, 1578, 1168, 1436, 1334, 1224, 886, 970, 1197, 841, 744, 705, 675, 850, 890, 844, 660, 557, 653]
542575F53L55k97l22L41J50l32j73r0L81oJ56K73k98j53K49J58k7n02j74M27Q
543854G77K05l84N2j44L32m77L20p65M86K17K45n4M1N24n12o60l65n6K1J67L40
545134C10O53P9P45K12k48q86j024l00K61l32J23M78N46L08O07O91p83r48k49
546298B43j33n01o18k64K12r6P45Q55Mq31J71J06m05l95j39K87K80l6K05J51j37
547577b96k99j85l6J10j98L10j19j52J70J74J46n29qq8N71k96M25k11N4k60M47
548865b70m29J07k33M52N3k64R6k12N30k87j3k9m36J58N4Lm3oK44J00j11k58J48
550267f46r9O6l60K24m64J94K43m0ML96l12M5M5L64o33R0L64k87J56k99Q6J30
551606g33j61ML74l12N7j86l97N17j21j43q8L85j07j39j12K69K1j51J94J72l13
$$ y = [653, 1008, 711, 389, 730, 880, 548, 375, 285, 666, 660, 816, 1089, 791, 638, 887, 1045, 1018, 516, 342, 769, 777, 982, 598, 650, 506, 838, 361, 681, -84, 402, 619, 864, 810, 851, 1375, 863, 203, -162, -218, -197, -30, 310, 963, 1042, 1787, 1999, 1751, 865, -159, -459, -198, -530, -407, 71, 617, 925, 1532, 2223, 1440, 492, 243, 110, -391, -1009, -1273, -1061, -1157, -412, 443, 447, -384, -213, -107, -512, -907, -1046, -759, -479, -515, -310, -159, -296, -595, -780, -816, -706, -904, -594, -713, -865, -695, -521, -375, -904, -912, -1000, -429, -725, -300, -511, -457, -717, -270, -699, -592, -825, -373, -320, -584, -488, -700, -170, -457, -470, -499, -935, -777, -723, -720, -763, -769, -525, -425, -536, -794, -646, -745, -679, -1039, -815, -1279, -1085, -842, -882, -878, -482, -794, -749, -704, -340, -973, -883, -519, -806, -650, -949, -863, -733, -894, -890, -516, -828, -771, -957, -1354, -837, -958, -1101, -1189, -804, -911, -1050, -1162, -893, -872, -1023, -829, -657, -970]
552887i70L9l77K57j16J25O1j23N2J58k34m0M15Lk44J75j67q1J56j02j93K82j42
554235a066j28R8J12k31L51k07J47k73K6L9J53N7J43J31l65K32l14J5M6J15l57
555514a276L37l33J64L32j83J11l6j10n3J16qr2K13k8mj03j2l6O7R4k34K39l02
556916a137K6K66q3rmN5J0k66J03K76l40L7N4Q9j24K45l62k03K92O6l91N66k60
558326a094k7K66RQ3k23J11J53q0k36M80r26L99J02r6q1J40j29K95P4P4j26j68
559665a000k33N43l66L55j08J62l11k37M87p4k63k5P2J81n25K45N8P1l45M56l10
560946a167j01K97m30N37k17jJ78m9k33Q9j74J85R6j33K89k43P3l17L24K28k54
562232a023ok81K27l28L05P3j00J53J3l54Q8l19o74J983p80n5j19j3J67J64m12
$$ y = [-970, -931, -1308, -1051, -1167, -1042, -981, -1104, -1052, -894, -1128, -1168, -753, -750, -994, -819, -986, -1067, -911, -1013, -1206, -924, -1066, -1194, -1096, -984, -1215, -864, -1071, -924, -1197, -1171, -1132, -979, -922, -779, -648, -1013, -781, -1095, -1080, -1034, -919, -1276, -939, -1272, -1108, -776, -959, -848, -884, -994, -1047, -931, -939, -1031, -818, -846, -850, -953, -965, -1001, -934, -840, -1074, -835, -1137, -1111, -845, -928, -937, -941, -886, -876, -1142, -1039, -763, -1103, -1066, -1012, -923, -1047, -802, -1164, -1367, -1075, -1009, -1400, -834, -1094, -1121, -855, -846, -763, -986, -875, -722, -802, -1038, -558, -1484, -1085, -983, -1079, -1160, -1020, -1149, -854, -780, -706, -832, -1000, -1233, -690, -1056, -701, -809, -647, -958, -1195, -708, -782, -1045, -1070, -998, -817, -1342, -1097, -1039, -968, -1313, -857, -1167, -1268, -971, -1401, -864, -1081, -1082, -904, -953, -1186, -1097, -1271, -1086, -990, -1123, -834, -1077, -1004, -1321, -997, -769, -1023, -1029, -1310, -1083, -1411, -1106, -1033, -1133, -980, -967, -1321, -1233, -1552, -2226, -243, -1023, -1078, -1197, -1210, -1043, -879, -1291]
563512a291K06L3q6J87n6l85M87J10l56j47M0L60j31r6l7J61M0k13J16J05l37
564790a290J57M16o14L67k3k06O7k46L37K26m75j3j68N25p0k47k41K52R0K64l12
566071a204J13j50N30m37j45K07k72M18k37m38L16J46P4k69L3K29M4q7l26L36
567296a119N7k7K8r9L11l44O4K4j1k07l3J05M3n6K65K0k16k55M62j59J06Ql36
568698a369m2L10j6R9k37j12K73j23q3n3n3J43J08j14k90M25RJ05M5k40K59Op
570100i57k51J60j90l47K77J50r8Q1m4O5J25K2l64M07k59J11k65N77n29O8j9J68
571449a112j35K13o6j56J92J24j23p8k8k13J41K80j18j4k10MK83l64K09j38j20
572727a429O11j02m4m03M58l51j42L82j28k09L60j86j6Q6J1P5m24j41J75K38k69
$$ y = [-1291, -1085, -1052, -1138, -951, -1007, -1392, -905, -795, -1151, -1298, -1258, -898, -1029, -1125, -1162, -1001, -961, -1174, -1058, -953, -1290, -1133, -717, -1331, -964, -987, -1193, -1126, -1372, -1035, -809, -1284, -1297, -1465, -940, -1010, -1257, -1498, -1246, -1156, -892, -1204, -1091, -1241, -711, -1148, -1293, -1086, -1358, -940, -1177, -1615, -1299, -1153, -1079, -1348, -1315, -1086, -1042, -1129, -1455, -1119, -1062, -1089, -1061, -1160, -849, -1193, -1129, -1105, -1116, -1323, -1356, -1251, -1208, -1264, -999, -979, -1195, -1450, -988, -1147, -1041, -1033, -1369, -1411, -1101, -1117, -1018, -1255, -1367, -1094, -1217, -1300, -1353, -1406, -1263, -1155, -1269, -1559, -1134, -1125, -1020, -975, -1215, -956, -950, -957, -1208, -1048, -1238, -1585, -1308, -1158, -1256, -1175, -1219, -1154, -1029, -1007, -1371, -964, -1223, -1112, -1377, -800, -1329, -1261, -1280, -1112, -1247, -1034, -1100, -1256, -1064, -940, -1063, -1141, -1169, -1382, -1241, -961, -1079, -1093, -1303, -1299, -1016, -1380, -1171, -1309, -1429, -818, -920, -964, -1367, -909, -1260, -1402, -1020, -1148, -1357, -997, -1183, -1199, -1113, -1102, -1027, -1451, -1592, -1417, -1179, -1448]
574008a448M8N49K01k74l17m1L08k36M37j92k08q4L85m17k03L75k82j23M68l31
575233a385N50k15q1k27Qo5K49j25K34m04L96j01J01l44J98Q7k66L01j47j75K17
576511a194K68n24J26j54M68m14L28l97L52O1l35K00J58K71l11K47k15J3j53r7
577730a302P7M7Q7j86J25q5J55l5j27R9j80J81N7L05l52K09m45m4N74m10M8K33
579078i69J6J4L12j15l27M2j96p5L00n1r5K60k78k0q1r5K57Q1M5o6j82j27o8O2
580541a356p9k0J51J70MO4k49P7j37J81R7k90o1J48J02K34p62K04l1k65L38j1
581882a491L14k49L88j97%M14o70K3N50l82j71J34j70O52m45M59j84l1m10K84
583107a182k05K52J44j22K67k34k24J66K6l65l41K81j62O31K64j23n41M18l55
$$ y = [-1448, -1400, -851, -650, -924, -1241, -1282, -974, -1210, -773, -965, -1173, -1257, -872, -1289, -1492, -1117, -1399, -1522, -1054, -1385, -835, -1050, -1131, -1358, -1350, -1415, -1166, -1291, -1057, -1461, -1065, -1166, -1065, -1409, -1211, -1124, -1390, -1089, -1236, -1411, -1194, -926, -1450, -1324, -1478, -1010, -1424, -1096, -1493, -1141, -1080, -1415, -1215, -1057, -786, -1097, -850, -1065, -1052, -1205, -1302, -1225, -1178, -1091, -1277, -1152, -1237, -1082, -1117, -1244, -1145, -1325, -1144, -1087, -782, -1134, -925, -1370, -1414, -840, -1250, -1202, -969, -953, -939, -627, -742, -1069, -1027, -1223, -1298, -998, -1049, -1144, -884, -1162, -1182, -1263, -1358, -1101, -1020, -975, -1041, -1223, -1350, -1418, -1356, -1435, -1455, -1304, -1134, -1130, -1066, -1315, -1238, -1375, -1194, -1097, -1387, -1448, -1300, -1198, -964, -1726, -1522, -1553, -1818, -1480, -1491, -1177, -1426, -1038, -1235, -1235, -821, -1491, -1468, -918, -1300, -1471, -1337, -1507, -855, -1300, -841, -1025, -1056, -1466, -1182, -1387, -1135, -991, -1113, -846, -1080, -1304, -1138, -1112, -1477, -1818, -1537, -1699, -1068, -804, -927, -1468, -1050, -1405]
584265a405n06J81j2M3K43K65L52L91m56k00l26n87l64J77J83PL13M96P71O92
585483B58j4K19p03j375L33k2m45m48P38J010M04L24m5L06n07n50J87l24r25K55
586708a324L87K22N96k02k57j71l56O5J32P7j88P1L41n29J42L21k33m70K34Mj58
587988a296J48K78k70j58J45L01k1j54j69K45J7k26JL81m62K38J79l0l23J72k34
589267a238M46l00J82j67K45J2k00n09K22J15O1K25j80Rj44L10l01p0j16j39L59
590554a178J53L3j53J35j9j16J54J04k57L9j77J68j20J76m41K83j11J67J88P7
591772h95k71K29k49q8J30J20J08k59P7k68O1j8L70M0m35K53j94J73J4ln9K4l72
593174a512L20j12J92k27K41Q9m46L93K8J38m50J35o1j02J63J89L9j5j01j64j1
$$ y = [-1405, -1911, -1730, -1742, -1699, -1456, -1191, -839, -448, -904, -1104, -1430, -2017, -2381, -2204, -2021, -2014, -1701, -1205, -434, 258, 244, 463, -240, -1615, -1282, -1304, -1749, -2197, -1459, -449, -45, 279, 234, 540, 33, -517, -330, -654, -1579, -1324, -937, -715, -119, -321, -578, -749, -1105, -1040, -908, -831, -1019, -948, -607, -1136, -994, -673, -906, -1376, -1142, -1138, -1296, -1148, -870, -1140, -1298, -1153, -852, -873, -1027, -1196, -951, -934, -1160, -1159, -778, -1240, -1002, -823, -853, -1176, -1004, -1238, -792, -1092, -910, -1077, -832, -820, -1020, -1529, -1307, -1192, -1131, -906, -1086, -1077, -1221, -911, -1212, -1282, -1398, -1537, -1178, -1025, -992, -1145, -1010, -1029, -1145, -991, -887, -1144, -1105, -1282, -1114, -1234, -1058, -1499, -1216, -1327, -1160, -972, -895, -1166, -937, -1186, -1274, -1144, -1024, -916, -1175, -1098, -1366, -1305, -1323, -953, -913, -1348, -1095, -1289, -1116, -1102, -1105, -1164, -1140, -1512, -1192, -1304, -1112, -1339, -1098, -1009, -1455, -1062, -1034, -896, -1346, -1211, -1272, -1374, -1211, -1022, -983, -998, -1099, -1263, -1274]
594460a274l00L90r4j28q3L24M6J52j38K29l40m4J6m2O0K17k17n4K00l61K38L61
595801h42m80K26p4k85J17J82L1k39K09k33L06K26k31k26kJ80l05K41m1o3J16
597082a187j81J39j19lK39k10r8L81j09L79l87K1J92j64k39M39k75n1Q9J43q6
598360a087k41M23P4o13L80j01Q5m5J32j83j25R4Q8j55Q8Q8mJ4L61m03K88m16
599709a258q8L92k98L19q3j49L23o31M47k59J69l12K32k59K06M37j95j69J27m2
600926a091J93k07q0j14J04l42L22l2j20l0K83k31K56j60O7K10J66l53j00Q4m0
602207a215j40L72n9n7q3L74k13o5j92N09n00J69J90l34n8J38K79J19l40l05J11
603493a300N8L26J14n98LL20J16k5j44K6J0M3m18J32m0L33j17K94j98J33j98J34
$$ y = [-1274, -1574, -1184, -1278, -1406, -1489, -1165, -1119, -967, -1105, -876, -1216, -1260, -1244, -1286, -1226, -1009, -1226, -1280, -1080, -1441, -1203, -842, -1322, -1096, -1170, -1455, -1338, -1156, -1125, -1364, -1155, -1388, -1082, -856, -1087, -1313, -1315, -1135, -1440, -1199, -1240, -1303, -1187, -1368, -1229, -1348, -1351, -1112, -1322, -1420, -1039, -1148, -769, -1156, -1135, -943, -1107, -1346, -907, -1182, -1233, -1144, -1001, -1087, -1328, -905, -831, -1444, -1064, -1165, -1080, -1125, -993, -1176, -1301, -1207, -1119, -1274, -1186, -1098, -1102, -1088, -727, -1130, -842, -1258, -1346, -954, -1252, -933, -1016, -1165, -842, -1473, -1026, -1285, -1116, -1428, -1196, -1455, -1249, -812, -1007, -1176, -1049, -1091, -898, -1105, -1185, -1299, -1195, -1537, -1215, -1247, -1367, -1397, -1114, -1345, -1089, -1249, -1182, -972, -806, -1159, -1259, -1175, -1215, -1355, -983, -1042, -1099, -1182, -808, -1021, -1086, -1278, -769, -1269, -1100, -910, -1244, -1302, -1164, -885, -766, -1106, -1411, -1300, -1242, -916, -802, -1400, -1397, -1077, -961, -986, -1130, -1104, -1094, -1051, -1469, -1337, -1377, -1044, -1161, -867, -1065, -932, -1130, -996]
604834i96J06k89l60J85M1J50p1J27K61n58L1Q4M0J31n5k6J73j19k14R6R9j60
606174a324J04J23j51K02p4j35K21k1k37l0l9K60j08j18J79L35m07R0j0J28k99
607461a311J32K17J43j98n4k06N0j24P6j65k1N12j00o2j0j69L10m86M12L3r3k8
608802a142l7j16J50j53k24M42q1K18l1m44J58N5L71r6l57OP9kpj5L45j17j49
610203a147J60p4J07k01j61Q2j60L17k16L19j39Rj01R7l7k03J25k9M5J43l1l58
611552a453K34j41J93o5l30M91j26j23O7J59K61k51m49N07J00m30J69k83M50j05
612769a125J60j58j8j14P7kq0k09N3K23Q0L8J13P9k25j7QR1k41K13J62m10K84
614172a018J9j58K6j88R9L53o1m8l72J18J40J03R7l81M5N6n5N08l04l0j60l86
$$ y = [-996, -890, -1179, -1539, -1354, -1313, -1163, -1234, -1107, -846, -1404, -1373, -1289, -1249, -1118, -1173, -1199, -1026, -1145, -1359, -1263, -1164, -1324, -1220, -1097, -1248, -1046, -1120, -1255, -1034, -1055, -1292, -1322, -1361, -1101, -1209, -1327, -1148, -813, -1220, -1130, -1140, -1012, -1311, -1179, -962, -819, -1017, -1071, -1277, -1227, -1351, -1275, -1440, -1461, -949, -1049, -1111, -1121, -1290, -980, -1466, -1054, -1021, -1114, -1142, -1179, -1295, -1145, -1298, -1522, -1080, -1161, -943, -974, -1418, -1260, -1205, -834, -930, -1287, -1281, -1202, -1204, -1211, -1226, -881, -998, -1147, -987, -1061, -954, -1155, -1316, -1234, -1394, -1077, -1293, -974, -1113, -1104, -1205, -1108, -1145, -1348, -1223, -1252, -1207, -1064, -1095, -1453, -1219, -1360, -1167, -1232, -1562, -1071, -1197, -1320, -1253, -1094, -833, -1084, -1533, -1026, -926, -1356, -1187, -1470, -1020, -1125, -965, -1123, -1141, -1255, -1178, -1180, -1260, -1469, -1416, -1193, -1113, -1075, -962, -883, -1108, -1125, -1117, -1026, -1267, -1054, -892, -1302, -1018, -999, -1157, -1131, -1319, -1220, -867, -928, -976, -1348, -1230, -1090, -987, -890, -1271, -1226, -1170, -1225, -717, -1021, -1051, -1211, -1597]
615513a597M52J54k23k08J28M28l70K35l84L4k87L66n4r2J14L32l21p0K88O7m72
616799a480J6M78k96J04J50l39M0K38j04j07M30l45o1M06j9j35k54j49k35P14
618018i48m47l0M90l89J86m8q9M4k11k06L02L7j58M21n19J41Q1o5Q9O5J09j1J18
619420a038P7k95R5m7M0K31n54L82k65M24J12p4J12l08J79m3L04p7m13P4K19M
620767h61j56J3o0r6O1J20K13j28j42J67o08J77L35l5l13j50m7L02k33K50k80
622047a471K8J36J95l99Q02p08k46L07K74K08j81j92l27N52mL68q35J11J96L8
623265a148L36r3l28Q0J27k53Q9j26J5K19K05J73ro13L67O8q3M97j128K64K0N19
624614h02Mm51m40K19R6L76R4l84k51o7M66j28m0l95j44j04L13M45L89l46j79
$$ y = [-1597, -1145, -991, -1214, -1422, -1294, -866, -1236, -1001, -1385, -1351, -1638, -1272, -1326, -1418, -1304, -972, -1293, -1363, -1075, -1008, -1480, -1464, -986, -1282, -1178, -1028, -1367, -1327, -1089, -1193, -1300, -870, -1215, -1276, -870, -889, -1024, -1278, -1427, -1662, -948, -1395, -1425, -935, -1324, -1138, -1186, -1275, -1231, -1442, -1648, -1346, -1309, -1467, -1046, -1565, -1424, -1343, -1408, -1319, -1254, -1145, -1156, -1038, -961, -1256, -1161, -1208, -1168, -937, -1491, -1109, -1374, -950, -838, -912, -800, -1108, -929, -972, -668, -745, -1158, -1084, -865, -861, -1017, -1004, -1064, -1160, -1099, -979, -766, -894, -1036, -869, -1477, -1300, -965, -1000, -1313, -1463, -1510, -1208, -1441, -1191, -1471, -1443, -1307, -1112, -1511, -709, -1417, -1663, -1356, -1082, -874, -1055, -1247, -1574, -1022, -1026, -658, -1493, -1382, -1186, -1148, -812, -905, -1233, -1153, -1026, -1279, -1190, -1316, -1301, -1082, -877, -704, -713, -1326, -959, -891, -974, -477, -1605, -1341, -1321, -802, -798, -1249, -1689, -1470, -1374, -998, -904, -1288, -1539, -1606, -1140, -1268, -1308, -1703, -1847, -1951, -1638, -1193, -804, -1150, -1329]
625892a329mO6J17l30L34k39j81N43O7L93m20K76j09M05p02K74j15M03m03J29
627111h25k12L71J30L7l9m82K30j32p2j01K33P6k88l1M1J96K51n77J93j75K71
628398i05l64M91k2m7l64J8K76K01L0l80J13Q0q8K6j4J5J37k71L64k09k2K96n14
629800a153K00L63o3q4k27k92K45n7J7l50j2R6O8J99P8j36j00K28j87J66L10l62
631141a053j50o0OM5K00J45l29K12k17K9J44m38J84K2J17K7j77N7K1L75n5m02
632488a297k9J14M9J26j18K7J56N0n31K65O9M3N3m18M07L27j13k62K81Lk17J60
633829h55n86Q0J85K35j97J54l27L58J35j20j39k26l8J54j21R2Qj96M9N09l12
635108a158j3o9K16J99m27L36k23j77J70O2J29j77J82k70K74k38L28k80K29K00
$$ y = [-1329, -1333, -1267, -1150, -1480, -1146, -1385, -1566, -1023, -956, -563, -983, -707, -816, -411, -1113, -839, -954, -551, -954, -825, -1037, -666, -536, -499, -538, -1020, -790, -922, -994, -1095, -862, -786, -1074, -1105, -1064, -868, -617, -1194, -1001, -1176, -905, -1269, -778, -800, -847, -1211, -1193, -917, -716, -686, -1066, -953, -873, -961, -935, -949, -934, -797, -1068, -704, -913, -935, -639, -1153, -953, -590, -653, -737, -964, -1256, -1011, -1068, -1051, -1401, -1413, -1317, -1249, -1050, -972, -1108, -1208, -980, -1167, -1001, -691, -1053, -1203, -1263, -1257, -1212, -1012, -867, -1196, -984, -1201, -1172, -1028, -1466, -1282, -1260, -1143, -1116, -1293, -1236, -1215, -840, -895, -1297, -1326, -1212, -1163, -1037, -1155, -1128, -972, -922, -1453, -1188, -1119, -1076, -1023, -1441, -1034, -707, -820, -1082, -801, -798, -1015, -855, -1441, -1361, -1176, -941, -1138, -984, -1311, -953, -818, -938, -1077, -1303, -1341, -1187, -1308, -1216, -1208, -1404, -1355, -846, -1158, -1171, -1240, -1024, -825, -1252, -916, -1139, -1316, -1146, -1084, -955, -1132, -950, -1220, -946, -1184, -856, -1136, -907, -707]
636327g07o16K26k6R9l46L22l55O49l22K18k86N3J09j50NJ70n23L00J51L9r5j80
637674a265R3K69p5j29O4NP9j59j2%k77J66j47J96L98m55L47j75k58O63j75j23
639015i70R3m0K37j29J37n18M15j69j61K74k1m45MJ95K7L5l07L37J04l4j28L34
640357g30k90L13k65K18J24l64K52k08L3k65r0L67K40l47k48N36j87J60q54N67
641582a038j85M67J47l24k04j0N53j6n44m31K92N41J40L06j22k56l35J088l25
642738b56l50k42m57J04P93n63O76n37mj24J074n69m92K95n80k19O71k75P8n87
643957a564K93k04L98J87k83M6m53K39l61L35J51J47j32Q4k07k5JL64j27K38n01
645243a374K70J32j27j6J42l2p0J07k3L7P2l31M6K51n93k9J29q2L26p3K52K51
$$ y = [-707, -1323, -1097, -1123, -1024, -1370, -1048, -1403, -754, -1076, -858, -1144, -1091, -982, -1132, -1127, -957, -1480, -1180, -1029, -990, -1085, -1265, -1172, -903, -978, -1107, -1043, -1038, -959, -1118, -1130, -1130, -1407, -1241, -1388, -1192, -794, -1249, -902, -1077, -1335, -672, -847, -970, -877, -917, -680, -809, -672, -1190, -775, -944, -1105, -831, -852, -1297, -1293, -1098, -1071, -1036, -1343, -1006, -902, -936, -1064, -730, -1020, -707, -972, -754, -630, -994, -742, -950, -917, -1182, -1272, -905, -665, -1012, -1260, -724, -911, -751, -1605, -1038, -1223, -756, -609, -933, -1137, -1147, -594, -610, -1154, -1585, -1293, -752, -612, -306, -428, -684, -1019, 69, -256, -606, -848, -1305, -1201, -408, -971, -295, -832, -836, -960, 114, -455, -947, -652, -1232, -1451, -780, -1055, -977, -1564, -1271, -1475, -1077, -890, -1173, -1127, -1580, -1341, -1702, -1367, -1216, -1069, -1201, -1117, -1324, -1349, -1348, -984, -1111, -873, -1374, -1104, -972, -1099, -1115, -973, -1005, -1075, -968, -991, -954, -882, -1213, -1167, -916, -1509, -1538, -1409, -1491, -1165, -1238, -986, -735]
646585g35o64K80J32k65L57j12m7j14j29L16q5o8J51lJk38l28M64j84O5K09j26
647924a123K05J09k99k67J23L28J50k68j49M2K10n3j83L16j90j58k20M64j31k5
649151a119L7J5N2N8m46M46j86K86k78l6L08l55L28N6n4m88K83M76l10k85K37
650430i75J10Q2j60k37J94m46L15J01M29n79Q0J20J92l40K04k56J76M2k36K83
651649i01k58J8J44j69j71N54m11P4m0J70k18n1QM03j31Q2l77N0k2j65K32r0j229
653057b498J821l21L6M4Pk50k06j47L09R2L02l16M1k8K30N7q3N9n98J2N34n8L8
654459i23R7l00K01l47K87j86N32m27K01k77J63k29K25J20k90L2m4P8j32J52L58
655739g09k11m80L70J14k66J7J64j18pj64J28L31l07j55L41n71O99j96l06J93
$$ y = [-735, -1399, -1119, -987, -1252, -895, -1007, -1054, -1168, -1297, -981, -1066, -1134, -983, -986, -985, -1223, -1551, -1087, -1271, -1206, -997, -1123, -918, -809, -1108, -1375, -1252, -924, -774, -1042, -1191, -1149, -939, -992, -1175, -859, -1049, -1207, -1427, -963, -1094, -1119, -1082, -1067, -1015, -957, -1403, -957, -1143, -857, -1135, -1171, -863, -1218, -890, -834, -888, -1376, -1093, -617, -927, -1212, -975, -865, -783, -943, -1180, -986, -1432, -1117, -1016, -587, -1166, -1086, -966, -774, -1114, -910, -1166, -990, -948, -1184, -901, -1159, -1141, -997, -1166, -1337, -783, -1194, -1120, -1160, -990, -1208, -1259, -1251, -848, -979, -897, -1274, -1224, -1246, -1411, -1179, -1269, -2498, -677, -998, -962, -918, -911, -1161, -1367, -1514, -1205, -1113, -811, -1127, -1086, -1114, -884, -827, -910, -851, -1449, -1437, -903, -961, -923, -826, -1126, -925, -1272, -985, -1171, -639, -1066, -865, -1142, -979, -1208, -983, -863, -1153, -1121, -1165, -1087, -1219, -1067, -709, -920, -1400, -1030, -916, -1182, -1165, -1001, -1119, -1126, -1290, -1162, -831, -1138, -1293, -952, -1523, -824, -1020, -1326, -1133]
656964a133K6m3M2j60k48L37l10O58m86j36K15O0J42j77o6O7K67q9o3jj12M6R1
658367a073j49J4k74N30j01Pj33k34j59k01K95j17j32M17L73j80q7n25J72j66
659584a723l91l0k27J69L51M00M88M05j27m55Lj83j45m08L47j84M17M62j52J3
660803i70K18j05L59J69m58j16l90K88R9J75o77J11J81N88k08r8N4q1k69Q5o49
662089a694K17L80K71k12k2l11N28J81l21j57J29j94k65N22m5k23M3l9rm5J56
663369a110J60l73K77N8j67j39Q4j77L64L4l1k43M1M14q1j3K69k96m8N0L81n83
664717a129j9k92O23j41L7K56k81j18o7L17l5o3J34O8j73q1k73o7J65j62Q7k45
666058a459L17N3p6K79l50j42K28K6J2J62j51l14L21K15m07L04q6j40M94l23J43
$$ y = [-1133, -1107, -1150, -1108, -1268, -1516, -1179, -1489, -831, -1317, -1453, -1238, -1178, -1036, -1213, -1279, -1212, -945, -1034, -1097, -1098, -1210, -1164, -1073, -1222, -1208, -1482, -952, -1053, -1046, -1179, -1413, -1572, -1773, -1478, -1595, -1727, -1310, -937, -1117, -1204, -1729, -1557, -1723, -2114, -2144, -2371, -2202, -1851, -1451, -963, -558, -685, -1140, -1137, -1320, -1465, -1873, -1526, -1710, -1293, -831, -983, -970, -752, -857, -498, -329, -787, -903, -1293, -1005, -906, -731, -1408, -1297, -1116, -528, -736, -834, -780, -861, -1130, -1045, -1694, -1477, -1097, -826, -1038, -1060, -1371, -843, -662, -983, -1140, -1011, -1205, -1470, -948, -993, -1216, -1173, -1212, -1221, -1266, -1110, -950, -1323, -1046, -988, -1155, -1294, -1210, -1387, -1023, -989, -1020, -1263, -1222, -808, -889, -902, -633, -929, -977, -927, -546, -1129, -1148, -1440, -817, -958, -921, -665, -946, -1064, -1131, -814, -849, -912, -778, -710, -883, -964, -1237, -1304, -1139, -1301, -1214, -1459, -1142, -1089, -1165, -886, -1236, -1378, -1150, -1124, -1112, -950, -1101, -1415, -1094, -879, -1286, -982, -1068, -1208, -714, -1037, -894]
667337h94k83L25Kp4m4q1K38l82L01l4p0o4r8J9P56n81J00k33q2K7N8q8p5k3j9
668862a299M77r8L12n60N50l39J44p2j72J61m31N18n24k04L15L28K37l00L17j58
670087g98p1J42l19J7L69l26l8K77o64L05J1K84k31N68p17L93J05j3k44R1k38
671366a097K40K27m13J57k58n3L23j05O6m36N29k84K11n3n2j18l73K51L28r9Q2
672646i27m09M53l80L76l95N07k94k38O58m78L95K03o16K54l33K97K11K52j64
673810f28k71L80k10j83l07L34k81M85l14J35K76l93K72l39Q2J52J6k63M23m41
675028a075j1k03K07J99M8k99J11Q8j5J5m1j64N8K54k33L7k04M28J44j39k6k89
676369a110P3k9J54m1k8N2J63j47j0l51M22n1j96K37j41M56l66j8J85N81n51q1
$$ y = [-894, -1177, -852, -850, -924, -968, -1049, -811, -1193, -892, -926, -996, -1060, -1158, -1139, -383, -964, -864, -1097, -1179, -1152, -1094, -1182, -1257, -1280, -1299, -822, -920, -608, -1168, -618, -957, -813, -885, -1057, -896, -1327, -809, -1333, -1537, -1222, -894, -657, -957, -640, -798, -869, -727, -1046, -1029, -660, -986, -1024, -747, -1411, -1106, -1095, -811, -1042, -474, -1191, -798, -693, -706, -950, -859, -1097, -857, -630, -1043, -886, -1144, -1197, -874, -979, -913, -1349, -820, -1104, -893, -946, -998, -1116, -1489, -1238, -910, -1009, -927, -1336, -883, -1263, -887, -1282, -775, -1069, -1307, -649, -1127, -732, -529, -1145, -891, -1224, -927, -716, -464, -628, -899, -519, -729, -912, -1219, -885, -1166, -681, -995, -860, -584, -977, -705, -1044, -962, -810, -794, -1057, -634, -1075, -1086, -1289, -1082, -883, -835, -1134, -1023, -935, -950, -935, -976, -1140, -1082, -828, -1061, -1024, -1228, -800, -656, -795, -821, -1110, -1037, -1066, -912, -953, -981, -929, -766, -913, -923, -1274, -852, -903, -1099, -862, -1003, -547, -913, -931, -746, -165, -716, -797]
677718g97j21K09Q3k59K74J53O27J74j97J82K29k67j066K27n9Q5L19K55L70m70
678935d9L14k34N66l91j020M0L03k4j90J92j0L4m1j70Q5j68M0m6r4Q5R5k55K17
680337g21k00L46k34Q5Pk17k96M43K10j38k34R7J23J83l96K11j48p1R3jj48J6
681679i90K10l8M3j41K69p0k24k85N35k91j93J2J92K84k48L02k80o3R0k89J23
682965a052j08J448q08m30o0K63r0j67K88m44K77L6j07o8j78K79R7K6k22L11Q1
684245f28l51o8j44O9L1k13N01j86l70N70k57J30j83K03K86m73k8J86M3K51n5
685524f86j91K9K9K27J35ok26j39q8N68J7k84P8L9M60P50m23K01o92m9n33K83
686872e01k73K97j31M30j4O72l83J77o93k06R3j03k22L55q9j47M01R1J14n46j35
$$ y = [-797, -918, -709, -626, -885, -611, -458, 169, 343, 146, 328, 557, 290, -776, -549, -608, -523, -204, 51, 421, -49, 265, 31, 597, 206, -814, -774, -471, -495, -685, -493, -503, -469, -510, -680, -595, -763, -723, -769, -863, -778, -683, -938, -721, -921, -575, -809, -724, -717, -934, -1230, -787, -577, -715, -949, -852, -729, -546, -942, -731, -879, -950, -857, -858, -1006, -990, -780, -818, -775, -916, -647, -717, -941, -1226, -691, -982, -1175, -1163, -971, -687, -935, -633, -913, -976, -886, -1175, -1052, -1160, 288, -520, -950, -1010, -747, -837, -1004, -716, -1160, -883, -847, -954, -1022, -1200, -921, -824, -798, -1020, -709, -628, -979, -1047, -1191, -1122, -1091, -1304, -803, -989, -1359, -789, -1046, -916, -1099, -896, -610, -1083, -1111, -925, -882, -631, -686, -877, -848, -819, -592, -457, -463, -689, -828, -916, -348, -331, -615, -537, -498, -38, 712, 289, 490, -202, -251, -784, -501, -774, -477, -608, -178, -192, 480, 97, 274, -419, -625, -532, -635, -857, -502, -591, -738, -337, -246, -132, -678, -813]
688151h13J09j7j17J06l32M51k75N82o06P2J56l40O04k86N6N1%n6j00K09l00K07
689492f39M4K12m89K40j66M9J71l8J70J24m4j50M4j72M3K40m72N30k92j04o8L63
690841d04k49n4J12K02n6J04r1j14k00K72k94J60k80n7N56r3n7R3J24k0P3k52
692180e25j73N85l9J52K09k24J2j45j63K66j22j66J86K27J17Q55K8k53k14k81
693399C32j82j5Q8L1p1N28J38L02k17m58N9k6l10J49j00j50L96M7j14L17k66J01
694747E79k48l1L9n30L81JK3k59L23J46q1Q4k0L54j62M72o29N07q1N41m35k40
696088G34j22L15m3K49N57L67J51r4J48j52j53j04j60m21K51J79M84L87m5L62
697305B890k23M53o51m14L8L10k75K85l1K64j83J25K08K88J0l03N16L80M05O34
$$ y = [-813, -704, -721, -838, -732, -1064, -613, -888, -306, -912, -840, -684, -1024, -420, -706, -650, -599, -599, -655, -755, -546, -846, -639, -595, -383, -872, -632, -798, -749, -578, -616, -446, -322, -366, -516, -472, -644, -601, -361, -833, -303, -595, -699, -767, -404, -653, -707, -595, -393, -449, -345, -436, -550, -750, -478, -772, -612, -892, -949, -393, -486, -543, -450, -326, -346, -273, -525, -698, -113, -152, 0, 209, -15, -3, -148, -311, -45, -167, -333, -147, 80, 197, 1052, 1080, 827, 613, 332, 150, 135, 223, 254, 183, 711, 849, 1151, 934, 476, 535, 509, 199, 348, 248, 98, 494, 541, 427, 744, 478, 579, 331, 300, 339, -191, 190, 191, 214, -45, 278, 424, 343, 427, 407, 761, 599, 1071, 442, 949, 868, 1409, 974, 734, 612, 927, 884, 1133, 1690, 2057, 2208, 2114, 2262, 2110, 1957, 1853, 1693, 1272, 1523, 1702, 2186, 2573, 2528, 2890, 2667, 3120, 2469, 2055, 2093, 2403, 2128, 2413, 2382, 2646, 2463, 2588, 2796, 3084, 3094, 2791, 3307, 3687, 4092, 4726]
698532D726M55N68P34J881L327M179L233Q692J7647K5715q81L090N573K092j1102
699443F9929k8442N00Q475J0073L5231N3880N5804o052K8689j7649J6140n2878
700178A73700j16067N883M618J0941M2684O3429K0977l977L4584j9387m548p1202
700906A41635q6412k258k173L224J3514K3204q62L70L611m54j3061l5460j2590
701703C2288k641k106j061j787n43J61q08p05l75l07m33l53k69M63j44o58L88
702737B1110o04k04k6m21J2O6M8L47N5Q79m7o46q92m06j62J52r6j33K17O7j84
704025A9132Q12m55j092j034l58j85o03m09Mk67k32j03j74n05n40m36l87n83p8
705181A2507l73j14n50k88l11K6k67j40m18l51m98n4o5j74l71l40R0J15n66L33
$$ y = [4726, 5181, 5749, 6483, 8364, 11691, 15870, 19103, 27795, 45442, 71157, 70276, 73366, 78939, 81031, 69929, 41487, 41987, 50462, 60535, 95766, 149646, 205450, 199398, 228087, 210438, 226578, 173700, 57633, 63516, 68134, 79075, 121759, 185188, 206165, 202188, 236772, 217385, 212837, 141635, 55223, 52965, 50792, 54016, 67530, 90734, 89872, 90242, 93853, 93399, 80338, 44878, 32288, 29647, 27541, 26480, 24693, 24150, 24311, 23503, 22798, 22423, 22116, 21683, 21330, 21061, 21524, 21380, 20722, 21110, 20506, 20302, 20276, 19855, 19867, 19933, 19981, 20328, 20383, 21262, 21215, 20569, 19677, 19271, 19109, 19261, 19165, 19032, 19249, 19316, 19132, 19944, 19489, 18397, 17363, 17005, 16820, 16217, 15808, 15812, 15545, 15313, 15210, 15036, 14531, 13991, 13555, 13168, 12585, 12507, 12134, 12020, 11470, 11182, 10871, 10897, 10630, 10490, 10072, 9721, 9223, 9169, 9104, 8930, 8559, 8219, 8309, 8424, 7858, 8191]
706399H191l89m84J6P1n24K95j38L28k93j73R5k82O6l86JK3m4L5J61Rk49n18K29
707809F040O7k62J2j86j29k7M00m54N4O7k10Qk6n63N30j27j42K4J86K85k63J1
709150E295ll41J2J41l37j18L7m25N68j68k14N8j46J45k06n7P6j71j6p6k94M23
710489D183k66m80M13M7n8o7nK1kj16mj3j34l73M80m80j44J33M6K89m45n67L49
711899B807j89K85j17j11J0k9K02k45o9O0j66l22K07p6j1j58n4J76M27r17M82
713179B192N3j57k24nK4j42J5k44L71l10K26J92j26m92J04L74k79K4K5k65k69
714458A087P06l92R0ONj60J91m35L36k95n2L19Oo9j05O5m8J95q8j77j00Q0j61
715860A004P9J08M4r4J76m17K3J18J17k21L36j32j46o6j10O1K9j10J98k51K23
$$ y = [8191, 7802, 7318, 7334, 7405, 6881, 7176, 7038, 7366, 7073, 6900, 6995, 6713, 6779, 6393, 6394, 6417, 6373, 6408, 6569, 6578, 6329, 5811, 6040, 6107, 5845, 5857, 5671, 5542, 5515, 5915, 5461, 5515, 5582, 5372, 5380, 5354, 4791, 5321, 5194, 5052, 5076, 5262, 5547, 5284, 5295, 5292, 4951, 4963, 5104, 4767, 4649, 4686, 4261, 4829, 4661, 4447, 4505, 4359, 4504, 4298, 4241, 4317, 4146, 4130, 4054, 3760, 4183, 3917, 3437, 3850, 3897, 3839, 3772, 3767, 3788, 3786, 3670, 3666, 3653, 3519, 3146, 3626, 3146, 3002, 3135, 3181, 3470, 3025, 2458, 2807, 2618, 2903, 2786, 2675, 2685, 2656, 2858, 2613, 2544, 2604, 2438, 2116, 2323, 2247, 2236, 2078, 2024, 2200, 2627, 1710, 2192, 2245, 2088, 1864, 1859, 1883, 1741, 1756, 1512, 1883, 1573, 1799, 1991, 1865, 1373, 1477, 1851, 1572, 1596, 1621, 1356, 1087, 1793, 1401, 1491, 1497, 1502, 1342, 1533, 1098, 1434, 1139, 1087, 1406, 1412, 1343, 1238, 1303, 1255, 1450, 1362, 1185, 1085, 1165, 1004, 1083, 1191, 1235, 1141, 1317, 900, 923, 1041, 1158, 937, 1273, 1141, 995, 929, 819, 880, 909, 799, 997, 746, 969]
717146I69k01r3j15K13O5J01k76j16L2M33l23j28N9K6j07J37k04R1L40o33L41
718426F11O0j57l4k02L34J67m81K85K89n66L24j4j07j03K23j7l30knk30K74nk6
719829B88J64q0K45p30O92j44j30L0O8R9l5J32j9k09J38L4j56K13K50M31mn9j07
721238A111M4J9r27k71K23J56K23K98K16j58J68k95M78j07r29j78n1L8J59K88
722456E05qM7m62J82K01k68m95K09j83K83Rj20J34Rq1j95L60k87J93N1j6j25J34
723858G7k67j56L98q6r9j89K21q6k10j82N93o61P84l7k53jl19L45k52J65j51j18
725205d84J08k15K39j74M29l17L96j15l6j21K4j36k01J69j09M4L7p0L8J51k26
726485e69J79L5o6l8r1RK52k36o2j85K43r6L92k26m0N32n12m1j38J37J57k33j39
$$ y = [969, 768, 675, 560, 773, 838, 939, 663, 547, 579, 1012, 689, 561, 620, 646, 539, 676, 472, 563, 903, 270, 611, 671, 514, 480, 278, 612, 779, 298, 583, 872, 306, 630, 616, 509, 406, 629, 612, 282, 280, 275, 45, 319, 314, 288, 452, 372, 617, -113, 579, 435, 305, 335, 403, 502, 467, 599, 580, 371, 509, 543, 387, 600, 850, 1281, 1277, 1218, 1111, 1155, 1174, 247, -24, 199, 355, 578, 876, 1092, 934, 1102, 807, 1285, 1178, 249, 71, 20, 58, 217, 505, 497, 544, 82, 264, 465, 197, -298, -89, -272, 11, 20, -100, 34, 43, -38, -233, 127, -160, 33, 84, 68, -57, 77, -190, -346, 52, -34, -133, -322, -101, -187, -397, -579, 14, -647, 137, 100, -153, -154, -473, -128, -380, -215, -366, -484, -376, -591, -352, -526, -97, -414, -18, -133, -169, -290, -266, -402, -603, -434, -543, -499, -462, -532, -494, -343, -569, -390, -355, -421, -459, -550, -541, -289, -525, -587, -772, -529, -625, -233, -459, -499, 33, -479, -520, -658, -521, -364, -597, -736]
727888g36K31n66N65j23qM2Lj82k65L54J04k84J85j92j00N78l52jJ85L41l37j67
729235g25k65L11K2j3q1J77k75n0J53K73j00j8M4k68J96R3k98M98n76K01K40j01
730576e62m54K58P4L25m60N8l38N24N7k49k67K84N3J13q4l98J64J41k79m1J68
731856i13J53L19k07n19M70q9J0J34j72Kq0J09j37J03p6J79l84k6N9J23L7J07
733196g98m7Q0K02k55J15l22p4L3J53L47O3j73l2k67M87m22r8L95m14O35n32j5
734544i39K48o1O2k40J14M02k11j22J6k04j79J08L2J32lk42M75n1j02l4pj13K80
735947f39q5l10m5K83k4l0R2l9o4m6J68p8K4Rj92j89J85M81n05L31k12k81M90
737349f76k35qk44M06l8J73j41l01O8J29m8K23k48L86l1Pk66n08m1K42K38K20
$$ y = [-736, -505, -1071, -506, -629, -637, -595, -592, -774, -1039, -685, -581, -865, -680, -872, -972, -394, -746, -747, -562, -221, -558, -725, -990, -679, -657, -670, -751, -574, -849, -899, -746, -473, -573, -591, -547, -815, -619, -526, -824, -326, -902, -701, -461, -562, -1016, -758, -684, -359, -819, -761, -1099, -575, -518, -767, -1034, -750, -697, -584, -668, -1066, -902, -761, -1040, -1081, -913, -760, -441, -648, -1167, -697, -786, -776, -642, -814, -812, -892, -783, -920, -817, -893, -714, -1098, -1124, -1065, -942, -905, -798, -845, -765, -563, -818, -703, -1025, -1099, -1066, -913, -566, -503, -676, -708, -975, -488, -910, -1008, -613, -1027, -392, -924, -939, -691, -752, -690, -930, -816, -414, -625, -747, -731, -935, -1114, -1006, -974, -842, -845, -1087, -612, -663, -765, -799, -806, -919, -639, -724, -1034, -1079, -796, -820, -850, -758, -797, -861, -907, -739, -817, -793, -784, -976, -1165, -980, -499, -1004, -673, -885, -1166, -676, -911, -919, -1163, -757, -795, -622, -763, -1064, -996, -867, -915, -692, -940, -554, -585, -578, -844, -1352, -1393, -1151, -913, -693]
738688f93k93N46q9K26q6k90m92l72M75J03J49M24l94O01n6L7o09J70j88J51o56
739976a336J46m00k01N29n8j23M49k5o0K99K52p39n10j29k9K17m31J58O17k36
741194a610L66j8P1J08n26J53J80n84P7M4L84J01P1K4m9l3J70K06j29k59J43k55
742535a365L53K23R7m06j86l67L09Ql57K74L82p0j92j12L20J88n40M25m14K25
743760a205K50Kk73J47q3R1k98L01K29j85O5q1k7kk79K69j00K50k35l0j31Oj6
745162a335L52l06j00L51j41K63m4q1q5K70m48j16M12j20N3K66m1j36J78k06l98
746441a412Q04l01N2k69j4J64j39l76K62J59J8n3K77k30j6K57J2k67p7p5J63j6
747790a077N5J72l14j34NK10K9j9l7J3J9L01n16O27n20P5k20J15J5N8j58K73K39
$$ y = [-693, -986, -440, -529, -303, -389, -679, -1171, -1543, -1068, -965, -816, -392, -786, -185, -241, -204, -813, -643, -831, -680, -1336, -1190, -1590, -1791, -1262, -1320, -1443, -994, -1019, -1079, -780, -528, -1267, -1777, -1906, -1935, -1718, -2149, -1991, -1374, -1610, -1244, -1262, -1191, -1083, -1609, -1456, -1276, -1860, -1783, -1739, -1355, -1254, -1183, -1159, -1208, -1241, -1071, -865, -994, -1253, -1110, -1365, -1012, -789, -692, -1098, -1284, -1651, -1342, -1334, -1691, -1417, -1035, -1105, -1297, -1409, -1089, -901, -1441, -1016, -1430, -1205, -955, -953, -1226, -1079, -1162, -1071, -1369, -1068, -839, -1024, -959, -1040, -1067, -1069, -1348, -1079, -1179, -929, -1164, -1194, -1325, -1319, -1335, -983, -1289, -1389, -1038, -1179, -916, -960, -1041, -1126, -856, -1304, -1420, -1008, -1128, -1075, -809, -850, -986, -808, -1014, -1412, -608, -909, -857, -1126, -1140, -976, -1115, -1491, -1229, -1070, -1052, -1105, -828, -1058, -1074, -817, -805, -1072, -1149, -1224, -1061, -1077, -1022, -850, -1164, -1298, -1293, -1083, -1054, -1073, -1110, -1097, -1078, -777, -1293, -666, -1186, -1111, -1331, -1216, -1201, -1143, -1301, -1028, -789]
749192g89n29K64j27J7n6k02K41J07r0K26k71K22q8pL10q0l41L08j09Q8L0j10
750533i86%l11Q2m2L4J83j31L3j47m6M09J25j43j17P2j3k7J03l64M52m15K13J23
751941i13l46J47P4K10l32K31P1j26k82M40l50L00k70j82L18k01P9j91nM38k10
753221a100J43k40K91k05j96N59l54j85K7l6K14K45l66rR3J5K43k64k34M94j96
754500a061m6R7j77j00Q6j9K62l35K00N5l18N08o1k63J44j34M6K2k17J48k41L61
755841a043ok85L33m1J88Jo5P0j62m4k5l55J55K15m22N59m40N1o5L41n1j27kJ69
757312a051k49K58m0q5L2k0J15J24j65L8l36J46K56j09j51L0J86L1k15L77l17
758592a145j92R04l87m12J02P0j47J25l60J99M20k20N3k3J01j30j59K00q8r4Q6
$$ y = [-789, -1318, -1054, -1181, -1164, -1220, -1422, -1181, -1074, -1164, -938, -1209, -987, -1075, -1082, -772, -852, -1193, -885, -994, -906, -876, -986, -986, -1297, -1215, -1257, -1223, -1040, -1171, -1138, -1285, -1331, -922, -797, -940, -1057, -985, -998, -1025, -922, -1286, -834, -1249, -1036, -913, -1259, -1112, -1038, -828, -1160, -929, -858, -984, -1266, -826, -1176, -876, -1146, -1328, -1010, -1211, -1132, -1323, -1328, -890, -1100, -957, -1197, -906, -1111, -1307, -748, -1102, -1287, -1260, -1296, -1082, -837, -1203, -1212, -1119, -1104, -861, -1125, -1359, -865, -1061, -1107, -1010, -1187, -1287, -1201, -1220, -958, -1293, -1093, -1038, -1356, -848, -909, -1172, -1028, -1162, -1116, -1094, -1311, -1163, -1404, -1043, -1049, -1334, -1001, -1042, -854, -853, -918, -848, -1010, -1054, -1079, -1434, -1279, -1064, -1486, -927, -1367, -1316, -1381, -1040, -1091, -1218, -1220, -1051, -1300, -1042, -1082, -1167, -1135, -1155, -1040, -916, -1081, -1043, -1379, -1233, -977, -1086, -1237, -1207, -1021, -990, -1205, -828, -1145, -1337, -433, -820, -1232, -1130, -1060, -1207, -1082, -1442, -1243, -823, -1043, -990, -1013, -912, -1042, -1201, -1001, -1089, -1183, -1097]
759871a097j55N02k20Rj88m4J64J17o2k73M26l02q5l6L83K3k26j53L07k51R5K57
761212h09n6q8k88L7N2M67o90L92J18k52k0J1m9N9K33n55M63p6O1k6J40k68L21
762621h23m70Q9P1j75J8M69j84m1l48N59n28n9L50P1j43M73m95K11m16j54L00
763900a225J20k60M99m48J99R1k04J6L26Ll0k75n3KK24l72K01J21j87L53j28j15
765241a142J26m78N23l75j13P0J88R4J94J3k07r3K36Q9j48k25K60m19K05J31k32
766527a303L84m22L59l22j5M38%l74k16K04j59j8J40N21k63r6o1O5M9l29N49n09
767868a378O08k43o3k5J25P3m50L36J7l78O3J86R0j19K52k17K6K23j60j74K2K67
769210i19j57j64j00j03P08j56P4j79O2l11k51L45k83Q9K54k00j64M02r3L0L62
$$ y = [-1097, -1252, -750, -970, -961, -1149, -1193, -1029, -912, -974, -1247, -821, -1123, -1208, -1244, -861, -838, -1064, -1217, -910, -1161, -1066, -809, -865, -953, -1241, -1204, -1152, -685, -1375, -983, -865, -1117, -1137, -1126, -1175, -1116, -883, -1438, -975, -1051, -990, -1016, -876, -1144, -823, -1293, -1204, -1133, -1308, -1290, -821, -1005, -1046, -1394, -835, -1363, -1422, -1072, -1001, -1144, -671, -1166, -955, -1371, -1525, -1225, -1105, -1365, -866, -1314, -1115, -1024, -1228, -1212, -886, -883, -913, -1188, -1241, -1239, -1015, -1387, -1186, -1065, -1252, -899, -1027, -1142, -1016, -1494, -971, -1346, -1459, -1389, -1201, -1107, -913, -900, -1107, -1200, -964, -875, -1023, -1248, -988, -1407, -1202, -1071, -1303, -919, -1341, -982, -1304, -1319, -881, -881, -1255, -1471, -1267, -1426, -1444, -1304, -783, -1046, -1142, -1203, -1138, -1089, -1418, -869, -1378, -770, -1013, -1076, -1101, -976, -903, -1353, -1017, -1000, -1378, -1315, -1129, -1039, -1158, -906, -1123, -1097, -874, -1034, -1208, -1186, -919, -1076, -1240, -1340, -1443, -735, -891, -817, -996, -934, -1245, -1496, -1151, -1434, -1345, -1091, -1291, -1455, -1053, -1146, -1116, -754]
770496g54m27N20l10j93o2J07k36j8L98L2p7j18k95L87j96j30J82q9K8j38J48
771776a241M0J80k33J27Rq7J88K50k34M4j33j24M5M9l87M07J42j06k07K26m67
773055a512N95l63j89J61M3K7K0j34R2O3l61K21J95pk24L46q0J31J0j14n0o3J48
774464a045J51J0o9l63J82N5l64K13M61j70j39R6k1j16o3J76j22J57l9k36L40
775743i06J03j87k15J00m87J34J45j7K42O0K67j15k42l64l7K49j51O73j51L3K01
777023f65l65j63N0J76l57J94n3J65r4K35l7n30k5L56J49n17J51L95k29j41K81
778309a024l02qJ06J3j67K24j27J4nK14L39l99qJ66k85O24j40j48r8R3j20N4L23
779711f61R7q1m74m3K89L74j48j93qp7r3j98J8R8j41P9r3N54j67j1k37j2P9j20
$$ y = [-754, -1181, -661, -971, -1164, -1226, -1119, -1355, -1373, -975, -943, -1020, -1138, -1433, -1046, -1242, -1372, -1190, -1279, -1251, -1389, -1241, -1201, -1021, -1254, -1127, -1118, -1205, -1017, -767, -1001, -957, -1090, -1214, -1169, -1120, -1507, -1100, -958, -1064, -1271, -1045, -1512, -917, -1280, -1469, -1308, -1265, -1238, -1218, -1352, -1260, -1197, -1558, -1337, -1142, -1149, -1373, -1027, -1107, -976, -966, -1080, -1130, -1193, -1045, -894, -884, -953, -1316, -1134, -1079, -1443, -1230, -769, -939, -1078, -982, -1003, -1119, -1182, -1006, -1128, -971, -1010, -1246, -906, -803, -990, -1205, -1105, -1592, -1458, -1313, -1330, -1088, -1028, -761, -876, -1118, -1482, -1519, -1270, -1421, -748, -899, -866, -665, -1030, -1193, -1143, -967, -1324, -1130, -1183, -1018, -1112, -877, -914, -1444, -1469, -1113, -964, -1481, -1330, -935, -1164, -1305, -1024, -1326, -1334, -1228, -1215, -1382, -1158, -1285, -1271, -1276, -1062, -723, -1122, -1130, -964, -1249, -625, -765, -913, -1011, -918, -1038, -984, -661, -564, -645, -1119, -1162, -873, -499, -647, -840, -848, -925, -1018, -1216, -1198, -1100, -1241, -1162, -1255, -701, -868, -879, -1116, -1128, -1049, -1169]
781175a169J3J1O8l56R4PL02k53j39j9j39L61QJ60n7K6j09L20j79L8k17K60m37
782577a406J97K30j02j27J07jp3L59n33K9K22n8p0j52N0M6K33j65k19J99M4j07
783925a297K96j28m5N3N7j68J42j3l02J8M55j27K31j22O2k83q4J36k6R2j11k18
785265a382L95j2j91J02k03O8J06j05j78O6K08k05j4K22n2k91N28k38J71k45N0
786545a200J63k23q7M39m57r4J93J8J58NL7j46j85M63j25p1J02l93L59Q4r3%j35
787947a188k75j02J76K23n34O99k96J96J26j96mj94J02J06Q0R7j57p0j13P9r2
789234a337K26l08K00R6j92L90l16P7J4j50K06K7k75p7L19j73q9J07O6K8o9N02
790575g28m34R3k88K24j64J6K98Oj06%k38j42r6L09k3M20m85J24j05%J97mj89
$$ y = [-1169, -1156, -1145, -1077, -1433, -1339, -1332, -1030, -1283, -1422, -1441, -1580, -1219, -1211, -1051, -1108, -1082, -1191, -871, -1050, -1012, -1229, -969, -1406, -1209, -979, -1081, -1208, -1101, -1102, -1175, -816, -1349, -1320, -1098, -1156, -1226, -1378, -1328, -1282, -1049, -1214, -1433, -1234, -1190, -1297, -1001, -1129, -1174, -1121, -1064, -1232, -1090, -1103, -1405, -1387, -932, -1059, -828, -950, -888, -1171, -1255, -1119, -1145, -1053, -1164, -1382, -987, -999, -1190, -1088, -1291, -1223, -1117, -1222, -1400, -1334, -1126, -1331, -1345, -1123, -1175, -1466, -938, -1176, -1005, -1250, -1200, -1037, -1260, -1347, -908, -1365, -1459, -1266, -1248, -1090, -1085, -1048, -1194, -1379, -916, -1041, -1112, -1010, -1403, -1044, -960, -1053, -1053, -1188, -1463, -1565, -1389, -1166, -1700, -1001, -1297, -1101, -975, -1171, -1175, -1369, -1267, -1161, -1081, -984, -1141, -1211, -1324, -1245, -1337, -1111, -1419, -1219, -1123, -1315, -925, -1241, -1164, -1150, -1300, -1094, -1067, -1342, -1419, -1100, -1273, -1362, -1255, -1189, -1161, -1230, -728, -1162, -1069, -1357, -1133, -1297, -1281, -983, -977, -1083, -1083, -1321, -1463, -1559, -1250, -1273, -853, -1338, -1214, -1319, -1319, -1122, -1126, -1315]
791977a315K78j72k1r2m8j7K97K68pj98j53J13J93M5P1m15j37K28J94j7l33J43
793324a095K23k22l58L85j08j14J63j00j44L57k9J09m16M49j95J43K5p8J44l16
794543a177K98l00L4Q2l12k05L51J27l90K28L7J18j30K43J7k08L61k01P4N4n2
795822i51l27M50N9m94o0j6K49j08p7j37M84N9n23N31r0J52l7j29Q0j26k49K14
797171a046j18J59k2OP1J16k63j35J12k76K16p1L26k98M69k62r2j47j12j08J33
798449a342K84m09nN45k59j06K13j17L53l39j18J27k9K20j03m59N49l1l10J16
799668a220O6R6k7q6K74q9k76J6J75j0p2J49l26K62j2J75J48j45k88L7j46j60
801016a459M58r0P5J12J80o02L11k53K02k91P5K73j41K07J6k58M30n17R2K93k58
$$ y = [-1315, -1037, -1209, -1230, -1322, -1370, -1387, -1090, -822, -829, -1027, -1180, -1067, -874, -829, -758, -1173, -1310, -1082, -888, -905, -1238, -1095, -872, -1094, -1452, -1067, -1175, -1289, -1126, -1226, -1370, -1013, -1042, -933, -1349, -900, -1095, -952, -927, -1005, -861, -1177, -879, -1179, -1145, -1063, -1375, -1580, -1229, -1102, -1492, -1264, -1227, -1109, -1239, -996, -979, -1187, -826, -1027, -953, -899, -951, -1278, -828, -769, -1263, -1323, -1339, -1090, -1198, -1275, -1412, -928, -869, -1392, -861, -951, -799, -836, -965, -885, -1011, -1260, -1046, -1164, -1005, -1027, -1021, -950, -834, -1097, -1232, -1120, -1396, -1180, -1251, -925, -1223, -754, -1016, -1108, -1255, -1367, -1475, -1342, -1058, -1467, -1472, -927, -1186, -1292, -1079, -1196, -843, -1182, -1300, -1173, -1202, -982, -1085, -1544, -995, -1026, -1336, -1220, -1154, -1058, -1085, -1171, -897, -986, -1262, -1246, -1071, -1081, -1153, -1004, -1330, -1068, -1080, -905, -757, -902, -1190, -1153, -1299, -1459, -1001, -1091, -1016, -904, -724, -1326, -1015, -1268, -1066, -1357, -1282, -1009, -1150, -943, -927, -1185, -755, -1272, -1180, -887, -1145]
802296a145R1J23k07K6j6NP3J46k71M1J47k69J38j5J27l63J73J47k53j00M75k7
803637i54j5j13L4m5M4q6j43J52j21P4L04l28J04J33j77J59l5j61R5j66j63M62
804984i46k66o4Q1l2O4k99K25M93k24k98K29p9k2L55j50o8j51O2L9o0J3K20p5
806386i53k22j98J10K20j26j55L52m4Q2j99k7o1K18j96N0L9N17q04J32L4Q3J58
807727i90j23l57L69K38m45J22J18j28j02M70m16K35l14L17k20j66K42J91j14
808884a073j58n5M57l34M4P3J05l59j34K26K76j95K59k62K5L1n6K10qk72R9j92
810233a293R3j97K00K45j86J23j73K18l58K7j2R2J36M8l06p3K88J12j60j48K6
811511a298J44k4K9LQ4Rj09K0l9J79lN9l14L67j59K2j42j17K25rJ62j46l12o9
$$ y = [-1145, -1054, -931, -1138, -1112, -1128, -1123, -1050, -904, -1175, -1134, -987, -1256, -1118, -1133, -1006, -1369, -1196, -1049, -1302, -1402, -927, -954, -969, -1082, -1048, -1093, -1049, -1135, -1278, -1126, -1247, -1173, -869, -1197, -1093, -960, -1137, -978, -1013, -1174, -1079, -1245, -1408, -946, -1212, -1276, -1195, -1227, -1163, -1462, -1237, -744, -968, -1266, -1037, -1116, -1138, -783, -933, -1001, -1152, -1090, -1051, -1111, -1098, -878, -953, -1175, -1373, -1263, -1043, -1169, -1324, -972, -1016, -934, -1133, -1160, -1221, -1003, -1199, -1149, -1110, -593, -1397, -1265, -1231, -1148, -990, -1113, -1470, -1101, -863, -1308, -1186, -1068, -1196, -1298, -828, -1244, -1009, -1323, -1006, -1226, -1392, -1150, -959, -1073, -1231, -1286, -829, -1163, -1119, -1046, -941, -1300, -1434, -1208, -932, -1127, -868, -1130, -1105, -1074, -1130, -920, -928, -1200, -1101, -1293, -1200, -1397, -1197, -952, -1138, -1015, -1188, -970, -1328, -1301, -1313, -1221, -1085, -1037, -1343, -1416, -1128, -1016, -1176, -1324, -1298, -1154, -1178, -1149, -1146, -1062, -1053, -1162, -1142, -1181, -1002, -1005, -946, -1260, -893, -1052, -1030, -1172, -1289, -1064, -1073, -911, -1057, -1369, -1438]
812974a438L85J00J36k53R8j81p5k8M14j77k45L81l84L50k95L58k96L22l97O23
814200f02n61O6l68L23J33M4q4R6n9m4m5M2n8l83J71K28M1M27p04M02k13J58K
815602i88n4j46K69k78q5M02j71j62K18j35k01J39O7J9k21M38k43J80r8k24L54
816882i20k17L32l22k6k91M04k0k00n5J3J58K46j96o9L6L67p83M19L65j13m7j64
818229a083k76L40kJ14j40j91J87q6j62J00j47L17l13J68n3m2k78L13J87nj6J42
819570i26m08M32k29j47M52n42J01Q5%J38n19M53m4K3M58l79Q8K37m13P97q51
820850a194K24j45M2J42k08k5K10o5K7RJ96n6j83p5J46on4J09J93l14J85p6k39
822251a157J63k52K61k26j09J57M55r2P9m0m05K8J11j80o4m21K44L91K55j49M6
$$ y = [-1438, -1053, -953, -817, -1070, -972, -1153, -1228, -1256, -842, -1019, -1264, -883, -1267, -917, -1212, -854, -1150, -828, -1225, -602, -1163, -1097, -1465, -1142, -1009, -965, -1049, -953, -1012, -1056, -1101, -1059, -1117, -1500, -1329, -1101, -1060, -633, -1337, -935, -1148, -990, -988, -1042, -1188, -919, -1197, -1282, -880, -1051, -1213, -995, -1130, -1331, -1192, -1125, -1106, -1327, -889, -1132, -952, -1050, -1274, -920, -1137, -805, -1127, -1153, -1444, -1040, -1060, -1260, -1315, -1302, -1144, -898, -1094, -1163, -1127, -760, -1543, -1124, -759, -872, -919, -1083, -1359, -1019, -1021, -907, -1047, -1238, -1051, -1137, -1299, -1199, -1346, -1029, -1342, -1174, -1227, -1269, -1547, -1234, -1047, -1052, -1068, -926, -1334, -902, -1131, -1278, -826, -1368, -1267, -1182, -1182, -1044, -1563, -1110, -1154, -1131, -673, -1052, -964, -727, -1140, -343, -1194, -970, -1115, -1073, -931, -1139, -1164, -954, -1019, -992, -983, -787, -843, -1026, -1101, -955, -961, -1015, -906, -713, -1027, -842, -918, -1157, -994, -1246, -985, -1211, -1320, -1163, -708, -800, -721, -761, -1166, -1138, -1027, -1207, -1271, -1692, -1448, -1057, -802, -951, -905]
823539i05j15p7l25M82j63j32o9K99K5l5l18K77l74K15j06M45k03J17K41j50k71
824817a142n8K54l11K24k3k97M92R2l56q0K68j81l5j45R8R6M50o91M10k80L50
826097h65K07l06l97r3Q6O93l45N2m12r2L08M57k61j8J5J59l49J02j2Q6j28j10
827446a223M17O0m0n56K32QP5P4m1j3j95K1L81j95l27K61k8k40M02K58o01J09
828786a161j63L56j84J76J00l64M71l33R0qJ67n61L49p1k27M1J26J17L0o7j35
830066a251K02N2mn50N48l9k44L66k71R4K3J81l26M8P2k36L02K1m63K87K90k27
831413a125j60Q4M57m3p5j35J7O3k47p4L38o6l2l55M00l82N07n11Km4L24j2M49
832815f20k78J88m94N0n1J22l%m8J07J48r9P3N3m6r7m7Q1P0m38M85l55j33J33
$$ y = [-905, -1020, -1097, -1422, -940, -1103, -1235, -1304, -1005, -980, -1015, -1333, -1056, -1430, -1215, -1321, -876, -1079, -962, -721, -871, -1142, -1200, -946, -1257, -1033, -1056, -1353, -861, -769, -1125, -1205, -937, -1118, -1153, -1298, -1200, -1104, -654, -1345, -935, -1215, -865, -658, -964, -1361, -1454, -1368, -675, -1020, -968, -1380, -1472, -1164, -707, -968, -986, -971, -812, -1161, -1059, -1071, -985, -1113, -1223, -806, -746, -786, -1342, -1110, -1102, -1027, -953, -994, -1007, -1202, -1181, -800, -995, -1322, -1061, -1089, -1329, -927, -669, -1270, -1161, -1324, -968, -1152, -976, -876, -1240, -769, -1102, -1012, -1020, -853, -1414, -1065, -1136, -1363, -1322, -1196, -1079, -1049, -1116, -1251, -1049, -997, -1001, -1551, -1003, -1042, -1286, -920, -1191, -1097, -1074, -893, -1219, -1171, -1099, -1335, -1033, -1012, -1475, -1188, -898, -1125, -1285, -1201, -744, -787, -862, -997, -980, -917, -1164, -1238, -900, -966, -998, -1353, -953, -1335, -828, -1339, -1337, -1381, -1057, -1069, -620, -898, -710, -1204, -1154, -1205, -1083, -1086, -1086, -1134, -1027, -879, -978, -905, -852, -898, -995, -1042, -961, -891, -1329, -844, -1199, -1332, -1199]
834279a199p5J43J81j07j44j12J71n7j66M76o5L37p77R9P2J14J56J77k40n3j11
835559a180J10q9K36j22QkP4m6k2j18l9J82m04N88j95k63J16k52M53p3K36l66
836906a168M70l65q6l9J73j62q1M21k85m5J79J18o66M01j10M8P0J14j34p8J67
838186a058J43j98J64r1N6j62o8K27J22k49l85N23l35P1o2O2J25j04L09r6j69
839465a175L59k68j41J28J91o6J00k91K33l0j80L01k26k76M35k17J54j62J67l8
840691a002J86j90j06r1j33L3L72M4j1k22m0J36k02J16o9R7l84j73Q05k76k8j37
842031a275K24j3J81L8j6k92j68J12k72L58J03J2l62M35N2K72j65Lo05L77P8l92
843372a315j06M88l73N19k41j44L74n49l78N45P6L2l01M05q0k97K06q0j62J11
$$ y = [-1199, -1274, -1131, -950, -1057, -1201, -1313, -1142, -1199, -1365, -889, -954, -617, -1394, -1295, -1223, -1109, -953, -776, -1016, -1069, -1180, -1070, -1159, -923, -1045, -1037, -1039, -965, -1011, -1033, -1151, -1190, -1008, -1412, -824, -1019, -1282, -1166, -1418, -965, -1038, -802, -1168, -698, -1063, -1149, -1188, -1015, -1177, -1258, -837, -1122, -1167, -988, -870, -1536, -1135, -1245, -1197, -1127, -1013, -1147, -1225, -1058, -915, -1113, -949, -1040, -984, -1146, -1214, -987, -865, -1114, -1499, -976, -1311, -1240, -1302, -1240, -1115, -1219, -910, -1006, -1175, -816, -1084, -1225, -1097, -906, -972, -872, -1163, -930, -960, -1140, -839, -1065, -1341, -906, -1123, -969, -1131, -964, -1002, -816, -1006, -1112, -1203, -1336, -1303, -931, -887, -898, -1120, -1160, -1024, -1226, -1110, -1179, -1082, -1466, -1639, -834, -1110, -1138, -1275, -1051, -1064, -883, -845, -861, -1153, -1321, -1209, -1481, -1123, -1020, -1008, -1370, -935, -883, -611, -776, -773, -1378, -1001, -923, -1315, -1421, -933, -1306, -787, -1028, -1172, -798, -1347, -1725, -1180, -1104, -1072, -1373, -968, -1048, -1345, -1139, -1219, -1381, -1270]
844597a270J90j06M11l30J99k3j67J91l87K85j49JJ05o2L7L45l50j42mm0Nj55
845938a416J02J55L94m64R9J27J42j89J20m67J04J05K1N8r9K64K0K34j34j59Q4
847218h99j7k54L09l40K01J32j19J70J37l42Q6j53J28o3j40k6L4M22k36l46L01
848505a015r4L54k31m42N15n25O07l65N97k00l57k51L15m0J64k90M19j81J48j96
849722a068k21J33L14l66K13j24L07l39N4l24Q9L42k28J06k17j6K50k7j35N06
850941g51K00l06n91L79q2J51m81N45m92L88J4K46j33j36k4j8J23l90L44R2j03
852227a025J62j82P5j58J82j86j30L28k21K12q7J43Pk8J4kN4k15J57k74K22J32
853569h20j11j67N2J96lj4q3o8K1j37K80k53K50j05L5j11k47L46K89n33J13P7
$$ y = [-1270, -1080, -1186, -775, -1105, -906, -929, -1096, -905, -1292, -1007, -1156, -1155, -1050, -1112, -1075, -730, -1080, -1222, -1226, -1266, -1261, -1416, -1314, -1159, -765, -1229, -1130, -1003, -861, -1050, -930, -1397, -1293, -1188, -1167, -1109, -1208, -944, -924, -690, -824, -983, -899, -916, -1170, -861, -1201, -1000, -868, -987, -817, -680, -1022, -936, -1089, -961, -1024, -1164, -1190, -1156, -734, -970, -1316, -1015, -1109, -755, -986, -1428, -913, -1438, -831, -1196, -599, -799, -1156, -1407, -1092, -1132, -968, -1258, -839, -1020, -872, -1068, -1289, -1156, -842, -1208, -995, -1119, -812, -1151, -1097, -1421, -1332, -990, -1218, -1112, -1329, -1345, -1095, -1122, -1257, -751, -551, -857, -1448, -1069, -1151, -1000, -1481, -936, -1428, -1040, -1026, -780, -913, -1049, -1073, -1091, -968, -1358, -1014, -922, -1025, -863, -1045, -970, -1128, -946, -1132, -1262, -934, -1155, -943, -1030, -887, -880, -908, -894, -896, -842, -1057, -900, -1174, -952, -820, -931, -1098, -1046, -850, -853, -867, -950, -1018, -997, -1134, -854, -1107, -857, -962, -927, -1038, -1285, -939, -650, -1183, -1070, -993]
854910i93j39M51l48k4j24L74l92j21L83j3j22R9p5Q7j08K82m80j25K03M08l28
856188a105L8j4J43k26J79j06J4j09P0p4r7L82m06K77Q0Rk72J83j00q3J80j93
857537a230K41j67R8K32Qq5k79r4J63r7L53j28j2k2q6j99O3m4L58N1j03J23j45
858939a001N8l37R1J40j49j19L67K07k43J07J4m14J36J94k00J85j88j42K37r9
860157a156J8j45L04n90L83J93j67M2l2j7K27K5n18M78o8J16k11k84J6K88p2J98
861506i72K28l52q7L02P9j03k03K44k47o0j3L64j4J43l43L9m6J94k41j86N91m33
862845a116K31J13O4o0j31j82J60j68K67j025M45j07J96M87k34J10k11K78k59
864002a142j6M85m72k9k00J088n69l2k71M5k2k21L93k05N4O6L27k60Q5l05J32
$$ y = [-993, -1132, -681, -1029, -1053, -1177, -803, -1195, -1316, -933, -946, -1068, -969, -1044, -957, -1065, -783, -1263, -1388, -1185, -777, -1105, -1067, -1081, -938, -1164, -985, -1091, -1077, -1186, -1116, -1190, -1287, -905, -1311, -1034, -954, -945, -1217, -1034, -1134, -1217, -1037, -1230, -989, -1156, -1058, -826, -818, -903, -1182, -1276, -1113, -1210, -857, -985, -997, -1019, -1105, -1304, -1241, -1285, -927, -876, -979, -856, -1001, -943, -1280, -1189, -1049, -1198, -1317, -950, -743, -986, -879, -865, -1279, -1143, -949, -1149, -964, -1152, -1294, -1057, -1156, -1138, -1283, -979, -1569, -1186, -993, -1160, -1118, -1150, -1167, -940, -915, -1433, -955, -1023, -907, -1118, -1402, -1386, -1098, -1170, -972, -744, -1096, -1183, -881, -802, -905, -1108, -864, -1111, -1171, -1184, -820, -834, -691, -1034, -995, -1041, -847, -1088, -1274, -683, -1116, -885, -772, -708, -768, -899, -1081, -921, -1089, -822, -1847, -1402, -1509, -1313, -826, -1060, -950, -1161, -883, -1142, -1158, -673, -1145, -1174, -1374, -286, -855, -887, -1158, -1113, -1135, -1356, -963, -1168, -1114, -1048, -721, -981, -896, -1201, -1069]
865289a069K67j90J9J11l56M18l46r4Q9q1K19J07O5m79L11n3L55o93M34j33j06
866568a205P13l68k70p4k33R9Q9L03k61K6J27K57k2l85K11Lk81r4O68m99J10J38
867909i48J64j33m7k40J96k44K10l65O79J34p18R1L76rj55k02K85k92J37J35j14
869197a060o6Q8L8K4k50k3j51J81K12q1K34L3m65L26J50n9k75K39k00K6K32k96
870537a143P2%K04j86p0j00K48k13J29J65l88k8L01K00l77N57k95K05m3q8j11
871817i61J89j52k71J68K3j12R1o0N1K31l21N1j9k29N31l24pJ94m99J84N8L18
873164h66N0j94k30J65R2m02M66K16o12j57J43K52o1q1R2L03l04J60K64o2j16
874444h82M6j61l12K45%J84l22M15k33J47k73J12K4k36K90l32J83l8M2o3K2J47
$$ y = [-1069, -802, -992, -973, -862, -1218, -800, -1146, -1240, -1151, -1232, -1013, -906, -841, -1320, -1009, -1062, -707, -1400, -966, -1099, -1205, -492, -860, -1130, -1204, -1437, -1338, -1249, -946, -1207, -1181, -1054, -797, -819, -1204, -993, -990, -1271, -1365, -697, -1196, -1086, -948, -784, -917, -964, -1204, -1008, -1252, -1042, -1407, -728, -594, -1312, -1221, -845, -854, -1009, -1211, -926, -1218, -1081, -946, -1060, -1126, -1038, -1000, -976, -1226, -1249, -1400, -1219, -1007, -1088, -854, -821, -1286, -960, -810, -869, -1144, -905, -1105, -1079, -847, -1143, -1071, -1071, -867, -1053, -1123, -1223, -975, -1188, -1059, -894, -1282, -1310, -1009, -809, -1186, -629, -924, -719, -762, -850, -961, -772, -924, -1195, -1027, -1004, -1116, -1025, -1085, -1034, -803, -1124, -1073, -1092, -1321, -790, -1114, -1121, -927, -1426, -1242, -1184, -866, -816, -1010, -1240, -1075, -983, -1385, -919, -703, -1315, -1472, -1329, -1077, -1138, -1219, -1127, -824, -1128, -968, -704, -766, -882, -836, -997, -1309, -1064, -1064, -880, -1202, -787, -1020, -873, -1146, -1034, -1010, -1246, -956, -1288, -1105, -1143, -1101, -1164, -1142, -995]
875785i95N3M6r8q5J40k95M4L04l29L03J19q6J84k80j11n6R0R7j13K38j51J98
877125g83n13J88O1m5J39j17k39N70j27q9l67L4J10L89k94N6l83J46J22N4k16
878412a304K18K08k69K42L11m99J73J87Nq9n40N33k35O5K4o4p4M11n63p7J01l0
879752a266J36l2N6L24k59J91Kj71M5j20o4K60Jn2N1o1p9M4Nj63K46r3m5L4lQ
881339a005K14j49m8m7k05M35j81k31n5P5j29M31k75N1M4j37L81k54n1K78K62
882625e96k24l89P5K08k66jM4
$$ y = [-995, -942, -896, -994, -1079, -939, -1234, -1190, -886, -1215, -912, -793, -879, -695, -975, -1086, -1142, -1052, -955, -1068, -830, -981, -783, -1296, -1108, -1047, -1092, -953, -1070, -1309, -739, -866, -955, -1322, -1288, -1178, -789, -1083, -1027, -1410, -1264, -1142, -1088, -1304, -1086, -878, -1147, -905, -594, -1093, -920, -733, -728, -817, -1357, -824, -1059, -994, -970, -1034, -1108, -697, -1260, -1337, -1236, -1266, -1130, -1162, -1106, -782, -1041, -850, -848, -1019, -974, -1094, -1158, -898, -897, -949, -898, -959, -1038, -994, -989, -1152, -906, -999, -1044, -1010, -1013, -1005, -791, -940, -988, -1035, -1240, -805, -986, -1217, -1272, -1197, -1326, -895, -1170, -1119, -1075, -1212, -831, -1085, -1136, -858, -596, -820, -1209, -1134, -926, -1192, -1193, -1149]
##END=
