##TITLE=iChemLabsInternalChloroethane.jdx
##JCAMP-DX=4.24 $$ChemDoodle v4.0.0
##ORIGIN=null
##OWNER=UNKNOWN
##DATE=11/02/10
##TIME=11:20:17
##NPOINTS=6006
##FIRSTX=-5.0
##LASTX=15.0
##FIRSTY=0.0
##XUNITS=δ
##YUNITS=
##XFACTOR=1.0
##DELTAX=9.999983E-5
##YFACTOR=4.656613E-10
##XYDATA= (X++(Y..Y))
-5.000000@
|-0.025000@S17J%TJ%JVKLMTOPJ0J3J6K1K6L4M3N5O9Q8J11J39J75K19K75L42M25N29O55Q09R98
-0.009700E084J227J506J845K253K746L339M050M901N919P129Q567J0272J2287J4662J7455
-0.008200A03242K0731K4565K9037L4244M0287M7285N5366O4673P5365Q7613J01608J17555
-0.007000H01571J35677J56214J79424K05582K34980K67929L04746L45773L91360M41858
-0.006000C465114M97638N59067O26505P00326P80865Q68470R63457J066094J176648J295324
-0.005000A1999508J422262J557578J701298J853364K013660K181976K357962K541240K731220
-0.004100C0360068K927302L128702L334484L543684L755116L967540M179536M389644M596208
-0.003200F4182284M797572M991928N177432N352176N514216N661592N792352N904616N996472
-0.002300A13370640O066128O111920O132296O125816O091248O027600N933952N809840
$$ plain form
-0.009700 5084 6311 7817 9662 11915 14661 18000 22050 26951 32870 39999 48566 58838 71125 85787 103242
-0.008200 103242 123973 148538 177575 211819 252106 299391 354757 419430 494795 582408 684016 801571
-0.007000 801571 937248 1093462 1272886 1478468 1713448 1981377 2286123 2631896 3023256 3465114
-0.006000 3465114 3962752 4521819 5148324 5848650 6629515 7497985 8461442 9527536 10704184 11999508
-0.005000 11999508 13421770 14979348 16680646 18534010 20547670 22729646 25087608 27628848 30360068
-0.004100 30360068 33287370 36416072 39750556 43294240 47049356 51016896 55196432 59586076 64182284
-0.003200 64182284 68979856 73971784 79149216 84501392 90015608 95677200 101469552 107374168 113370640
-0.002300 113370640 119436768 125548688 131680984 137806800 143898048 149925648 155859600 161669440
-0.001500A61669440N654864N468976N252352N005552M729296M424672M093072L736016
-0.000700B00034240L355520K953616K532672K095296J644192J182256P12512K38048k38048
0.000200B14510304p12512j182256j644192k095296k532672k953616l355520l736016m093072
0.001100A92205152m424672m729296n005552n252352n468976n654864n809840n933952o027600
0.002000A43898048o091248o125816o132296o111920o066128n996472n904616n792352n661592
0.002900I0015608n514216n352176n177432m991928m797572m596208m389644m179536l967540
0.003800D7049356l755116l543684l334484l128702k927302k731220k541240k357962k181976
0.004700B0547670k013660j853364j701298j557578j422262j295324j176648j066094r63457
$$ plain form
-0.001500 161669440 167324304 172793280 178045632 183051184 187780480 192205152 196298224 200034240
-0.000700 200034240 203389760 206343376 208876048 210971344 212615536 213797792 214510304 214748352 214510304
0.000200 214510304 213797792 212615536 210971344 208876048 206343376 203389760 200034240 196298224 192205152
0.001100 192205152 187780480 183051184 178045632 172793280 167324304 161669440 155859600 149925648 143898048
0.002000 143898048 137806800 131680984 125548688 119436768 113370640 107374168 101469552 95677200 90015608
0.002900 90015608 84501392 79149216 73971784 68979856 64182284 59586076 55196432 51016896 47049356
0.003800 47049356 43294240 39750556 36416072 33287370 30360068 27628848 25087608 22729646 20547670
0.004700 20547670 18534010 16680646 14979348 13421770 11999508 10704184 9527536 8461442 7497985
0.005600G497985q68470p80865p00326o26505n59067m97638m41858l91360l45773l04746
0.006600A981377k67929k34980k05582j79424j56214j35677j17555j01608q7613p5365o4673
0.007700C54757n5366m7285m0287l4244k9037k4565k0731j7455j4662j2287j0272q567p129
0.009000C2870n919m901m050l339k746k253j845j506j227r98q09o55n29m25l42k75k19j75j39
$$ plain form
0.005600 7497985 6629515 5848650 5148324 4521819 3962752 3465114 3023256 2631896 2286123 1981377
0.006600 1981377 1713448 1478468 1272886 1093462 937248 801571 684016 582408 494795 419430 354757
0.007700 354757 299391 252106 211819 177575 148538 123973 103242 85787 71125 58838 48566 39999 32870
0.009000 32870 26951 22050 18000 14661 11915 9662 7817 6311 5084 4086 3277 2622 2093 1668 1326 1051 832 657 518
0.010900E18j11q8o9n5m3l4k6k1j6j3j0pomTlkjV%j%Tj%S16
|1.349014@S10J%UJT%KJKLMNORJ1J4J9K5L2M2N4P0R0J15J49J89K42L08L92M96O28P92R97J252
1.363516E952J570J960K447L046L782M685N789P140Q782J0765J3195J6120J9646K3889K8981
1.365016A57749L5074M2294N1004O1298P3494Q7911J04909J24898J48153J75742K07750K45004
1.366216A515280K88253L38330L96161M62174N39187O26835P26978Q41094R70777J117746
1.367217G822815J282211J470814J681184J916946K180422K474018K800236L157632L560316
1.368117B8346594L999868M482470N010700N587076O213996O893704P618704Q418448R267648
1.369017H5839208J0176048J1144368J2172816J3261064J4390320J5611152J6870592J8182032
1.369817A97647600J9541648K0944784K2385952K3829328K5353824K6866912K8386976
1.370517C64957024K9904064L1407520L2885760L4284960L5715840L7043360L8293824
$$ plain form
1.363516 5952 7522 9482 11929 14975 18757 23442 29231 36371 45153 55918 69113 85233 104879 128768 157749
1.365016 157749 192823 235117 286121 347419 420913 508824 613733 738631 886784 1062526 1270276 1515280
1.366216 1515280 1803533 2141863 2538024 3000198 3539385 4166220 4893198 5734292 6705069 7822815
1.367217 7822815 9105026 10575840 12257024 14173970 16354392 18828410 21628646 24786278 28346594
1.368117 28346594 32346462 36828932 41839632 47426708 53640704 60534408 68153112 76571560 85839208
1.369017 85839208 96015256 107159624 119332440 132593504 146983824 162594976 179465568 197647600
1.369817 197647600 217189248 238134032 260519984 284349312 309703136 336570048 364957024
1.370517 364957024 394861088 426268608 459154368 493439328 529155168 566198528 604492352
1.371217F04492352L9453312M0508096M1443776M2196224M2903488M3402112M3729792
1.371917H98129152M3875648M3829120M3581888M3126144M2406016M1568896M0459904
1.372617A196976768L9129600L7579648L5813120L3836416L1620224K9286144K6731392
1.373318A430973312K4008192K1132416J8119936J4990080J1750016Q460288N098752J703424
1.374118A536236416j703424n098752q460288j1750016j4990080j8119936k1132416k4008192
1.374918A430973312k6731392k9286144l1620224l3836416l5813120l7579648l9129600
1.375618A196976768m0459904m1568896m2406016m3126144m3581888m3829120m3875648
1.376318H98129152m3729792m3402112m2903488m2196224m1443776m0508096l9453312
$$ plain form
1.371217 604492352 643945664 684453760 725897536 768093760 810997248 854399360 898129152
1.371917 898129152 942004800 985833920 1029415808 1072541952 1114947968 1156516864 1196976768
1.372617 1196976768 1236106368 1273686016 1309499136 1343335552 1374955776 1404241920 1430973312
1.373318 1430973312 1454981504 1476113920 1494233856 1509223936 1520973952 1529434240 1534532992 1536236416
1.374118 1536236416 1534532992 1529434240 1520973952 1509223936 1494233856 1476113920 1454981504 1430973312
1.374918 1430973312 1404241920 1374955776 1343335552 1309499136 1273686016 1236106368 1196976768
1.375618 1196976768 1156516864 1114947968 1072541952 1029415808 985833920 942004800 898129152
1.376318 898129152 854399360 810997248 768093760 725897536 684453760 643945664 604492352
1.377018F04492352l8293824l7043360l5715840l4284960l2885760l1407520k9904064
1.377718C64957024k8386976k6866912k5353824k3829328k2385952k0944784j9541648
1.378418A97647600j8182032j6870592j5611152j4390320j3261064j2172816j1144368
1.379119I6015256j0176048r267648q418448p618704o893704o213996n587076n010700m482470
1.380019C2346462l999868l560316l157632k800236k474018k180422j916946j681184j470814
1.380919I105026j282211j117746r70777q41094p26978o26835n39187m62174l96161l38330
1.381919A803533k88253k45004k07750j75742j48153j24898j04909q7911p3494o1298n1004
1.383019B35117m2294l5074k8981k3889j9646j6120j3195j0765q782p140n789m685l782l046
$$ plain form
1.377018 604492352 566198528 529155168 493439328 459154368 426268608 394861088 364957024
1.377718 364957024 336570048 309703136 284349312 260519984 238134032 217189248 197647600
1.378418 197647600 179465568 162594976 146983824 132593504 119332440 107159624 96015256
1.379119 96015256 85839208 76571560 68153112 60534408 53640704 47426708 41839632 36828932 32346462
1.380019 32346462 28346594 24786278 21628646 18828410 16354392 14173970 12257024 10575840 9105026
1.380919 9105026 7822815 6705069 5734292 4893198 4166220 3539385 3000198 2538024 2141863 1803533
1.381919 1803533 1515280 1270276 1062526 886784 738631 613733 508824 420913 347419 286121 235117
1.383019 235117 192823 157749 128768 104879 85233 69113 55918 45153 36371 29231 23442 18757 14975 11929
1.384419A1929k447j960j570j252r97p92o28m96l92l08k42j89j49j15r0p0n4m2l2k5j9j4j1ron
1.387020A5mlkjk%jT%Uj%X8J%TJ%JUKLTMOQJ0J3J7K2K9L8M9O3Q2J05J35J74K22K84L61M58N81
1.398122B674P35R28J168J467J839K295K867L568M429N488O782Q362J0287J2609J5456J8882
1.399722I9836K3012K7982L3945M1083M9541N9743P1799Q6086J02973J22882J46297J73535
1.400922A038714K05853K43343K86980L37639L96295M64034N41358O31565P34228Q51531
1.401922E731540R85196J137099J309247J501890J722806J969216K245374K553988K897886
1.402822B2054242L279994L698622M170298M685160N250444N869172O544292P278628Q074796
1.403723G0905648Q924000R860760J0855456J1919488J3053712J4258360J5533040J6855776
$$ plain form
1.384419 11929 9482 7522 5952 4700 3703 2911 2283 1787 1395 1087 845 656 507 392 302 232 178 136 104 79 60 46 35 26 20 15
1.387020 15 11 8 6 5 3 3 2 1 1 1 1 0 0 0 0 0 0 0 0 0 0 0 0 0 0 0 0 0 0 0 0 0 0 0 0 0 0 0 0 0 0 0 0 0 0 0 0 0 0 0 0 0 0 0 0 0 0 0 0 0 0 0 0 0 0 0 0 0 0 0 0 0 0 0 0 0 0 0 0 0 1 1 1 2 2 3 4 5 7 10 13 17 23 31 41 54 71 93 122 160 209 272 354 459 594 768 990 1274 1635 2093 2674
1.398122 2674 3409 4337 5505 6972 8811 11106 13973 17541 21970 27458 34240 42602 52889 65498 80954 99836
1.399722 99836 122848 150830 184775 225858 275399 335142 406941 493027 596000 718882 865179 1038714
1.400922 1038714 1244567 1487910 1774890 2112529 2508824 2972858 3514216 4145781 4880009 5731540
1.401922 5731540 6716736 7853835 9163082 10664972 12387778 14356994 16602368 19156356 22054242
1.402822 22054242 25334236 29032858 33203156 37888316 43138760 49007932 55552224 62830852 70905648
1.403723 70905648 79829648 89690408 100545864 112465352 125519064 139777424 155310464 172166240
1.404523A72166240J8285792J9761008K1297104K2889680K4533200K6221312K7911936
1.405223C33066272K9697664L1469984L3250432L5027456L6788480L8520064M0158912
1.405923E77979264M1834944M3389952M4854592M6212800M7448192M8544320M9425536
1.406623H99689600N0254080N0838080N1222016N1392704N1338368N1048704N0514816
1.407323A256298368M9671296M8690816M7391744M5833600M4018048M1949184L9633408
1.408023A573486464L7037696L4303616L1311104K8121600K4752896K1224576J7558400
1.408723A767796352J3762816R909760N972480J995008j995008n972480r909760j3762816
1.409524A767796352j7558400k1224576k4752896k8121600l1311104l4303616l7037696
$$ plain form
1.404523 172166240 190452032 210213040 231510144 254399824 278933024 305154336 333066272
1.405223 333066272 362763936 394233920 427484352 462511808 499300288 537820352 577979264
1.405923 577979264 619814208 663204160 708058752 754271552 801719744 850264064 899689600
1.406623 899689600 949943680 1000781760 1052003776 1103396480 1154734848 1205783552 1256298368
1.407323 1256298368 1305969664 1354660480 1402052224 1447885824 1491903872 1533853056 1573486464
1.408023 1573486464 1610524160 1644827776 1676138880 1704260480 1729013376 1750237952 1767796352
1.408723 1767796352 1781559168 1791468928 1797441408 1799436416 1797441408 1791468928 1781559168 1767796352
1.409524 1767796352 1750237952 1729013376 1704260480 1676138880 1644827776 1610524160 1573486464
1.410224A573486464l9633408m1949184m4018048m5833600m7391744m8690816m9671296
1.410924A256298368n0514816n1048704n1338368n1392704n1222016n0838080n0254080
1.411624H99689600m9425536m8544320m7448192m6212800m4854592m3389952m1834944
1.412324E77979264m0158912l8520064l6788480l5027456l3250432l1469984k9697664
1.413024C33066272k7911936k6221312k4533200k2889680k1297104j9761008j8285792
1.413724A72166240j6855776j5533040j4258360j3053712j1919488j0855456r860760q924000
1.414524G0905648q074796p278628o544292n869172n250444m685160m170298l698622l279994
1.415425B2054242k897886k553988k245374j969216j722806j501890j309247j137099r85196
$$ plain form
1.410224 1573486464 1533853056 1491903872 1447885824 1402052224 1354660480 1305969664 1256298368
1.410924 1256298368 1205783552 1154734848 1103396480 1052003776 1000781760 949943680 899689600
1.411624 899689600 850264064 801719744 754271552 708058752 663204160 619814208 577979264
1.412324 577979264 537820352 499300288 462511808 427484352 394233920 362763936 333066272
1.413024 333066272 305154336 278933024 254399824 231510144 210213040 190452032 172166240
1.413724 172166240 155310464 139777424 125519064 112465352 100545864 89690408 79829648 70905648
1.414524 70905648 62830852 55552224 49007932 43138760 37888316 33203156 29032858 25334236 22054242
1.415425 22054242 19156356 16602368 14356994 12387778 10664972 9163082 7853835 6716736 5731540
1.416325E731540q51531p34228o31565n41358m64034l96295l37639k86980k43343k05853
1.417325A038714j73535j46297j22882j02973q6086p1799n9743m9541m1083l3945k7982k3012
1.418525I9836j8882j5456j2609j0287q362o782n488m429l568k867k295j839j467j168r28p35
1.420125B674n81m58l61k84k22j74j35j05q2o3m9l8k9k2j7j3j0qomlTkjU%j%Tj%X7J%UJWLTMNP
1.431327B8RJ1J6K0K7L5M5N8P6R7J26J61K08K65L38M31N46O94Q78J107J394J751K194K740L421
1.433828A6676M257N287O549Q093R980J2277J5048J8445K2534K7463L3395M0511M9029N9123
1.435228C28667P1298Q5687J02736J22890J46650J74594K07101K45668K90410L42488M02945
1.436328B521134M72947N53788O46067P53722Q76243J016233J175754J357036J562482J792384
$$ plain form
1.416325 5731540 4880009 4145781 3514216 2972858 2508824 2112529 1774890 1487910 1244567 1038714
1.417325 1038714 865179 718882 596000 493027 406941 335142 275399 225858 184775 150830 122848 99836
1.418525 99836 80954 65498 52889 42602 34240 27458 21970 17541 13973 11106 8811 6972 5505 4337 3409 2674
1.420125 2674 2093 1635 1274 990 768 594 459 354 272 209 160 122 93 71 54 41 31 23 17 13 10 7 5 4 3 2 2 1 1 1 0 0 0 0 0 0 0 0 0 0 0 0 0 0 0 0 0 0 0 0 0 0 0 0 0 0 0 0 0 0 0 0 0 0 0 0 0 0 0 0 0 0 0 0 0 0 0 0 0 0 0 0 0 0 0 0 0 0 0 0 0 0 0 0 0 0 0 0 1 1 1 1 2 3 4 5 6 9 12 16 21 28
1.431327 28 37 48 64 84 111 146 191 249 325 422 548 709 917 1182 1520 1951 2497 3191 4069 5176 6570 8321 10515 13255 16676
1.433828 16676 20933 26220 32769 40862 50842 63119 78167 96612 119146 146609 180004 220515 269544 328667
1.435228 328667 399965 485652 588388 711278 857928 1032522 1239623 1485291 1775701 2118189 2521134
1.436328 2521134 2994081 3547869 4193936 4947658 5823901 6840134 8015888 9372924 10935406 12727790
1.437328A2727790K056032K350102K679672L047982L458396L914410M414008M976920N591360
1.438228D5216672O265988P004388P810092Q686460R636616J0650088J1768032J2955104
1.439029A19993440J4224960J5578560J7016208J8537456K0116016K1822640K3583168
1.439729B50872448K5416416K7316960K9278464L1292992L3310688L5441792L7556864
1.440429D70486624L9681760M1802432M3904128M5970624M7926464M9926656N1782464
1.441129G91481152N3530304N5151360N6625600N7933696N8985536N9974144O0671232
1.441829A194353024O1129344O1333120O1268224O0922368O0285440N9278976N8108416
1.442529A616678912N6558336N4698624N2532224N0062720M7299584M4201344M0938496
$$ plain form
1.437328 12727790 14783822 17133924 19813596 22861578 26319974 30234384 34648392 39625312 45216672
1.438228 45216672 51482660 58487048 66297140 74983600 84620216 95270304 107038336 119993440
1.439029 119993440 134218400 149796960 166813168 185350624 205466640 227289280 250872448
1.439729 250872448 276288864 303605824 332884288 364177280 397487968 432929760 470486624
1.440429 470486624 510168384 551970816 595874944 641845568 689772032 739698688 791481152
1.441129 791481152 845011456 900162816 956788416 1014722112 1073707648 1133681792 1194353024
1.441829 1194353024 1255482368 1316815488 1378083712 1439006080 1499291520 1558570496 1616678912
1.442529 1616678912 1673237248 1727935872 1780468096 1830530816 1877830400 1922031744 1962970240
1.443229A962970240L7367680L3560576K9540736K5329792K0954496J6424832J1826560
1.443929B137974912P127552K381183k381183p127552j1826560j6424832k0954496k5329792
1.444729B063439232k9540736l3560576l7367680m0938496m4201344m7299584n0062720
1.445430A780468096n2532224n4698624n6558336n8108416n9278976o0285440o0922368
1.446130A378083712o1268224o1333120o1129344o0671232n9974144n8985536n7933696
1.446830I56788416n6625600n5151360n3530304n1782464m9926656m7926464m5970624
1.447530E95874944m3904128m1802432l9681760l7556864l5441792l3310688l1292992
1.448230C32884288k9278464k7316960k5416416k3583168k1822640k0116016j8537456
$$ plain form
1.443229 1962970240 2000337920 2033898496 2063439232 2088769024 2109723520 2126148352 2137974912
1.443929 2137974912 2145102464 2147483647 2145102464 2137974912 2126148352 2109723520 2088769024 2063439232
1.444729 2063439232 2033898496 2000337920 1962970240 1922031744 1877830400 1830530816 1780468096
1.445430 1780468096 1727935872 1673237248 1616678912 1558570496 1499291520 1439006080 1378083712
1.446130 1378083712 1316815488 1255482368 1194353024 1133681792 1073707648 1014722112 956788416
1.446830 956788416 900162816 845011456 791481152 739698688 689772032 641845568 595874944
1.447530 595874944 551970816 510168384 470486624 432929760 397487968 364177280 332884288
1.448230 332884288 303605824 276288864 250872448 227289280 205466640 185350624 166813168
1.448930A66813168j7016208j5578560j4224960j2955104j1768032j0650088r636616q686460
1.449730F6297140p810092p004388o265988n591360m976920m414008l914410l458396l047982
1.450630A9813596k679672k350102k056032j792384j562482j357036j175754j016233q76243
1.451531D947658p53722o46067n53788m72947m02945l42488k90410k45668k07101j74594
1.452531H57928j46650j22890j02736q5687p1298n9123m9029m0511l3395k7463k2534j8445
1.453731G8167j5048j2277r980q093o549n287m257l421k740k194j751j394j107q78o94n46m31
$$ plain form
1.448930 166813168 149796960 134218400 119993440 107038336 95270304 84620216 74983600 66297140
1.449730 66297140 58487048 51482660 45216672 39625312 34648392 30234384 26319974 22861578 19813596
1.450630 19813596 17133924 14783822 12727790 10935406 9372924 8015888 6840134 5823901 4947658
1.451531 4947658 4193936 3547869 2994081 2521134 2118189 1775701 1485291 1239623 1032522 857928
1.452531 857928 711278 588388 485652 399965 328667 269544 220515 180004 146609 119146 96612 78167
1.453731 78167 63119 50842 40862 32769 26220 20933 16676 13255 10515 8321 6570 5176 4069 3191 2497 1951 1520
1.455431A520l38k65k08j61j26r7p6n8m5l5k7k0j6j1rpnmlTjW%Uj%S08
|2.853056@S18J%UJ%JUKTLMNOQJ0J4J6K2K8L5M4N6P1Q9J11J41J75K18K72L38M18N16O38P83R64
2.868541D994J177J441J752K130K590L128L785M549N480O555P839R376J1137J3260J5673J8573
2.870139A13439K1851K5703L0241L5325M1363M8088N6038O4835P5000Q6771R9669J14754
2.871338H13077J31174J50294J70961J94429K21137K49699K82599L17522L57574L99761M46812
2.872437C735039M99398N54112O16194O80227P52570Q26511R07423R96144J085484J185350
2.873435A1838452J284822J395552J504544J621352J746760J867726K001006K127572K266468
2.874335B7654254K396002K537598K666846K800760K939588L061092L192720L303500L423156
2.875234E3975516L518400L612356L704620L767436L835184L870512L909032L912712L908584
2.876133H8014352L895808L845904L795200L706960L616648L489400L351344L201456L017552
$$ plain form
2.868541 4994 6171 7612 9364 11494 14084 17212 20997 25546 31026 37581 45420 54796 65933 79193 94866 113439
2.870139 113439 135290 160993 191234 226559 267922 316010 372048 436883 511883 598654 698323 813077
2.871338 813077 944251 1094545 1265506 1459935 1681072 1930771 2213370 2530892 2888466 3288227 3735039
2.872437 3735039 4234437 4788549 5404743 6084970 6837540 7664051 8571474 9567618 10653102 11838452
2.873435 11838452 13123274 14518826 16023370 17644722 19391482 21259208 23260214 25387786 27654254
2.874335 27654254 30050256 32587854 35254700 38055460 40995048 44056140 47248860 50552360 53975516
2.875234 53975516 57493916 61106272 64810892 68578328 72413512 76284024 80193056 84105768 88014352
2.876133 88014352 91910160 95756064 99551264 103258224 106874872 110364272 113715616 116917072 119934624
2.877032A19934624K829896K611544K389368K140840J884688J619928J336952J051584P54272
2.877931A36553696M55600J51728j51728m55600p54272j051584j336952j619928j884688
2.878830A29906272k140840k389368k611544k829896l017552l201456l351344l489400l616648
2.879729A03258224l706960l795200l845904l895808l908584l912712l909032l870512l835184
2.880628F8578328l767436l704620l612356l518400l423156l303500l192720l061092k939588
2.881527C8055460k800760k666846k537598k396002k266468k127572k001006j867726j746760
2.882426A7644722j621352j504544j395552j284822j185350j085484r96144r07423q26511
2.883325F837540p52570o80227o16194n54112m99398m46812l99761l57574l17522k82599
$$ plain form
2.877032 119934624 122764520 125376064 127765432 129906272 131790960 133410888 134747840 135799424 136553696
2.877931 136553696 137009296 137161024 137009296 136553696 135799424 134747840 133410888 131790960 129906272
2.878830 129906272 127765432 125376064 122764520 119934624 116917072 113715616 110364272 106874872 103258224
2.879729 103258224 99551264 95756064 91910160 88014352 84105768 80193056 76284024 72413512 68578328
2.880628 68578328 64810892 61106272 57493916 53975516 50552360 47248860 44056140 40995048 38055460
2.881527 38055460 35254700 32587854 30050256 27654254 25387786 23260214 21259208 19391482 17644722
2.882426 17644722 16023370 14518826 13123274 11838452 10653102 9567618 8571474 7664051 6837540
2.883325 6837540 6084970 5404743 4788549 4234437 3735039 3288227 2888466 2530892 2213370 1930771
2.884324A930771k49699k21137j94429j70961j50294j31174j14754r9669q6771p5000o4835
2.885423C72048n6038m8088m1363l5325l0241k5703k1851j8573j5673j3260j1137r376p839
2.886722C7581o555n480m549l785l128k590k130j752j441j177r64p83o38n16m18l38k72k18j75
$$ plain form
2.884324 1930771 1681072 1459935 1265506 1094545 944251 813077 698323 598654 511883 436883 372048
2.885423 372048 316010 267922 226559 191234 160993 135290 113439 94866 79193 65933 54796 45420 37581
2.886722 37581 31026 25546 20997 17212 14084 11494 9364 7612 6171 4994 4030 3247 2609 2093 1675 1337 1065 847 672
2.888620F72j41j11q9p1n6m4l5k8k2j6j4j0qonmlkTjU%j%Uj%Z0J%UJ%JUKTLMNPRJ1J4J9K4L1M0
2.901607A76N0O5Q3J05J33J68K12K67L35M21N25O56Q15J014J254J549J914K349K890L531M323
2.903704B2835N257O390P771R382J1356J3647J6440J9664K3517K8130L3411L9778M7021N5718
2.905103C40317O5553P7109R0722J05976J24090J44262J68114J94507K25000K60312K99008
2.906202B094970L44262L93522M50880N12884N83287O63411P49097Q47797R52565J072723
2.907201H665398J199284J340434J498194J662338J848578K040682K257712K479532K722268
2.908100B5714420K988436L256450L556050L854460M186656M513632M864064N240272N603180
2.908999F3777620O003020O382720O799400P188000P612792Q000536Q402288Q818768R183264
2.909898A32168408R578168R910496J0269456J0555232J0837040J1113872J1302304J1505552
$$ plain form
2.901607 176 226 291 374 479 612 780 992 1259 1594 2015 2540 3196 4011 5025 6279 7828 9742 12091 14981 18512 22835
2.903704 22835 28092 34482 42253 51635 62991 76638 93078 112742 136259 164389 197800 237578 284599 340317
2.905103 340317 405870 482979 573701 679677 803767 948029 1116143 1310650 1535650 1795962 2094970
2.906202 2094970 2439232 2832754 3283634 3796518 4379805 5043216 5792313 6640110 7592675 8665398
2.907201 8665398 9864682 11205116 12703310 14365648 16214226 18254908 20512620 22992152 25714420
2.908100 25714420 28702856 31959306 35515356 39369816 43556472 48070104 52934168 58174440 63777620
2.908999 63777620 69780640 76163360 82962760 90150760 97763552 105764088 114166376 122985144 132168408
2.909898 132168408 141746576 151657072 161926528 172481760 183318800 194432672 205734976 217240528
2.910697B17240528J1611520J1727120J1738128J1725744J1687424J1537728J1385600
2.911397B98653792J1120864J0849920J0468224J0054016R604384R052672Q489696P834592
2.912196C76128160P168128O422528N654048M859776M010816L154784K262848J366784M55168
2.913095D11483040m55168j366784k262848l154784m010816m859776n654048o422528p168128
2.913994C76128160p834592q489696r052672r604384j0054016j0468224j0849920j1120864
2.914793B98653792j1385600j1537728j1687424j1725744j1738128j1727120j1611520
2.915492B17240528j1505552j1302304j1113872j0837040j0555232j0269456r910496r578168
2.916291A32168408r183264q818768q402288q000536p612792p188000o799400o382720o003020
$$ plain form
2.910697 217240528 228852048 240579168 252317296 264043040 275730464 287268192 298653792
2.911397 298653792 309774656 320624576 331092800 341146816 350751200 359803872 368293568 376128160
2.912196 376128160 383296288 389718816 395372864 400232640 404243456 407398240 409661088 411027872 411483040
2.913095 411483040 411027872 409661088 407398240 404243456 400232640 395372864 389718816 383296288 376128160
2.913994 376128160 368293568 359803872 350751200 341146816 331092800 320624576 309774656 298653792
2.914793 298653792 287268192 275730464 264043040 252317296 240579168 228852048 217240528
2.915492 217240528 205734976 194432672 183318800 172481760 161926528 151657072 141746576 132168408
2.916291 132168408 122985144 114166376 105764088 97763552 90150760 82962760 76163360 69780640 63777620
2.917191F3777620n603180n240272m864064m513632m186656l854460l556050l256450k988436
2.918090B5714420k722268k479532k257712k040682j848578j662338j498194j340434j199284
2.918989H665398j072723r52565q47797p49097o63411n83287n12884m50880l93522l44262
2.919988B094970k99008k60312k25000j94507j68114j44262j24090j05976r0722p7109o5553
2.921087C40317n5718m7021l9778l3411k8130k3517j9664j6440j3647j1356r382p771o390n257
2.922485B2835m323l531k890k349j914j549j254j014q15o56n25m21l35k67k12j68j33j05q3o4
2.924483B27n1m0l0k4j9j4j1qnmlj%JLNOQJ1J4J9K4L0L9M9O3Q0J00J26J59J99K48L10L86M79
2.927979B376N93P32R06J111J366J670K044K486L022L674M437N370O453P774R298J1120J3302
$$ plain form
2.917191 63777620 58174440 52934168 48070104 43556472 39369816 35515356 31959306 28702856 25714420
2.918090 25714420 22992152 20512620 18254908 16214226 14365648 12703310 11205116 9864682 8665398
2.918989 8665398 7592675 6640110 5792313 5043216 4379805 3796518 3283634 2832754 2439232 2094970
2.919988 2094970 1795962 1535650 1310650 1116143 948029 803767 679677 573701 482979 405870 340317
2.921087 340317 284599 237578 197800 164389 136259 112742 93078 76638 62991 51635 42253 34482 28092 22835
2.922485 22835 18512 14981 12091 9742 7828 6279 5025 4011 3196 2540 2015 1594 1259 992 780 612 479 374 291 227
2.924483 227 176 136 106 82 63 49 38 30 25 21 18 17 17 18 21 26 32 40 51 65 84 108 138 177 226 289 369 469 595 754 953 1201 1511 1897 2376
2.927979 2376 2969 3701 4607 5718 7084 8754 10798 13284 16306 19980 24417 29787 36240 44014 53312 64432 77734
2.929678G7734J5799J8810K2235K6347L0998L6463M2899N0112N8679O8217P9496R1976J06395
2.930976G26160J23093J41392J62790J86084K13207K42526K75819L13705L54224M00897M50437
2.932075C590334N07257N67103O33848P08449P86067Q74134R64972J067602J172492J287274
2.933074A2159532J413136J539870J681542J822654J979736K134352K300060K477962K649562
2.933973C0158406K838636L018186L215220L398976L599852L783196L973176M170108M342480
2.934872F2498236M529204M686368M856104M991224N124496N255392N344504N440616N490712
2.935771A08216856N545392N550592N544736N526632N455840N383904N258736N130624M950128
2.936671A56563440M754272M541680M280800M014608L704880L389760L037248K673888K298384
$$ plain form
2.929678 77734 93533 112343 134578 160925 191923 228386 271285 321397 380076 448293 527789 619765 726160
2.930976 726160 849253 990645 1153435 1339519 1552726 1795252 2071071 2384776 2739000 3139897 3590334
2.932075 3590334 4097591 4664694 5298542 6006991 6793058 7667192 8632164 9699766 10872258 12159532
2.933074 12159532 13572668 15112538 16794080 18616734 20596470 22730822 25030882 27508844 30158406
2.933973 30158406 32997042 36015228 39230448 42629424 46229276 50012472 53985648 58155756 62498236
2.934872 62498236 67027440 71713808 76569912 81561136 86685632 91941024 97285528 102726144 108216856
2.935771 108216856 113762248 119312840 124857576 130384208 135840048 141223952 146482688 151613312 156563440
2.936671 156563440 161317712 165859392 170140192 174154800 177859680 181249440 184286688 186960576 189258960
2.937570A89258960J897040J492336J070736O47136K16288k13936o44704j068080j489360
2.938469A91166416j893616k294416k669200l031680l383072l696880m004976m269280m527840
2.939368A61395456m737744m930384n107008n230704n350560n416432n479920n489800n485968
2.940267A14166936n469376n401912n336632n223616n114520m961520m802696m637976m435816
2.941166F8782872m240736m012736l792304l543416l294444l043960k771284k504832k220004
2.942065C9359156j939772j644648j354776j044680p41432m30760j12710K10258N37796Q67932
2.943064C3706364J216816J556180J912112K264792K633984K996024L367288L757124M127960
2.943963E7538644M522840M897816N296516N668800O065272O428056O797984P176272P508848
$$ plain form
2.937570 189258960 191156000 192648336 193719072 194366208 194582496 194368560 193723856 192655776 191166416
2.938469 191166416 189272800 186978384 184309184 181277504 177894432 174197552 170192576 165923296 161395456
2.939368 161395456 156657712 151727328 146620320 141389616 136039056 130622624 125142704 119652904 114166936
2.940267 114166936 108697560 103295648 97959016 92735400 87620880 82659360 77856664 73218688 68782872
2.941166 68782872 64542136 60529400 56737096 53193680 49899236 46855276 44083992 41579160 39359156
2.942065 39359156 37419384 35774736 34419960 33375280 32633848 32203088 32090378 32300636 32838432 33706364
2.943064 33706364 34923180 36479360 38391472 40656264 43290248 46286272 49653560 53410684 57538644
2.943963 57538644 62061484 66959300 72255816 77924616 83989888 90417944 97215928 104392200 111901048
2.944862A11901048P863008Q162904Q481968Q738128Q988688R233120R402304R582128R679504
2.945761A92032800R783584R799248R794320R766880R645552R521504R302688R078160Q760480
2.946660B77485216Q415264Q040000P579008P108384O560384O002720N378624M735168M070112
2.947559C35374880L359104K642112J895008J144352L80672l82016j145728j896512k643744
2.948458C38728128l361056m072352m737824n381760o006464o564928p113792p585536q047808
2.949358B85856608q424608q771616r091472r318512r540304r667824r793216r825328r835712
2.950257B01588016r826480r729616r640832r470528r312608r080672q844512q605064q304288
2.951156A18773416q025808p694928p389480p040512o703872o378976o023024n697412n348256
$$ plain form
2.944862 111901048 119764056 127926960 136408928 145147056 154135744 163368864 172771168 182353296 192032800
2.945761 192032800 201816384 211615632 221409952 231176832 240822384 250343888 259646576 268724736 277485216
2.946660 277485216 285900480 293940480 301519488 308627872 315188256 321190976 326569600 331304768 335374880
2.947559 335374880 338733984 341376096 343271104 344415456 344796128 344414112 343268384 341371872 338728128
2.948458 338728128 335367072 331294720 326556896 321175136 315168672 308603744 301489952 293904416 285856608
2.949358 285856608 277432000 268660384 259568912 250250400 240710096 231042272 221249056 211423728 201588016
2.950257 201588016 191761536 182031920 172391088 162920560 153607952 144527280 135682768 127077704 118773416
2.951156 118773416 110747608 103052680 95663200 88622688 81918816 75539840 69516816 63819404 58471148
2.952055E8471148n030096m695060m390976m075732l782096l508116l229764k979714k728670
2.952954B4050924k504092k281066k077668j891800j709944j548976j392920j255378j123187
2.953853H265893j004915q98863p98181p10393o27689n55891m88753m29759l77805l29743
2.954852B043901k88467k50547k18123j88534j62983j40867j20881j03979q8800p6018o4612
2.955951C40090n4929m6687l9401l3331k7996k3571j9705j6477j3776j1435r515p862o511n355
2.957349B3539m405l622k959k421j969j604j298j050q50o83n50m40l52k81k24j78j40j12q7p0
2.959347B44n4m2l3k5k0j5j1qnljJLNQJ1J5K0K6L4M4N6P2R1J17J49J89K38L01L79M75N97P45
2.962644C603R31J156J439J778K197K716L333M100N008O133P458R065J1024J3309J6110J9359
$$ plain form
2.952055 58471148 53441052 48745992 44355016 40279284 36497188 32989072 29759308 26779594 24050924
2.952954 24050924 21546832 19265766 17188098 15296298 13586354 12037378 10644458 9389080 8265893
2.953853 8265893 7260978 6362115 5563934 4853541 4225852 3669961 3181208 2751449 2373644 2043901
2.954852 2043901 1755434 1504887 1286764 1098230 935247 794380 673499 569520 480720 404702 340090
2.955951 340090 285161 238474 199073 165742 137746 114175 94470 77993 64217 52782 43267 35405 28894 23539
2.957349 23539 19134 15512 12553 10132 8163 6559 5261 4211 3361 2678 2128 1688 1336 1055 831 653 513 401 314 244
2.959347 244 190 148 115 90 70 55 44 36 31 28 27 28 31 36 44 55 70 90 116 150 194 250 322 413 530 679 868 1106 1407 1786 2261 2858 3603
2.962644 3603 4534 5690 7129 8907 11104 13820 17153 21253 26261 32394 39852 48917 59941 73250 89360 108719
2.964242A08719K3322K7895L3361L9906M7397N6429O6705P9042R2993J09388J28698J50337
2.965441I64192J76035K04652K38487K75928L19186L69280M24174M88372N58251O39621P27580
2.966540E385758Q27454R41117J062673J202688J351312J521770J701310J901546K125346
2.967439A8020974K358200K622400K894920L202802L517474L861822M239408M619612N044632
2.968338E0382244N467964N939204O403052O900184P433880P948696Q515904R054552R645672
2.969237A17691352J0196936J0799536J1349600J1919520J2510336J3027424J3587632
2.969936B01082336J4059088J4568288J4973696J5373488J5766176J6033504J6321824
2.970636C08178400J6472160J6636128J6651776J6634208J6579840J6367488J6151648
$$ plain form
2.964242 108719 132041 159936 193297 233203 280600 337029 403734 482776 575769 685157 813855 964192
2.965441 964192 1140227 1344879 1583366 1859294 2178480 2547760 2971934 3460306 4018557 4658178 5385758
2.966540 5385758 6213212 7154329 8217002 9419690 10771002 12292772 13994082 15895628 18020974
2.967439 18020974 20379174 23001574 25896494 29099296 32616770 36478592 40718000 45337612 50382244
2.968338 50382244 55850208 61789412 68192464 75092648 82526528 90475224 98991128 108045680 117691352
2.969237 117691352 127888288 138687824 150037424 161956944 174467280 187494704 201082336
2.969936 201082336 215141424 229709712 244683408 260056896 275823072 291856576 308178400
2.970636 308178400 324650560 341286688 357938464 374572672 391152512 407520000 423671648
2.971335D23671648J5776128J5391776J4850272J4262720J3624768J2842272J2043488
2.972034E22463072J1114240J0168800R111104Q020992O894208N689920M475520L210368
2.972833E81148224J939200O46080o45312j938368l209472m474496n688832o892864q019456
2.973732E52864704r109248j0166560j1111552j2040352j2838368j3620192j4257184j4843680
2.974532D54877568j5383936j5766784j6140512j6354368j6564256j6615904j6630208
2.975231C41421600j6610816j6442528j6287200j5993184j5719232j5319168j4910816
2.975930B30138656j4495616j3975552j3491472j2917520j2384400j1776272j1186672
2.976629A39911152j0614248r987704r408872q788488q216288p613728p059480o481720
$$ plain form
2.971335 423671648 439447776 454839552 469689824 483952544 497577312 510419584 522463072
2.972034 522463072 533577312 543746112 552857216 560878208 567772416 573462336 577937856 581148224
2.972833 581148224 583087424 583733504 583088192 581149824 577940352 573465856 567777024 560884160 552864704
2.973732 552864704 543755456 533588896 522477344 510436992 497598624 483978432 469721248 454877568
2.974532 454877568 439493632 423726848 407586336 391231968 374667712 358051808 341421600
2.975231 341421600 324810784 308368256 292081056 276087872 260368640 245049472 230138656
2.975930 230138656 215643040 201667488 188176016 175258496 162874096 151097824 139911152
2.976629 139911152 129296904 119309200 109900328 101111840 92895552 85281824 78222344 71740624
2.977429G1740624n938748n422884m897984m414032l927056l479052l027120k607920k209564
2.978328C5816264j818332j453030j097504p66768m37884j36292J54930M31440O96450R45002
2.979327C2334276J185204J407168J619260J823544K006720K186896K343924K499072K628988
2.980226E0035052K750964K865716K952188L037568L092868L146788L169184L182128L185360
2.981125G7417816L155896L123664L058768K990584K890504K780296K659256K509136K355144
2.982024A02941064K174976J991096J784800J571776J351240J115264Q77056O28696L79040
2.982923A14815008J24944j28912l83192o33200q82080j121008j357976j579712j794240
2.983822A07059632k002432k188520k371440k528640k682704k808280k923944l030536l106208
$$ plain form
2.977429 71740624 65801876 60378992 55481008 51066976 47139920 43660868 40633748 38025828 35816264
2.978328 35816264 33997932 32544902 31447398 30680630 30242746 30106454 30261384 30692824 31389274 32334276
2.979327 32334276 33519480 34926648 36545908 38369452 40376172 42563068 44906992 47406064 50035052
2.980226 50035052 52786016 55651732 58603920 61641488 64734356 67881144 71050328 74232456 77417816
2.981125 77417816 80573712 83697376 86756144 89746728 92637232 95417528 98076784 100585920 102941064
2.982024 102941064 105116040 107107136 108891936 110463712 111814952 112930216 113807272 114435968 114815008
2.982923 114815008 114939952 114811040 114427848 113794648 112912568 111791560 110433584 108853872 107059632
2.983822 107059632 105057200 102868680 100497240 97968600 95285896 92477616 89553672 86523136 83416928
2.984721H3416928l180128l222632l264424l275128l278584l275496l243212l213612l156848
2.985620E4306864l104208l026892k948172k868360k768092k675272k564972k463166k346836
2.986519B9540894k234624k126324k007676j899136j782752j676700j565018j463660j358576
2.987418A3426428j260700j169372j076586r93238r09557q34698p60355o92556o30601n69980
2.988417D528785n16326m64307m18459l74396l34971k99621k66060k36798k09230j85297
2.989416A223320j62917j43254j25935j09914r6155q3516p2708o2844n4328m6956m0293l4660
2.990615A89840k9600k5339k1538j8309j5563j3133j1111r332p857o568n492m592l812l172
2.992014A4422k620k171j785j468j207r87q07o56n35m32l50k84k27j84j46j18r3p5n9m7l7k9k3
$$ plain form
2.984721 83416928 80236800 77014168 73749744 70474616 67196032 63920536 60677324 57463712 54306864
2.985620 54306864 51202656 48175764 45227592 42359232 39591140 36915868 34350896 31887730 29540894
2.986519 29540894 27306270 25179946 23172270 21273134 19490382 17813682 16248664 14785004 13426428
2.987418 13426428 12165728 10996356 9919770 8926532 8016975 7182277 6421922 5729366 5098765 4528785
2.988417 4528785 4012459 3548152 3129693 2755297 2420326 2120705 1854645 1617847 1408617 1223320
2.989416 1223320 1060403 917149 791214 681300 585145 501629 428921 366077 311749 264793 224500 189840
2.990615 189840 160240 134901 113363 95054 79491 66358 55247 45915 38058 31490 25998 21406 17594 14422
2.992014 14422 11802 9631 7846 6378 5171 4184 3377 2721 2186 1754 1404 1120 893 709 563 445 352 277 218 171 134 105 82
2.994311H2j8j4j1qonlkj%KTMNQJ0J3J7K2K8L7M7O0P7R8J25J58K00K52L17L99N00O24P80R69
2.997808D768J206J490J841K275K793L435M197N139O249P596R237J1153J3498J6222J9542
2.999306A10641K3374K7954L3438L9715M7284N5894O6231P7922R1659J07840J25972J47504
3.000505I55428J71483J99835K31208K67455L09430L55427M09221M67774N35956O09659O93347
3.001604E206223P88589Q90443J007766J132303J275134J425574J593358J780886J976000
3.002503A7076276K197384K425734K683716K947392L235928L552318L870900M227036M581760
3.003402D6798444M976624N365300N781856O229056O660432P135712P587064Q082368Q544296
3.004301A07161152R049232R510152R987704J0482752J0916048J1385456J1780496J2207184
$$ plain form
2.994311 82 64 50 39 31 25 20 17 15 14 14 16 18 22 27 35 45 58 75 97 125 162 209 269 346 444 569 727 927 1179 1496 1895 2395 3019 3799 4768
2.997808 4768 5974 7464 9305 11580 14373 17808 22005 27144 33393 40989 50226 61379 74877 91099 110641
2.999306 110641 134015 161969 195407 235122 282406 338300 404531 482453 574112 681952 807924 955428
3.000505 955428 1126911 1326746 1557954 1825409 2134839 2490266 2899487 3367261 3903217 4512876 5206223
3.001604 5206223 5994812 6885255 7893021 9025324 10300458 11726032 13319390 15100276 17076276
3.002503 17076276 19273660 21699394 24383110 27330502 30566430 34118748 37989648 42216684 46798444
3.003402 46798444 51775068 57140368 62922224 69151280 75811712 82947424 90534488 98616856 107161152
3.004301 107161152 116210384 125720536 135708240 146190992 157107040 168492496 180272992 192480176
3.005100A92480176J2546864J2881888J3210912J3434928J3676480J3802480J3939904
3.005800B85973632J3952992J3938240J3892704J3714752J3533920J3219264J2897184
3.006499C81122688J2443424J1951104J1416640J0760768J0091584R312928Q520640P634432
3.007298D63254208O720864N776800M767616L749984K689856J624672N41088n41088j624672
3.008197D86959328k689856l749984m767616n776800o720864p634432q520640r312928
3.008996D37786208j0091584j0760768j1416640j1951104j2443424j2897184j3219264
3.009696C55006240j3533920j3714752j3892704j3938240j3952992j3939904j3802480
3.010395B58231248j3676480j3434928j3210912j2881888j2546864j2207184j1780496
$$ plain form
3.005100 192480176 205027040 217908928 231119840 244554768 258231248 272033728 285973632
3.005800 285973632 299926624 313864864 327757568 341472320 355006240 368225504 381122688
3.006499 381122688 393566112 405517216 416933856 427694624 437786208 447099136 455619776 463254208
3.007298 463254208 469975072 475751872 480519488 484269472 486959328 488584000 489125088 488584000 486959328
3.008197 486959328 484269472 480519488 475751872 469975072 463254208 455619776 447099136 437786208
3.008996 437786208 427694624 416933856 405517216 393566112 381122688 368225504 355006240
3.009696 355006240 341472320 327757568 313864864 299926624 285973632 272033728 258231248
3.010395 258231248 244554768 231119840 217908928 205027040 192480176 180272992 168492496
3.011094A68492496j1385456j0916048j0482752r987704r510152r049232q544296q082368
3.011893I0534488p587064p135712o660432o229056n781856n365300m976624m581760m227036
3.012792C7989648l870900l552318l235928k947392k683716k425734k197384j976000j780886
3.013691A3319390j593358j425574j275134j132303j007766q90443p88589o93347o09659
3.014591C903217n35956m67774m09221l55427l09430k67455k31208j99835j71483j47504
3.015589H07924j25972j07840r1659p7922o6231n5894m7284l9715l3438k7954k3374j9542
3.016788I1099j6222j3498j1153r237p596o249n139m197l435k793k275j841j490j206r69p80
$$ plain form
3.011094 168492496 157107040 146190992 135708240 125720536 116210384 107161152 98616856 90534488
3.011893 90534488 82947424 75811712 69151280 62922224 57140368 51775068 46798444 42216684 37989648
3.012792 37989648 34118748 30566430 27330502 24383110 21699394 19273660 17076276 15100276 13319390
3.013691 13319390 11726032 10300458 9025324 7893021 6885255 5994812 5206223 4512876 3903217
3.014591 3903217 3367261 2899487 2490266 2134839 1825409 1557954 1326746 1126911 955428 807924
3.015589 807924 681952 574112 482453 404531 338300 282406 235122 195407 161969 134015 110641 91099
3.016788 91099 74877 61379 50226 40989 33393 27144 22005 17808 14373 11580 9305 7464 5974 4768 3799 3019
3.018387C019o24n00l99l17k52k00j58j25r8p7o0m7l7k9k2j7j4j0qomTlkjW%Uj%Z0J%TJ%JVKLT
3.030874A4NOPJ0J2J6K0K5L3M2N2O7Q4J06J33J66K08K60L23M02M97O14P58R31J145J399J713
3.033571I048K083K532L079L718M499N407O514P792R318J1146J3238J5761J8632K2077K5974
3.035069A60818L0553L5946M1991M9168N7161O6612P7069Q9152J03143J18476J36407J55924
3.036268A122420J78652K03220K31116K62863K96814L35922L77434M25045M75192N31118
3.037267D439796N93629O58668P32461Q08578Q94572R82464J078642J184106J290302J409012
3.038266A4072230J527252J658876J788432J927286K076352K220142K378574K529018K694128
3.039165C2872290K848098L016408L170052L329232L494252L638684L795148L926836M069056
3.040064F4160056M182288M293960M403640M478312M558840M600824M646624M651000M646072
$$ plain form
3.030874 14 19 25 32 42 54 70 90 115 148 190 242 309 393 499 632 798 1006 1266 1589 1991 2488 3102 3860 4791 5936 7335 9048
3.033571 9048 11131 13663 16742 20460 24959 30366 36880 44672 53990 65136 78374 94135 112767 134844 160818
3.035069 160818 191371 227317 269308 318476 375637 442249 519318 608470 711613 830089 966496 1122420
3.036268 1122420 1301072 1504292 1735408 1998271 2295085 2631007 3008441 3433486 3908678 4439796
3.037267 4439796 5033425 5692093 6424554 7233132 8127704 9110168 10188810 11372916 12663218 14072230
3.038266 14072230 15599482 17258358 19046790 20974076 23050428 25270570 27649144 30178162 32872290
3.039165 32872290 35720388 38736796 41906848 45236080 48730332 52369016 56164164 60091000 64160056
3.040064 64160056 68342344 72636304 77039944 81518256 86077096 90677920 95324544 99975544 104621616
3.040963A04621616M630904M571600M511296M406424M299064M147816L983696L805536L586928
3.041862A42564880L363856L104320K840208K544816K240288J925600J589200J250016Q96608
3.042762A62319792N41552J80352j80352n41552q96608j250016j589200j925600k240288
3.043661A54418080k544816k840208l104320l363856l586928l805536l983696m147816m299064
3.044560A22741840m406424m511296m571600m630904m646072m651000m646624m600824m558840
3.045459H1518256m478312m403640m293960m182288m069056l926836l795148l638684l494252
3.046358D5236080l329232l170052l016408k848098k694128k529018k378574k220142k076352
3.047257B0974076j927286j788432j658876j527252j409012j290302j184106j078642r82464
$$ plain form
3.040963 104621616 109252520 113824120 118335416 122741840 127040904 131188720 135172416 138977952 142564880
3.041862 142564880 145928736 149033056 151873264 154418080 156658368 158583968 160173168 161423184 162319792
3.042762 162319792 162861344 163041696 162861344 162319792 161423184 160173168 158583968 156658368 154418080
3.043661 154418080 151873264 149033056 145928736 142564880 138977952 135172416 131188720 127040904 122741840
3.044560 122741840 118335416 113824120 109252520 104621616 99975544 95324544 90677920 86077096 81518256
3.045459 81518256 77039944 72636304 68342344 64160056 60091000 56164164 52369016 48730332 45236080
3.046358 45236080 41906848 38736796 35720388 32872290 30178162 27649144 25270570 23050428 20974076
3.047257 20974076 19046790 17258358 15599482 14072230 12663218 11372916 10188810 9110168 8127704
3.048156H127704q94572q08578p32461o58668n93629n31118m75192m25045l77434l35922
3.049155B295085k96814k62863k31116k03220j78652j55924j36407j18476j03143q9152p7069
3.050254D42249o6612n7161m9168m1991l5946l0553k5974k2077j8632j5761j3238j1146r318
3.051553D4672p792o514n407m499l718l079k532k083j713j399j145r31p58o14m97m02l23k60
$$ plain form
3.048156 8127704 7233132 6424554 5692093 5033425 4439796 3908678 3433486 3008441 2631007 2295085
3.049155 2295085 1998271 1735408 1504292 1301072 1122420 966496 830089 711613 608470 519318 442249
3.050254 442249 375637 318476 269308 227317 191371 160818 134844 112767 94135 78374 65136 53990 44672
3.051553 44672 36880 30366 24959 20460 16742 13663 11131 9048 7335 5936 4791 3860 3102 2488 1991 1589 1266 1006
3.053351A006k08j66j33j06q4o7n2m2l3k5k0j6j2j0ponlTkjV%j%Tj%S17
|3.153057@S17J%UJ%JTKULMNPRJ1J5J8K4L0L9M9O3P9R9J25J57J98K46L07L83M75N88P26Q97
3.168341D567J102J355J655K027K465K996L643M399N324O398P707R220J1025J3189J5664J8649
3.169939A11385K2046K6122L0734L6151M2534M9685N8178O7636P8818R1192J05488J22044
3.171138H42013J40186J61403J84497K11389K40459K73467L11031L51204L97478M46598N02932
3.172237D062657N62269O28444P02409P79364Q66683R56746J058498J162496J276298J401088
3.173236A3456952J526744J667208J807114J962858K116154K280452K456834K626974K814436
3.174135C2715726K992454L187808L370000L569156L750948L939296M134564M305452M490596
3.175034F6456000M646408M814696M948680N080808N210584N298936N394224N443912N498096
3.175933A12792344N503280N497448N479496N409304N337984N213888N086832M907888M713696
$$ plain form
3.168341 4567 5669 7024 8679 10706 13171 16167 19810 24209 29533 35931 43638 52858 63883 77072 92736 111385
3.169939 111385 133431 159553 190287 226438 268972 318657 376835 444471 523289 614481 719969 842013
3.171138 842013 982199 1143602 1328099 1539488 1779947 2053414 2364445 2715649 3113127 3559725 4062657
3.172237 4062657 4624926 5253370 5955779 6735143 7601826 8558572 9617070 10779566 12055864 13456952
3.173236 13456952 14983696 16650904 18458018 20420876 22537030 24817482 27274316 29901290 32715726
3.174135 32715726 35708180 38895988 42265988 45835144 49586092 53525388 57659952 61965404 66456000
3.175034 66456000 71102408 75917104 80865784 85946592 91157176 96456112 101850336 107294248 112792344
3.175933 112792344 118295624 123793072 129272568 134681872 140019856 145233744 150320576 155228464 159942160
3.176832A59942160M502880M244224L980272L673152L360688L011120K650832K278432J880432
3.177731A89524192J479056J060928O40784K13408k13408o40784j060928j479056j880432
3.178630A87643760k278432k650832l011120l360688l673152l980272m244224m502880m713696
3.179529A55228464m907888n086832n213888n337984n409304n479496n497448n503280n498096
3.180429A07294248n443912n394224n298936n210584n080808m948680m814696m646408m490596
3.181328F1965404m305452m134564l939296l750948l569156l370000l187808k992454k814436
3.182227B9901290k626974k456834k280452k116154j962858j807114j667208j526744j401088
3.183126A2055864j276298j162496j058498r56746q66683p79364p02409o28444n62269n02932
$$ plain form
3.176832 159942160 164445040 168689264 172669536 176342688 179703376 182714496 185365328 187643760 189524192
3.177731 189524192 191003248 192064176 192704960 192918368 192704960 192064176 191003248 189524192 187643760
3.178630 187643760 185365328 182714496 179703376 176342688 172669536 168689264 164445040 159942160 155228464
3.179529 155228464 150320576 145233744 140019856 134681872 129272568 123793072 118295624 112792344 107294248
3.180429 107294248 101850336 96456112 91157176 85946592 80865784 75917104 71102408 66456000 61965404
3.181328 61965404 57659952 53525388 49586092 45835144 42265988 38895988 35708180 32715726 29901290
3.182227 29901290 27274316 24817482 22537030 20420876 18458018 16650904 14983696 13456952 12055864
3.183126 12055864 10779566 9617070 8558572 7601826 6735143 5955779 5253370 4624926 4062657 3559725
3.184125C559725m46598l97478l51204l11031k73467k40459k11389j84497j61403j40186
3.185124H42013j22044j05488r1192p8818o7636n8178m9685m2534l6151l0734k6122k2046
3.186322A11385j8649j5664j3189j1025r220p707o398n324m399l643k996k465k027j655j355
3.187821E669j102q97p26n88m75l83l07k46j98j57j25r9p9o3m9l9l0k4j8j5j1rpnmlkUjT%j%Uj
3.191517@%Y8J%UJ%JTKJLTMOPRJ2J6K0K7L4M3N6P1R1J17J47J87K37K98L76M71N92P38R23J147
3.202905E642J426J763K179K692L304M066M965O081P394Q988J0930J3196J5972J9194K3123
3.204404A30915K7658L3076L9566M6992N5948O6137P8368R2200J08455J27601J49056J74534
3.205603A130506K02907K36454K73575L16465L66132M20557M84209N53492O34167P21377
$$ plain form
3.184125 3559725 3113127 2715649 2364445 2053414 1779947 1539488 1328099 1143602 982199 842013
3.185124 842013 719969 614481 523289 444471 376835 318657 268972 226438 190287 159553 133431 111385
3.186322 111385 92736 77072 63883 52858 43638 35931 29533 24209 19810 16167 13171 10706 8679 7024 5669
3.187821 5669 4567 3670 2944 2356 1881 1498 1191 945 747 590 465 366 287 224 175 136 106 82 64 49 38 29 22 17 13 10 8 6 4 3 2 2 1 1 1 1 0
3.191517 0 0 0 0 0 0 0 0 0 0 0 0 0 0 0 0 0 0 0 0 0 0 0 0 0 0 0 0 0 0 0 0 0 0 0 0 0 0 0 0 0 0 0 0 0 0 0 0 0 0 0 0 0 0 0 0 0 0 0 0 0 0 0 0 0 0 0 0 0 0 0 0 0 0 0 0 0 0 0 1 1 1 1 2 2 3 4 6 7 10 13 17 23 30 39 51 67 87 114 148 191 247 318 409 526 673 860 1097 1395 1771 2242 2834 3572 4495 5642
3.202905 5642 7068 8831 11010 13702 17006 21072 26037 32118 39512 48500 59430 72626 88598 107792 130915
3.204404 130915 158573 191649 231215 278207 334155 400292 478660 570860 679315 806916 955972 1130506
3.205603 1130506 1333413 1569867 1843442 2159907 2526039 2946596 3430805 3984297 4618464 5339841
3.206602E339841Q20400R33094J053612J192435J339792J508796J686806J885332K107226
3.207501A7867334K338094K600046K870238L175496L487486L828898M203264M580228N001620
3.208400D9952704N421344N888576O348464O841352P370496P880936Q443304Q977360R563424
3.209299A16687960J0109992J0707488J1252816J1817904J2403680J2916368J3471792
3.209998A99368000J3939216J4444096J4846000J5242448J5631760J5896800J6182688
3.210697C05551008J6331712J6494304J6509792J6492384J6438496J6227936J6013920
3.211397D20059552J5641632J5260576J4723584J4141120J3508608J2732672J1940864
3.212096E18008608J1019456J0082016R033344P952512O835328N641280M437184L182720
$$ plain form
3.206602 5339841 6160241 7093335 8146947 9339382 10679174 12187970 13874776 15760108 17867334
3.207501 17867334 20205428 22805474 25675712 28851208 32338694 36167592 40370856 44951084 49952704
3.208400 49952704 55374048 61262624 67611088 74452440 81822936 89703872 98147176 107124536 116687960
3.209299 116687960 126797952 137505440 148758256 160576160 172979840 185896208 199368000
3.209998 199368000 213307216 227751312 242597312 257839760 273471520 289368320 305551008
3.210697 305551008 321882720 338377024 354886816 371379200 387817696 404045632 420059552
3.211397 420059552 435701184 450961760 465685344 479826464 493335072 506067744 518008608
3.212096 518008608 529028064 539110080 548143424 556095936 562931264 568572544 573009728 576192448
3.212895E76192448J922368O40256o40256j922368l182720m437184n641280o835328p952512
3.213794E48143424r033344j0082016j1019456j1940864j2732672j3508608j4141120j4723584
3.214593D50961760j5260576j5641632j6013920j6227936j6438496j6492384j6509792
3.215293C38377024j6494304j6331712j6182688j5896800j5631760j5242448j4846000
3.215992B27751312j4444096j3939216j3471792j2916368j2403680j1817904j1252816
3.216691A37505440j0707488j0109992r563424q977360q443304p880936p370496o841352
3.217490F7611088o348464n888576n421344n001620m580228m203264l828898l487486l175496
3.218390B5675712k870238k600046k338094k107226j885332j686806j508796j339792j192435
$$ plain form
3.212895 576192448 578114816 578755072 578114816 576192448 573009728 568572544 562931264 556095936 548143424
3.213794 548143424 539110080 529028064 518008608 506067744 493335072 479826464 465685344 450961760
3.214593 450961760 435701184 420059552 404045632 387817696 371379200 354886816 338377024
3.215293 338377024 321882720 305551008 289368320 273471520 257839760 242597312 227751312
3.215992 227751312 213307216 199368000 185896208 172979840 160576160 148758256 137505440
3.216691 137505440 126797952 116687960 107124536 98147176 89703872 81822936 74452440 67611088
3.217490 67611088 61262624 55374048 49952704 44951084 40370856 36167592 32338694 28851208 25675712
3.218390 25675712 22805474 20205428 17867334 15760108 13874776 12187970 10679174 9339382 8146947
3.219289H146947j053612r33094q20400p21377o34167n53492m84209m20557l66132l16465
3.220288A843442k73575k36454k02907j74534j49056j27601j08455r2200p8368o6137n5948
3.221386B78207m6992l9566l3076k7658k3123j9194j5972j3196j0930q988p394o081m965m066
3.222785A7006l304k692k179j763j426j147r23p38n92m71l76k98k37j87j47j16r1p2n6m3l4k6
3.224983H8k0j5j2ronlj%JKMNPJ0J3J7K1K7L4M4N6P0Q8J11J39J73K17K70L35M14N12O33P76R55
3.228479D951J167J429J737K112K568L101L753M510N433O499P772R297J1042J3146J5541J8414
3.230078A12472K1665K5484K9982L5024M1011M7678N5560O4283P4360Q6031R8820J13776
3.231276H06146J30055J49012J69504J92771K19252K47570K80190L14815L54525L96354M43001
$$ plain form
3.219289 8146947 7093335 6160241 5339841 4618464 3984297 3430805 2946596 2526039 2159907 1843442
3.220288 1843442 1569867 1333413 1130506 955972 806916 679315 570860 478660 400292 334155 278207
3.221386 278207 231215 191649 158573 130915 107792 88598 72626 59430 48500 39512 32118 26037 21072 17006
3.222785 17006 13702 11010 8831 7068 5642 4495 3572 2834 2242 1771 1395 1097 860 673 526 410 319 247 191 148 114 88
3.224983 88 68 53 41 32 26 21 18 17 17 18 20 24 29 36 46 59 76 97 124 158 202 258 328 416 527 666 839 1056 1326 1661 2075 2587 3220 3996 4951
3.228479 4951 6118 7547 9284 11396 13964 17065 20818 25328 30761 37260 45032 54329 65371 78517 94058 112472
3.230078 112472 134137 159621 189603 224627 265638 313316 368876 433159 507519 593550 692370 806146
3.231276 806146 936201 1085213 1254717 1447488 1666740 1914310 2194500 2509315 2863840 3260194 3703195
3.232375C703195M95141N49389O10939O74428P46155Q19464Q99687R87652J076228J175244
3.233374A1737522J273870J383654J491716J607528J731868J851804J983946K109434K247144
3.234273B7418486K375574K515964K644112K776880K914524L035000L165500L275336L393972
3.235172E3515348L488408L581556L673048L735312L802496L837512L875712L879368L875272
3.236071H7264032L862616L813144L762864L675392L585864L459712L322856L174248K991960
3.236970A18912688K805928K589480K369248K122928J869024J606608J326176J043408P48848
3.237870A35394336M52912J51952j48592m49392p45040j039152j321296j600936j862296
3.238769A28832496k114936k359664k578000k792136k975448l154408l299176l431416l552024
$$ plain form
3.232375 3703195 4198336 4747725 5358664 6033092 6779247 7598711 8498398 9486050 10562278 11737522
3.233374 11737522 13011392 14395046 15886762 17494290 19226158 21077962 23061908 25171342 27418486
3.234273 27418486 29794060 32310024 34954136 37731016 40645540 43680540 46846040 50121376 53515348
3.235172 53515348 57003756 60585312 64258360 67993672 71796168 75633680 79509392 83388760 87264032
3.236071 87264032 91126648 94939792 98702656 102378048 105963912 109423624 112746480 115920728 118912688
3.236970 118912688 121718616 124308096 126677344 128800272 130669296 132275904 133602080 134645488 135394336
3.237870 135394336 135847248 135999200 135850608 135401216 134656176 133617024 132295728 130694792 128832496
3.238769 128832496 126717560 124357896 121779896 118987760 116012312 112857904 109558728 106127312 102575288
3.239668A02575288l635240l715072l756664l795688l796544l786768l766760l710256l653488
3.240567F8958808l562088l471168l347992l218236l081388k916296k752116k562460k373116
3.241466D1673948k161024j943704j719352j476076j229122r65610o95840m11722j22300
3.242365C0949198J91476N04394Q36084J176544J535780J901152K281200K688776L090824
3.243264D5155428L523888L953948M416320M870500N345540N849432O331840O853800P349448
3.244163I3650144P884416Q383648Q922064R414136R919816J0440400J0897072J1387504
3.244962A70899200J1801552J2245344J2600160J2948672J3289760J3523936J3774688
3.245661B61083312J3907888J4051712J4069472J4058400J4015648J3838752J3658464
$$ plain form
3.239668 102575288 98940048 95224976 91468312 87672624 83876080 80089312 76322552 72612296 68958808
3.240567 68958808 65396720 61925552 58577560 55359324 52277936 49361640 46609524 44047064 41673948
3.241466 41673948 39512924 37569220 35849868 34373792 33144670 32179060 31483220 31071498 30949198
3.242365 30949198 31140674 31645068 32481152 33657696 35193476 37094628 39375828 42064604 45155428
3.243264 45155428 48679316 52633264 57049584 61920084 67265624 73115056 79446896 86300696 93650144
3.244163 93650144 101534560 109918208 118840272 128254408 138174224 148614624 159511696 170899200
3.244962 170899200 182700752 194946096 207546256 220494928 233784688 247308624 261083312
3.245661 261083312 274991200 289042912 303112384 317170784 331186432 345025184 358683648
3.246361C58683648J3342720J3019136J2562272J2066208J1527296J0865760J0190560R404544
3.247160D51662144Q604800P709952O787520N834144M814976L787200K716448J640576N46048
3.248059D94103808n46944j641568k717536l788320m816384n835616o789408p712128q607456
3.248958D51648448r407712j0194336j0870368j1532704j2072736j2570080j3028416j3353792
3.249757C58618304j3671616j3854304j4034048j4080096j4094944j4081696j3942928
3.250457B60858672j3815680j3571616j3345328j3012944j2674528j2331376j1900368
3.251156A70206832j1501280j1027120j0589408j0089328r606912r141312q631224q164600
3.251955I1455648p664264p208320o728200o292436n840680n419888n027260m628376m270044
$$ plain form
3.246361 358683648 372026368 385045504 397607776 409673984 421201280 432067040 442257600 451662144
3.247160 451662144 460266944 467976896 474764416 480598560 485413536 489200736 491917184 493557760 494103808
3.248059 494103808 493556864 491915296 489197760 485409440 480593056 474757440 467968032 460255904 451648448
3.248958 451648448 442240736 432046400 421176032 409643328 397570592 385000512 371972096 358618304
3.249757 358618304 344946688 331092384 317058336 302978240 288883296 274801600 260858672
3.250457 260858672 247042992 233471376 220126048 207113104 194438576 182107200 170206832
3.251156 170206832 158705552 147678432 137089024 126999696 117392784 108251472 99620248 91455648
3.251955 91455648 83791384 76583064 69854864 63562428 57721748 52301860 47274600 42646224 38376180
3.252854C8376180l910288l588460l268854k977380k711022k450414k219740j996108j799006
3.253753A3454908j609568j440080j288108j143823j018020q99502p96612p00402o15862
3.254652C942931n41410m72533m13385l59043l12578k70176k33561k01868j73228j49005
3.255651H16144j27254j08937r2591p8715o6905n6463m7764m0119l3779k8238k3613j9740
3.256850I2026j6387j3636j1266r331p674o312n191m240l470k821k299j859j506j218r78p88
3.258448C050o31n05m02l21k55k01j60j26r9p8o0m8l7k8k2j7j2rplk%KNPJ0J3J8K4L0L9N0O4Q2
3.261845C71J04J32J66K11K64L32M18N20O51Q08J006J242J536J898K329K866L500M287N212
3.263743B7853O335P705R302J1259J3531J6299J9497K3316K7891L3125L9439M6621N5243O4994
$$ plain form
3.252854 38376180 34465892 30877432 27608578 24631198 21920176 19469762 17250022 15253914 13454908
3.253753 13454908 11845340 10405260 9117152 7973329 6955309 6055807 5259195 4558793 3942931
3.254652 3942931 3401521 2928988 2515603 2156560 1843982 1573806 1340245 1138377 965149 816144
3.255651 816144 688890 579953 487362 408647 341742 285279 237515 197396 163617 135379 111766 92026
3.256850 92026 75639 62003 50737 41406 33732 27420 22229 17989 14519 11698 9399 7540 6034 4816 3838 3050
3.258448 3050 2419 1914 1512 1191 936 735 575 449 350 272 212 164 127 99 77 60 48 39 32 29 27 27 29 34 41 51 64 82 106 136 175 225 289 371
3.261845 371 475 607 773 984 1248 1580 1998 2518 3169 3977 4983 6225 7761 9659 11988 14854 18354 22641 27853
3.263743 27853 34188 41893 51195 62454 75985 92284 111781 135097 162988 196113 235552 282173 337416 402410
3.265141D02410P6452Q9948J05072J23032J43033J66680J92849K23082K58093K96458L41328
3.266240B418437L90166M47036N08512N78315O57754P42711Q40568R44445J063576J189060
3.267239I780580J329006J485422J648166J832818K023284K238464K458392K699060K962958
3.268138B8458150L228686L525732L821604M150960M475152M822592N195600N555408N951836
3.269037F9185720O328304O741440P126720P547888P932328Q330648Q743576R104992R496512
3.269937A40538128R826000J0181904J0465232J0744656J1019120J1205952J1407456J1512528
3.270736B26900976J1627136J1638080J1625760J1587824J1439328J1288576J1026048
3.271435C07133728J0757440J0379008R968320R522528Q975520Q417376P767872P107104
$$ plain form
3.265141 402410 478862 568810 673882 796914 939947 1106627 1299476 1522558 1780651 2077109 2418437
3.266240 2418437 2808603 3255639 3764151 4342466 5000220 5742931 6583499 7527944 8591520 9780580
3.267239 9780580 11109586 12595008 14243174 16075992 18099276 20337740 22796132 25495192 28458150
3.268138 28458150 31686836 35212568 39034172 43185132 47660284 52482876 57678476 63233884 69185720
3.269037 69185720 75514024 82255464 89382184 96930072 104862400 113193048 121936624 131041616 140538128
3.269937 140538128 150364128 160546032 171011264 181755920 192775040 203980992 215388448 226900976
3.270736 226900976 238528112 250166192 261791952 273379776 284819104 296107680 307133728
3.271435 307133728 317891168 328270176 338238496 347761024 356736544 365153920 372921792 380028896
3.272234C80028896O367872N606016M818496L976832L128128K243904J355520M51808m50656
3.273133D07526816j354400k242624l126688l975232m816608n603744o365248p103904p764032
3.274032C65174336q412768q970016r515904r960448j0369568j0746144j1012704j1272608
3.274832B84914176j1420544j1565488j1599504j1607216j1590832j1470096j1357792
3.275531B04302704j1148208j0951840j0666800j0375184j0077696r706320r358704q947480
3.276330A23070472q563120q125352p698856p282360o826888o402096n947024n522468n075388
3.277229F1626920m659072m222924l809784l411044l004800k622060k236228j873340j502904
3.278128C4284764j154964q15118m80492j57064J58464M61470P68472J053676J339196J610308
$$ plain form
3.272234 380028896 386396768 392002784 396821280 400798112 403926240 406170144 407525664 407977472 407526816
3.273133 407526816 406172416 403929792 400803104 396827872 392011264 386407520 380042272 372938368 365174336
3.274032 365174336 356761568 347791552 338275648 328315200 317945632 307199488 296186784 284914176
3.274832 284914176 273493632 261928144 250328640 238721424 227130592 215660496 204302704
3.275531 204302704 193154496 182202656 171535856 161160672 151082976 141376656 132017952 123070472
3.276330 123070472 114507352 106382000 98683144 91400784 84573896 78171800 72224776 66702308 61626920
3.277229 61626920 56967848 52744924 48935140 45524096 42519296 39897236 37661008 35787668 34284764
3.278128 34284764 33129800 32314682 31834190 31677126 31835590 32297060 33065532 34119208 35458404 37068712
3.279127C7068712J880964K134368K389348K623988K854592L082768L285540L492436L670324
3.280026F2483040L852372M001756M144808M281760M380840M482192M542560M603960M621864
3.280925A01395152M628352M622776M571480M517776M418120M314920M166704M004736L827936
3.281824A40467952L609920L386816L126592K861424K564336K257888J940896J601888J259840
3.282723A63077552R03408N45184J80656j83440n48080r06528j263392j605904j945584
3.283623A58253872k263424k570960k869344l136048l398208l623536l844336m024296m190064
3.284522A28333656m342840m451288m557240m618120m678032m693360m698328m693904m647640
3.285421H6952904m605232m523872m448448m337648m224844m110468l966784l833764l675708
$$ plain form
3.279127 37068712 38949676 41084044 43473392 46097380 48951972 52034740 55320280 58812716 62483040
3.280026 62483040 66335412 70337168 74481976 78763736 83144576 87626768 92169328 96773288 101395152
3.280925 101395152 106023504 110646280 115217760 119735536 124153656 128468576 132635280 136640016 140467952
3.281824 140467952 144077872 147464688 150591280 153452704 156017040 158274928 160215824 161817712 163077552
3.282723 163077552 163980960 164526144 164706800 164523360 163975280 163068752 161805360 160199456 158253872
3.283623 158253872 155990448 153419488 150550144 147414096 144015888 140392352 136548016 132523720 128333656
3.284522 128333656 123990816 119539528 114982288 110364168 105686136 100992776 96294448 91600544 86952904
3.285421 86952904 82347672 77823800 73375352 69037704 64812860 60702392 56735608 52901844 49226136
3.286320D9226136l529804l363104l202300l047108k877074k721534k554752k402774k242734
3.287219B3284952k097476j946894j806630j675754j542790j423348j303430j196154j089616
3.288118I202860r92461r03674q16804p39914o65369n99669n36523m80026m29369l81275
3.289117B657776l39340k99834k65537k33467k05288j80470j57511j37795j19681j04192r0059
3.290216E24602p7854o7289n7743m9668m2418l6312l0864k6238k2302j8821j5921j3373j1260
3.291514E4539r413p871o580n462m545l756l110k558k104j730j414j156r41p66o20n02m06l26
3.293313A279k62k11j68j34j07q5o7n3m2l3k6k0j6j2rpnmkT%JKMNPRJ2J5K0K6L4M3N5O9Q9J13
3.297009E18J42J80K26K83L56M45N55O90Q59J061J311J620J989K446K989L659M450N409O577
$$ plain form
3.286320 49226136 45696332 42333228 39130928 36083820 33206746 30485212 27930460 25527686 23284952
3.287219 23284952 21187476 19240582 17433952 15758198 14215408 12792060 11488630 10292476 9202860
3.288118 9202860 8210399 7306725 6489921 5750007 5084638 4484969 3948446 3468420 3039051 2657776
3.289117 2657776 2318436 2018602 1753065 1519598 1314310 1133840 976329 838534 718853 614661 524602
3.290216 524602 446748 379459 321716 272048 229630 193318 162454 136216 113914 95093 79172 65799 54539
3.291514 54539 45126 37255 30675 25213 20668 16912 13802 11244 9140 7410 5996 4840 3899 3133 2513 2011 1605 1279
3.293313 1279 1017 806 638 504 397 312 245 192 150 117 91 71 55 43 34 27 22 18 16 14 14 15 17 21 26 33 42 54 69 89 115 149 192 247 316 405 518
3.297009 518 660 840 1066 1349 1705 2150 2705 3395 4254 5315 6626 8246 10235 12681 15670 19329 23779 29188 35765
3.298907C5765P942R612J1552J3915J6645J9906K3811K8280L3670L9802M7163N5487O5269
3.300205D08819P6792Q9704J05036J22112J42300J64641J90452K20342K53096K91403L33097
3.301304B397794L81649M34133M93725N61547O34076P17620Q06302R08010J015137J134615
3.302303I484608J268152J407092J564736J727342J911048K098808K304272K529572K756434
3.303202B7052064L010030L262624L543810L820576M117204M435648M742832N081272N402676
3.304101F4468736N755376O084312O443872O772088P112144P464664P773208Q107480Q388768
3.305001A28370648Q692616Q934496R173072R407376R566864R738928R828608R926448R935776
3.305900B13574832R925296R892864R766160R637360R413312R183968Q860832Q510272Q129664
$$ plain form
3.298907 35765 43707 53319 64871 78786 95431 115337 139148 167428 201098 240900 288063 343550 408819
3.300205 408819 485611 575315 680351 802463 944763 1109404 1299856 1520198 1773294 2064697 2397794
3.301304 2397794 2779443 3213576 3707301 4268848 4902924 5620544 6426846 7334856 8349993 9484608
3.302303 9484608 10752760 12159852 13724588 15451930 17362978 19461786 21766058 24295630 27052064
3.303202 27052064 30062094 33324718 36868528 40689104 44806308 49241956 53984788 59066060 64468736
3.304101 64468736 70224112 76308424 82752296 89524384 96636528 104101192 111874400 119981880 128370648
3.305001 128370648 137063264 145997760 155170832 164578208 174145072 183884000 193712608 203639056 213574832
3.305900 213574832 223500128 233392992 243159152 252796512 262209824 271393792 280254624 288764896 296894560
3.306799B96894560P662656P186112O631616O067520N436352M785920M113568L394976K670336
3.307698C44843616J915424J156896L85312l85312j156896j915424k670336l394976m113568
3.308597C34664736m785920n436352o067520o631616p186112p662656q129664q510272q860832
3.309496B71393792r183968r413312r637360r766160r892864r925296r935776r926448r828608
3.310395A83884000r738928r566864r407376r173072q934496q692616q388768q107480p773208
3.311294A04101192p464664p112144o772088o443872o084312n755376n402676n081272m742832
3.312193D9241956m435648m117204l820576l543810l262624l010030k756434k529572k304272
3.313092A9461786k098808j911048j727342j564736j407092j268152j134615j015137r08010
$$ plain form
3.306799 296894560 304557216 311743328 318374944 324442464 329878816 334664736 338778304 342173280 344843616
3.307698 344843616 346759040 347915936 348301248 347915936 346759040 344843616 342173280 338778304 334664736
3.308597 334664736 329878816 324442464 318374944 311743328 304557216 296894560 288764896 280254624 271393792
3.309496 271393792 262209824 252796512 243159152 233392992 223500128 213574832 203639056 193712608 183884000
3.310395 183884000 174145072 164578208 155170832 145997760 137063264 128370648 119981880 111874400 104101192
3.311294 104101192 96636528 89524384 82752296 76308424 70224112 64468736 59066060 53984788 49241956
3.312193 49241956 44806308 40689104 36868528 33324718 30062094 27052064 24295630 21766058 19461786
3.313092 19461786 17362978 15451930 13724588 12159852 10752760 9484608 8349993 7334856 6426846
3.313991F426846q06302p17620o34076n61547m93725m34133l81649l33097k91403k53096
3.314990A520198k20342j90452j64641j42300j22112j05036q9704p6792o5269n5487m7163
3.316089B40900l9802l3670k8280k3811j9906j6645j3915j1552r612p942o577n409m450l659
3.317488A5670k989k446j989j620j311j061q59o90n55m45l56k83k26j80j42j13q9p0n4m3l4k6
$$ plain form
3.313991 6426846 5620544 4902924 4268848 3707301 3213576 2779443 2397794 2064697 1773294 1520198
3.314990 1520198 1299856 1109404 944763 802463 680351 575315 485611 408819 343550 288063 240900
3.316089 240900 201098 167428 139148 115337 95431 78786 64871 53319 43707 35765 29188 23779 19329 15670
3.317488 15670 12681 10235 8246 6626 5315 4254 3395 2705 2150 1705 1349 1066 840 660 518 405 316 246 192 149 115 89
3.319685H9k1j5j3rpomTkUj%jT%Uj%Z2J%UJT%KJKTLNTPQJ2J4J8K3L0L8M7O0P5R5J18J49J85K30
3.332772A132K86L54M37N40O63Q15R96J220J483J803K193K647L204L851M638N548O636P937
3.334570D6383R426J1224J3267J5721J8496K1756K5597K9902L5012M0704M7433N4880O3484
3.335869D33285P3448Q4365R7134J11033J27216J44711J64575J87182K11359K39207K68767
3.336968B142282L02670L38379L78205M22718M69030N21579N75780O37016O99603P68092
3.337967G255354Q43190R18812J003342J087542J181270J273526J372400J478550J580944
3.338866A7994930J693758J800890J918460K028102K147958K257362K370714K488226K591068
3.339765C7291468K702492K796260K897536K978168L057688L135788L188960L246308L276200
3.340664F4570868L308820L311928L308424L297624L255384L212456L137776L061320K953616
$$ plain form
3.332772 1132 1418 1772 2209 2749 3412 4227 5223 6443 7926 9729 11922 14569 17773 21624 26262 31810 38446 46383
3.334570 46383 55809 67033 80300 96021 114517 136273 161870 191772 226784 267488 314921 369801 433285
3.335869 433285 506733 591098 688232 799265 926481 1071192 1235767 1422949 1634308 1873515 2142282
3.336968 2142282 2444952 2783331 3161536 3584254 4053284 4574863 5150643 5787659 6487262 7255354
3.337967 7255354 8098544 9017356 10020698 11108240 12289510 13563036 14935436 16413986 17994930
3.338866 17994930 19688688 21489578 23408038 25436140 27584098 29841460 32212174 34700400 37291468
3.339765 37291468 39993960 42790220 45687756 48665924 51723612 54859400 58048360 61294668 64570868
3.340664 64570868 67879688 71191616 74500040 77797664 81053048 84265504 87403280 90464600 93418216
3.341563I3418216K836752K709880K554224K395384K210536K022496J812128J595296J371184
3.342462A12926096J131664Q90112O38480L85640J28416j28416l85640o38480q90112j131664
3.343461A12926096j371184j595296j812128k022496k210536k395384k554224k709880k836752
3.344360I3418216k953616l061320l137776l212456l255384l297624l308424l311928l308820
3.345259F4570868l276200l246308l188960l135788l057688k978168k897536k796260k702492
3.346158C7291468k591068k488226k370714k257362k147958k028102j918460j800890j693758
3.347057A7994930j580944j478550j372400j273526j181270j087542j003342r18812q43190
3.347956G255354p68092o99603o37016n75780n21579m69030m22718l78205l38379l02670
$$ plain form
3.341563 93418216 96254968 98964848 101519072 103914456 106124992 108147488 109959616 111554912 112926096
3.342462 112926096 114057760 114947872 115586352 115971992 116100408 115971992 115586352 114947872 114057760 112926096
3.343461 112926096 111554912 109959616 108147488 106124992 103914456 101519072 98964848 96254968 93418216
3.344360 93418216 90464600 87403280 84265504 81053048 77797664 74500040 71191616 67879688 64570868
3.345259 64570868 61294668 58048360 54859400 51723612 48665924 45687756 42790220 39993960 37291468
3.346158 37291468 34700400 32212174 29841460 27584098 25436140 23408038 21489578 19688688 17994930
3.347057 17994930 16413986 14935436 13563036 12289510 11108240 10020698 9017356 8098544 7255354
3.347956 7255354 6487262 5787659 5150643 4574863 4053284 3584254 3161536 2783331 2444952 2142282
3.348955B142282k68767k39207k11359j87182j64575j44711j27216j11033r7134q4365p3448
3.350054D33285o3484n4880m7433m0704l5012k9902k5597k1756j8496j5721j3267j1224r426
3.351353D6383p937o636n548m638l851l204k647k193j803j483j220r96q15o63n40m37l54k86
$$ plain form
3.348955 2142282 1873515 1634308 1422949 1235767 1071192 926481 799265 688232 591098 506733 433285
3.350054 433285 369801 314921 267488 226784 191772 161870 136273 114517 96021 80300 67033 55809 46383
3.351353 46383 38446 31810 26262 21624 17773 14569 11922 9729 7926 6443 5223 4227 3412 2749 2209 1772 1418 1132
3.353151A132k30j85j49j18r5p5o0m7l8l0k3j8j4j2qpnTlkTjk%jT%Uj%S18
|15.000000@
##END=
##TITLE=iChemLabsInternalChloroethane.jdx
##JCAMP-CS=3.7 $$ChemDoodle v4.0.0
##ORIGIN=null
##OWNER=UNKNOWN
##MOLFORM=C2 H5 Cl
##ATOMLIST=
1 C 2
2 Cl 0
3 C 3
##BONDLIST=
1 2 S
1 3 S
##DATE=11/02/10
##TIME=11:20:17
##MAX_RASTER=792
##XY_RASTER_FACTOR=10000
##XY_RASTER=
1 2410000 4140000 0 
2 2583205 4040000 0 
3 2236795 4040000 0 
##END=
