##TITLE= Isobutanol, 1PDNA pulse sequence (Decoupled, no NOE)
##JCAMP-DX= 5.00 $$From Command Line Converter 1.0
##DATA TYPE= NMR Spectrum
##DATA CLASS=  XYDATA

##ORIGIN= Exported from Command Line Converter 1.0
##OWNER= SVB
##$URL= http://wwwchem.uwimona.edu.jm:1104/software/jcampdx.html
##SPECTROMETER/DATA SYSTEM= NUTS EXPORT
##.OBSERVE FREQUENCY= 75.480980
##.OBSERVE NUCLEUS= ^1H
##INSTRUMENTAL PARAMETERS= 1H
##XUNITS= PPM
##YUNITS= ARBITRARY UNITS
##XFACTOR= 0.0001007274
##YFACTOR= 248.6226580000
##FIRSTX=  -0.064900
##FIRSTY= -286688.000000
##LASTX= 100.662500
##NPOINTS= 6229
##MAXY= 247436608.000000
##MINY= -1186050.000000
##DELTAX=   0.016173
##XYDATA= (X++(Y..Y))
-645 -1154 -88 634 1557 829 -757 -684 3 -221 -494 -1078 -710 -133 -351 -53 -1591 -2387 -1441 -1100
2245 -1100 6 -1073 -1623 2 783 -1731 -1634 -20 -1820 -1006 -1269 -388 -1212 152 598 -966 -1444
4975 -1444 23 382 145 -1063 101 -304 -897 -325 -695 -1453 -125 482 -852 -1643 -780 354 -747
7705 -747 -1011 973 1436 697 -83 -513 846 407 -54 -1440 -23 750 -293 -442 -1077 -1137 -1206 771
10595 771 -658 -146 670 645 437 161 -108 -556 -1604 -1745 544 -1497 -1387 -468 -585 -862 415 -230
13485 -230 -705 -1619 -954 -229 -2677 -1862 788 -167 150 755 -105 67 72 -1738 -1837 -432 -577 -1201 -1492
16535 -1492 -727 185 -1281 -1292 -787 -1494 -1898 611 1294 68 583 1902 613 -570 -596 -24 -1651
19265 -1651 -290 1042 94 -678 -816 -196 -162 1889 -179 -642 -1984 -542 -468 -835 318 -2535 -1559
21995 -1559 -862 -811 -1489 338 -70 -417 -1050 -172 -599 -988 -1380 -1266 -1442 -1109 -892 -867 35 601 847
25046 847 -854 -833 -1024 -784 -48 -1144 757 -152 -1576 -831 -747 -1258 -764 -1008 -1835 -1194 -73 -712
27936 -712 -904 73 841 670 -652 -745 -1096 -2145 -950 -862 -653 -963 446 786 531 45 364 -674
30826 -674 -2452 -2055 -1534 392 200 -495 -98 1086 294 692 418 -185 -14 -1687 -325 -45 -1062
33555 -1062 -817 -371 -353 842 -1061 164 578 -110 -1352 -1665 -2278 -1710 -1883 -1757 -3182 -1705 -879
36286 -879 -213 739 -1196 992 -521 -168 -255 109 393 592 -731 -538 271 -539 -1622 -793 -433 418
39176 418 -701 -466 836 514 57 -3079 -1560 902 1206 1132 226 -1915 -1893 -1274 499 -663 -2674
41905 -2674 -1203 -673 -2012 -1163 -900 -1264 305 1273 -540 -688 -869 -462 95 -853 -801 13 -154 -1978
44795 -1978 -1486 -632 -152 -1096 -30 -444 -952 1623 486 2010 561 502 411 -824 -671 -2029 -560
47525 -560 545 -421 1233 1083 132 375 -126 -949 490 -1851 -171 -256 -2086 -986 232 252 -693
50254 -693 -136 -881 -799 93 535 100 446 -1497 -1623 -1070 -531 -1501 45 42 -548 -1700 -1205 -1013 -125
53305 -125 -617 -299 603 637 -733 267 -2054 -1219 -76 -88 3 352 -381 -100 -1675 -969 149 171 1199
56356 1199 981 -283 -248 424 131 -2235 -981 -751 -1473 -94 -699 -56 -901 -29 -830 -924 -1203 -1041
59246 -1041 -464 -1579 -2073 -2356 -1016 -1395 -1467 189 307 -34 373 -1314 -691 -711 -1340 -1266 -1688 -713 604
62296 604 686 57 -789 -1199 16 638 -1060 -2851 -1935 336 516 -73 603 143 749 -748 -522 -940
65186 -940 -572 33 -655 -1858 -393 487 292 -734 560 -93 -102 -796 -137 850 1609 -25 147 79 -25
68238 -25 -1105 -1206 -587 -832 -1072 -863 -1015 -1998 -2255 -5 -349 -1199 -304 203 1038 1045 -183 615 843
71288 843 -667 372 -312 978 -66 390 329 543 201 1381 -656 -427 -949 956 29 411 232
74018 232 1482 -437 666 -2302 -2338 -487 -428 -545 -2243 -1637 -1768 -316 38 928 -1684 -1026 -283
76747 -283 286 405 -306 1972 -397 -1626 293 495 267 -834 77 -306 -387 -333 -855 -1247 -190 -1042
79637 -1042 -325 438 -1347 8 651 1061 -862 -320 -172 -587 -589 -1670 -408 782 -498 -688 -1731
82368 -1731 1090 -164 -523 620 -1859 -2243 201 1715 1078 833 -445 -2491 -418 763 47 1143
84936 1143 -140 189 -125 362 -40 -249 -1488 -417 -2277 -1980 -473 -1261 -1450 390 418 -681 -331
87666 -331 -600 -736 -390 -424 -1923 -1274 -1611 703 1507 3038 757 -629 -1503 -862 -2845 334 -1166
90396 -1166 -747 408 40 -913 -907 -350 -333 397 555 1374 518 -1593 -2015 -2461 -1114 -1168 -1574 -1468 169
93446 169 319 532 299 1312 -240 397 -148 -1055 -730 -2179 1548 585 496 -361 253 -610 -833 -335
96336 -335 -706 -1223 -899 -56 627 237 299 158 178 -1178 1433 120 529 1 919 -1193 -1342 -1553 -1931
99387 -1931 -1230 -1098 -414 -826 -1376 -1756 -278 1269 1263 25 249 -182 -1161 -1208 -1084 -595 -471 -406 569
102438 569 1543 -165 291 -726 -41 -197 -445 -755 -304 729 599 496 71 61 -190 -222 -129 -793 -86
105489 -86 193 -75 -694 -1094 1308 490 -913 -692 -1050 -712 -231 260 860 985 -240 232 1928 -1266
108378 -1266 -1022 -422 -1450 -517 -1139 -1225 -1039 -2682 349 1840 -982 139 948 4 -993 1835 606
111108 606 1675 859 898 -929 -1192 326 -638 -674 -126 -1661 -404 -255 -1286 -148 558 -1393 -1131
113838 -1131 -1196 91 -1288 -273 -489 -1222 -435 -646 -1972 -593 -372 48 -145 -1339 -1901 321 -774
116568 -774 -894 -1502 -788 -687 184 98 -1955 -1685 952 1087 530 2451 297 -1329 -1111 -228 -1198 -1217
119458 -1217 -1109 -667 140 -255 -720 1405 133 -996 217 142 922 766 1380 -164 540 -2 88 -86
122348 -86 -1020 -174 1413 -1034 894 -1334 332 -260 -1761 -994 63 842 1877 574 -194 802 1017
125077 1017 1029 -738 879 1023 1474 1324 -67 -19 1178 266 -1641 -993 -892 -594 -353 926 -526
127807 -526 -591 -951 146 -490 218 685 790 1699 785 1952 736 108 439 -1582 -645 909 2818 9243
130698 9243 2887 2555 -376 -946 131 22 855 1089 615 -678 -1326 -640 -663 2173 -439 -564 -801
133427 -801 -1207 -2448 -1780 -508 -1695 -404 -725 -1247 -849 167 -1357 -1853 -1921 -504 -150 -1316 -514
136157 -514 406 -104 1375 1636 1510 114 874 1047 610 -103 51 134 -1542 62 133 1849 1323 -1428
139047 -1428 -2952 -2414 -701 -672 -1972 -930 -1189 -2314 -2054 -1473 -1364 -209 386 -72 63 -742 -198
141776 -198 -191 488 185 1314 647 295 -297 290 -288 -1212 -382 -101 -819 730 -669 2 244 -2388 -2814
144827 -2814 -656 -2145 -961 -118 223 -457 31 -342 153 437 -195 105 -3 785 1255 169 1220
147556 1220 -215 -780 879 677 876 979 544 -1035 -69 68 -609 -937 -663 216 -342 401 -725 122
150447 122 38 1081 575 1206 1197 762 1119 79 -751 -1124 -2432 -2342 -1438 -1657 -448 -1960 -321 580 -2177
153498 -2177 -2256 -158 -964 -908 -779 -1584 -472 -1528 657 -720 -975 -391 1256 1659 895 -1165 -230
156227 -230 155 -1304 -666 -1066 476 39 832 1085 86 982 1222 1196 2524 548 -149 765 1389 1502
159117 1502 1093 1685 2558 1033 -259 784 919 44 -119 -1264 -1162 -1109 -209 -302 373 849 730 -830
162007 -830 -2227 -341 1892 364 -766 676 -159 282 -728 1784 2058 1090 680 1481 879 76 2012
164738 2012 1118 -230 789 308 1286 653 -1493 150 -499 1962 314 -593 -225 664 45 1402 1033
167467 1033 1501 -795 -759 -291 737 744 -823 -139 899 1256 -512 -155 -57 -787 -1202 638 1614 944
170357 944 853 328 226 178 -1169 910 -1761 -113 609 1632 398 715 608 -300 853 219 -410 2271
173247 2271 1444 2123 -397 1211 1125 2409 1658 143 160 1836 301 1466 1681 1501 713 1037 1837
175977 1837 798 744 140 120 885 -953 1254 313 2314 2116 2983 3297 2094 1432 1000 2928 2273 1447
178867 1447 550 2002 1798 1665 2244 857 1376 2751 3462 2738 4007 3078 2552 2927 2293 3741 4323
181597 4323 3943 5464 3118 1643 4636 5837 3988 3812 5382 4834 6236 5421 6083 4063 4968 7316
184166 7316 6955 9191 11913 9496 8755 7921 8517 10061 12929 14124 15771 19042 24468 32764 48092
186574 48092 88380 247755 995229 304188 165319 93238 49987 35611 27154 18813 13180
188341 13180 10171 11912 2680 -408 -584 651 -2989 -3936 -4716 -2555 -3134 -3467 -2582 -2434 -3078 -3320
190909 -3320 -2733 -2490 -2623 -2581 -3859 -2643 -3213 -3233 -1923 -2430 -3323 -2442 -4771 -2951 -2438 -1401 189
193639 189 -499 -1952 -1482 -883 -1994 -2243 -2868 -2296 -1176 -695 -2077 -902 -3826 -4191 -2488 -2719 -2319
196369 -2319 -1893 -419 -2110 -2101 -2152 -1948 -2856 -2711 -2795 -1302 -830 -3286 -2924 -1756 -851 -2136 -2250 -2171 -1541
199419 -1541 -462 -357 -1715 -2416 -3279 -1476 -2007 -584 -1255 -746 -1677 -2122 -624 -782 -2204 -1206 -2197
202149 -2197 -800 -1016 -1202 -787 -1053 -702 -1458 -834 -847 -1462 936 108 721 -459 -2041 -2605 -1051 -31
205039 -31 -1718 -652 -1493 -1901 -2116 -2325 -2084 -2104 -745 -643 -798 -344 -916 -1170 -791 -2602 -2425 -1821 -685
208090 -685 -934 -511 -2238 -1500 -1326 -738 -22 -313 -1710 -823 589 -573 312 -1149 -1021 -1267 -1091 12
210980 12 -1355 -669 -592 -672 -501 -1925 -632 -787 -1235 -2330 -829 81 -1485 -1811 -688 -21 -186 -401
213870 -401 -464 55 -686 353 -251 -947 -2480 -910 -1012 -46 -1293 -366 -185 -333 -1949 -1693 -1245 -1795
216760 -1795 -2127 -1889 -1949 -757 -1589 217 -799 -2234 -362 -1420 -1371 -140 -1114 -1642 -1783 -1346 -1760
219490 -1760 -2864 -2317 -2003 -1706 -143 -221 -130 -992 -643 222 1429 582 -755 -2852 -3230 -2613 -1174 -343
222381 -343 -484 -598 -953 -931 -465 -680 -816 -167 508 -306 -1144 -1640 -1471 -972 -889 366 819 1715 -329
225431 -329 -1580 -1186 -1661 -3465 -1634 -197 -298 -61 587 -87 -1276 -1054 181 -1018 -1699 -1025 -1401
228161 -1401 -1257 -966 -948 -1718 -913 507 -1440 233 162 175 896 135 1331 469 -14 -14 -1241 -966 -646
231211 -646 -133 -2255 -754 -1417 -2691 -2494 -2833 -2396 -1447 -372 256 -2199 34 251 974 228 -54
233941 -54 -92 874 547 27 -65 289 -896 335 -1722 -554 -900 -803 -1874 -2356 -1035 -572 -387 -1603
236831 -1603 -285 1766 -158 -584 -3 -1812 -1578 -793 165 577 44 -367 -1933 -280 -339 388 -806
239561 -806 -473 -695 -106 -1069 -554 -151 103 -18 -130 -230 -1347 -704 -2043 -1258 -1052 -76 328 -337 -334
242612 -334 -20 -82 48 520 -850 -2335 -1550 -445 -1813 1630 1675 -231 -1170 734 -512 153 -236
245341 -236 634 489 -2230 -478 798 571 -52 -730 228 1191 715 -629 563 909 -1864 -300 584
248070 584 -600 393 808 51 -1531 -570 -361 154 -1521 -413 174 223 -25 -47 -1779 -393 -219 -925
250960 -925 -922 -215 -1403 -1577 66 1044 628 1352 1195 -20 -899 -353 -310 -567 -178 -278 -240 557 -1037
254012 -1037 -1903 28 -723 -1774 -566 675 255 -24 -437 -579 -240 -733 -823 -760 -1272 81 2 -884
256902 -884 1055 173 -843 -24 1199 343 -625 265 -386 424 136 -381 174 -542 -564 1157 -625 -1339
259792 -1339 -642 613 -924 -522 1427 905 249 -401 -1844 -920 -579 -420 -532 -1866 -1895 -2841 -1544
262521 -1544 -675 -835 -338 -286 -86 1107 932 1523 -942 -821 -256 -936 378 1977 -288 -1557 -1257
265251 -1257 -1093 -307 -1356 246 766 1391 292 -559 -1023 825 -455 -397 -1381 -1060 -2177 -1490 -1499 -2184
268141 -2184 -459 -1282 -1202 -1021 -856 -632 -1814 -775 -941 -82 328 1025 -1710 -2088 -536 118 -1524
270870 -1524 -717 -869 -1384 -824 -1465 -17 406 669 -752 -2217 -1701 -519 -1470 -1919 -659 113 1277
273601 1277 1728 147 -516 -403 712 -228 206 -213 -983 45 -486 457 602 918 2354 314 -1100
276330 -1100 -1270 -774 -480 -563 -530 -945 -1530 -3122 -2243 -2153 -1893 -2398 -1565 -954 -51 435 -45 -404 235 -203
279541 -203 -1187 -921 -601 -184 -943 -1765 -1285 -566 -1432 -1781 -770 1470 1150 722 317 -2151 440 -1772
282431 -1772 -568 -1193 -1227 -1889 -1318 300 164 -39 407 1054 1456 1251 -43 -368 1145 -2683 219
285161 219 -838 -1863 -516 -413 -222 145 -1656 -2608 -855 774 1412 836 -1340 -944 -46 163 162 -657
288052 -657 -913 -1826 -1406 -505 1096 -1194 -760 -264 566 38 -806 -737 682 -645 666 344 178 1114
290942 1114 922 -251 499 377 -150 798 71 -251 -623 1501 1826 339 -832 1364 1055 -553 -829
293671 -829 -1568 -950 -1256 356 294 -548 415 -364 884 -50 -276 -662 -4 1415 788 -305 1146 706
296561 706 -904 186 1730 1144 -477 -605 1319 561 1099 2154 1929 1903 828 1293 1454 2175 561
299291 561 -312 1408 961 876 2349 1087 128 2570 1321 3228 1030 1957 2418 3178 3262 5393 7433
302021 7433 3769 2844 2869 3904 4426 3068 3834 4265 6449 7317 11157 18795 40750 145157 489852
304429 489852 141908 79037 47388 26461 20990 16146 9657 6420 4957 3515 1710 347 1953
306516 1953 6894 333 -259 -769 -27 -1228 -713 -241 -1083 238 -335 -1714 -968 -889 -1895 19 -519
309246 -519 -1524 -2690 -1542 -1119 -1581 -1454 -999 -1876 -2105 -519 -1161 -791 -976 -463 -987 -2089 -721
311976 -721 -876 -1830 -1507 -1130 -825 -1128 -1092 -2158 524 -22 -305 -581 -1669 -2144 -1061 -2086 160 798
314866 798 -645 -1999 -190 621 2134 1365 613 -1401 -1141 -1742 -505 666 -839 -2034 -535 -864
317435 -864 -763 -220 -106 -772 -1700 -1906 -1151 -2234 -1489 -1414 -45 -1071 -1699 99 -1005 -1997 -990 -8
320325 -8 415 280 -602 -912 -329 339 -431 195 25 630 -2009 -1025 -1326 -791 -914 -315 -901 -633 -514 -339
323536 -339 -1544 -1234 135 -487 -850 -980 -60 -1842 -1963 206 735 2118 -600 -672 1336 602 952
326266 952 561 22 -1004 90 587 874 -261 -1479 -1006 -905 -916 1927 -2081 -814 -1072 -1803 -2519
328996 -2519 -2455 -845 107 -1067 359 234 658 -47 -191 -989 -88 694 -405 -551 -212 1041 910 344
331886 344 -706 -222 -860 -1612 -1903 -1858 622 493 260 -1322 -1220 -23 484 1098 446 89 -375 463
334776 463 173 -160 -422 -204 960 -389 -2507 -562 -2107 1111 1102 -1781 -482 -191 380 -1798 -1388
337505 -1388 -1006 -1305 -381 -209 -104 322 -337 -1152 -1057 -376 -1763 -767 -430 -983 1026 -1656 -259 206
340395 206 -782 -193 -1615 83 -2112 -1163 378 -907 -623 1375 582 -53 -266 -824 -866 -594 330 -1590
343285 -1590 -728 -953 533 1278 1541 -249 -202 -1671 590 -862 1077 -741 690 -469 -735 -524
345855 -524 463 -1043 -688 552 146 -686 -1742 -388 -200 -747 1315 1630 -2541 -1368 -409 -2294 -1913
348585 -1913 -515 -1078 -1244 -1408 -1543 -2555 -1631 -1140 -1112 273 -1443 -677 797 -379 -59 433 1432
351314 1432 2252 -552 21 -18 -322 -1257 -2616 -3227 -1859 -1233 -244 146 586 128 -798 -871 -341 -478 -2106
354365 -2106 -1913 -1104 217 129 -21 83 -852 -837 -1565 -817 -1285 -804 -728 -255 102 -161 -505 1209 1810
357415 1810 -1133 -401 -428 802 -439 -1537 -1289 -848 20 806 191 110 -1581 -743 -102 286 -2104 -1138
360306 -1138 -1300 -2053 -831 -73 354 564 -404 -117 -510 -998 -397 -1527 -629 -946 -21 599 13 454
363196 454 -1762 -2440 -2120 1130 -423 1769 38 -1277 -701 -349 -1960 -2192 -851 736 -241 -1007
365765 -1007 -1669 -939 -708 153 -143 -416 1093 -603 -1899 -933 -762 -681 -185 329 -324 -1369 -2241 -2069
368655 -2069 -606 -1521 -454 -118 -1203 -3087 -2405 -839 994 -465 -1944 -738 -1318 -1523 -736 -1276
371224 -1276 -1179 -615 -692 -1767 -929 -863 -563 -58 -302 -142 -200 3 323 1109 -873 -842 -561 373 75 694
374436 694 -285 -401 -780 -1738 -1143 -1217 -1027 -994 -1436 -974 -82 1396 -134 -1138 -282 -67 457 589 176
377486 176 -1163 -2170 -786 -673 261 -616 -127 -880 -1185 -356 -1692 155 -1765 -1858 -1916 -166 904
380216 904 798 601 -840 -385 362 -842 -1506 -1615 -784 -1005 -1315 -1215 -1200 -1228 -1965 -2724 -1456 -567 -745
383266 -745 -1183 -607 -1058 -1446 -295 -518 900 -452 -477 -631 -2225 -108 -442 286 -678 -70 95 -1668
386156 -1668 -213 -593 -273 -332 -701 740 -1562 -1472 -278 -935 67 -993 705 634 -2448 -730 1854
388887 1854 812 361 -564 -1784 -689 -987 -575 1035 -214 -335 654 -368 -287 -681 164 -468 -448 -1163
391777 -1163 -1500 -258 800 913 -344 -1249 -561 -952 316 48 117 929 208 -1442 195 -1492 -1184
394506 -1184 -352 -595 866 -688 -399 -773 -530 1291 1025 -648 -793 -721 -641 -419 -719 -900 -1113 87
397396 87 -576 -413 -1002 -30 -522 -1914 -2557 -1009 -627 -558 -496 -550 -858 -43 -379 -543 -769 82 71 -443
400607 -443 124 -1446 1035 -747 -36 -688 -1651 -1144 -871 -1327 -1885 846 -519 -774 72 -1500 -762
403337 -762 -1599 1075 -922 -545 -912 -858 -946 600 -1612 -1188 -1819 127 -644 -924 111 -1335 -1930 -595
406228 -595 -592 8 -88 -22 -1568 -721 -785 -631 -43 -647 -12 243 176 179 -382 -750 -1588 -20 375 687 110
409599 110 -11 -1238 -1027 -468 250 355 -269 -2029 -1862 -1272 618 -403 679 1443 -365 1109 1024
412329 1024 1475 1762 1277 281 988 109 389 -793 -2088 -874 486 -612 73 -2105 -1723 -2736 -1662
415058 -1662 -856 -149 -281 -696 856 -28 -2193 -724 -846 -85 -432 -504 -273 -691 -2426 -720 -338 41
417948 41 51 712 -984 -923 664 1800 -830 -647 -14 -2017 -1930 194 -292 -1164 1555 -890 -1301 -2092
420839 -2092 -2376 -396 809 -808 316 -331 -1782 -848 -58 544 -90 -186 -211 -1330 -265 -670 -862
423569 -862 1250 -1200 -1867 -441 -1570 -1329 -871 -745 -1471 -839 -306 -1530 1781 1126 1158 -1213 -196
426298 -196 -857 -523 -42 1766 245 -129 -1234 1525 -122 -500 -75 832 867 775 -573 -2264 -1545 -845
429188 -845 -1500 213 -667 -1132 -1080 -583 -638 -1093 -742 -1096 -733 395 -1948 -1274 407 97 -143 -192 -53
432238 -53 -662 1103 1006 -1203 -3300 -525 -1774 -1407 -3062 -686 -382 1359 -486 -271 -1061 -916 362
434969 362 -584 -518 42 502 722 -768 -552 -97 158 -230 -397 -1241 -393 1318 -128 -856 -254 -846 -1871
438019 -1871 13 -383 -442 875 138 1376 710 1692 914 1007 -1070 246 217 1164 333 468 171 -2077
440909 -2077 -1789 -473 665 715 166 -1653 -735 -2190 -1088 -575 1046 -255 355 -1003 -1451 -129
443479 -129 -559 -1239 -2111 -1603 -35 -751 -85 -243 -610 -841 -1870 -1568 -2240 -1898 480 487 1059 923 218
446529 218 -374 884 -617 197 -702 1339 763 -1708 -278 1 470 -2084 -1846 -936 755 446 -15
449259 -15 -76 -663 301 -1331 -1407 -1358 -1455 -1219 -1582 -458 -33 687 -436 -172 710 271 -2088 -1343 -952 156
452470 156 546 297 745 167 176 1234 -786 -1023 -1178 672 4 242 -1178 321 1284 923 -61 934
455360 934 288 -247 619 626 -1438 -468 139 785 -732 -807 -2184 -1173 13 371 160 7 -90 -778 -1161
458411 -1161 -885 -1409 333 615 439 -255 -185 -1152 -347 94 -137 -522 -334 -459 690 267 -876 11
461301 11 -903 -799 -1093 -69 -10 -604 911 989 -387 -255 -953 -1982 -1612 -679 -387 -59 -35 -1538 -1369
464352 -1369 1729 627 -582 -439 210 -1376 -1270 -769 112 207 264 62 1112 -288 -834 -270 -1639
467082 -1639 -188 -1168 -841 -63 -1255 537 -295 919 1631 280 -849 -2245 -693 649 -236 -699
469651 -699 -989 -682 209 32 1249 5 -2509 -499 182 -261 348 -45 675 -960 -303 -1584 -1715
472380 -1715 -2148 -1854 -1079 215 -746 -523 220 418 -1600 -529 -427 -1701 -2070 -1955 180 1146 751
475110 751 -564 -826 -35 307 -1306 -954 -655 1048 -231 -402 -508 1762 697 -188 -198 -906 238
477839 238 317 1560 502 -638 -453 325 -135 -395 231 168 71 -352 -937 -764 -1029 -1443 949 450 -543
480890 -543 427 -1154 -1255 -1071 -472 -817 -811 -1630 -1190 -1317 -45 -291 -1564 -1037 -481 -1464 -1197 1439 -352
483941 -352 940 -1164 -2174 -2389 -1831 -511 -762 355 274 27 -799 -199 164 880 583 978 -446 -362
486831 -362 739 -6 -756 -1280 -1743 -1137 -843 -514 -446 -1420 -682 -2078 -135 -764 -365 -977 -607 1000
489721 1000 519 718 -296 -1068 -394 191 739 1073 2248 934 518 125 -1041 -1848 -1198 112 -175
492451 -175 123 -56 876 807 -265 393 -571 -249 -235 358 267 -611 -2083 -918 -2402 -1617 -535 -551 -1091
495501 -1091 568 -10 997 42 -336 -1125 -905 198 -536 1270 -139 770 564 -587 -1185 -1113 -1638
498232 -1638 -1920 -1559 -2363 -1399 1468 1289 304 -426 465 -442 -1036 -1000 -2507 -2578 -1094 -457 -302 460 -1380
501282 -1380 -1283 -83 -1445 -1382 247 -92 -1658 -1157 -147 -1472 138 -749 -584 -1109 1144 475 -303
504012 -303 431 595 -414 -585 -672 -716 -998 436 -980 404 1033 559 -352 210 -257 1160 512 -353
506902 -353 -159 37 -419 -1666 -855 -2224 -77 -768 424 -1308 -921 341 -359 -907 -333 -1254 -499
509631 -499 -1252 -381 1567 419 647 221 491 -892 -1126 -1763 258 479 -432 -2207 -146 567 -114
512361 -114 -756 -1541 -2623 -2380 620 -1864 -1925 -520 -914 -860 -100 -793 -562 -1012 664 -914 -1101 -497
515251 -497 -599 -56 -1099 -280 736 -143 -86 -1315 -455 -1957 -758 -1147 -2631 -1713 -1295 -1104 -1215 -1187
518141 -1187 -1040 -115 -771 -866 -1173 -585 -745 -455 -254 1791 1886 44 -163 -1144 -460 -1578 -2660 -3857
521031 -3857 -1423 -56 -246 -161 -693 -535 -143 525 -611 -1245 -2531 -1153 479 -1083 -939 -117 954
523761 954 858 -631 -680 208 -921 -1295 -770 -831 1094 -1572 -2067 -586 -1278 -835 -363 -246 764 1367
526652 1367 651 597 -1354 -1247 -546 -32 757 33 -181 -861 -959 -1648 359 -683 -1716 -1650 -131 1372
529542 1372 31 995 1730 -1089 939 1039 543 -1270 -152 -1030 -92 -1225 -658 55 -535 535 -1273
532271 -1273 -1754 1077 -262 474 452 -704 -591 225 180 -45 -1488 -54 -271 -270 -700 -110 -1052 -1159 -1547
535322 -1547 -2874 -588 -761 -216 -1217 -1177 -925 -705 -494 -279 -1013 -742 -434 2624 578 594 -2034 514
538212 514 -1277 -1077 -1527 -1044 -285 -1256 77 -1755 -1381 -768 -2709 -2804 -587 -2075 1593 1278 247
540942 247 -449 104 584 1050 1395 455 -561 -1521 -2376 -1433 -720 -1273 1332 -450 -811 -1699 456 -568
543832 -568 -1001 -297 -1141 -340 1082 1321 26 -238 -1476 -517 -369 -1277 1070 198 913 -818 -456 876
546722 876 68 1674 1639 -202 701 119 -192 -134 894 -79 1450 667 596 -78 -831 -1477 -1615 -1008 -307
549773 -307 -812 -1059 -1367 -1960 -1121 -2131 -2607 102 -237 -156 -253 77 -1114 99 -805 -617 -1015 -123 -130
552823 -130 -50 96 -95 -666 -610 -312 752 -125 717 -943 -592 -963 -1654 -2651 -1652 -3433 -2079 -1051
555714 -1051 817 -422 -105 -276 -1049 -491 528 55 1177 -254 -1669 1424 1321 281 -876 -318
558283 -318 -901 -561 -1023 596 -1310 -1283 -3293 -1650 -1859 -1931 -1272 -1491 -601 -1472 -2097 -551 452 -163
561173 -163 48 218 -85 610 439 915 522 -444 -288 776 -2050 -1509 -686 -745 933 234 1614 985
564063 985 1886 2020 288 -541 1384 2038 593 1006 -1332 -1198 804 -891 926 -613 -1816 -1588
566632 -1588 -153 -738 -1342 -714 449 -113 -154 -1605 -186 -905 -1247 -653 -316 905 1158 548 -542
569361 -542 -489 -334 71 1014 403 -1189 -651 -276 30 1201 397 -1131 -362 -290 386 -1226 -471 -212 -195
572412 -195 749 294 -1709 366 1103 420 -552 100 -629 409 1831 493 -117 723 -1588 -877 2060
575142 2060 222 -255 -590 -1809 -2239 -1240 -1297 -1399 -1413 518 -160 -1288 -1221 -1365 -5 -525 -1822 -3110
578032 -3110 -293 -951 -1459 -1713 213 -783 -344 -304 -441 930 -211 1391 1547 222 -2198 -361 64
580762 64 -820 -832 -978 -1189 -533 -1459 -1811 -76 -1368 -811 -721 -2423 -1537 155 617 -174 -2852 -511
583652 -511 254 -1639 -1435 -2464 -1177 -683 -1151 -970 -779 -716 -1083 227 878 1078 -612 -122 837 1995
586542 1995 -839 508 -294 -738 -1525 -1711 -443 181 -985 -2576 84 -390 -1196 -789 708 -222 -1296
589271 -1296 -1483 -393 -1592 -2120 -643 -1757 -1236 -784 32 -1563 -1614 -1046 7 535 379 70 -1727
592002 -1727 272 -976 -776 -1532 204 -770 -1807 -1395 -1939 -2278 -2355 -805 -971 -638 -276 -440 -827 830
594892 830 270 -953 -885 -675 -1500 -2071 -1170 -1196 -909 -18 -59 -47 -634 -1319 -2318 -233 -429 -1656 -271
597942 -271 -583 -364 -1187 -1507 -1301 -1902 -83 377 -1334 -2732 -1952 -490 -195 -312 349 332 808 739 451
600993 451 408 1410 1828 964 -664 476 -1084 -1348 -751 -2125 -382 -2004 1209 83 -140 -481 -198
603722 -198 -1540 -964 16 -2059 -1014 -780 391 706 170 -1076 -59 -94 -402 -204 -660 -2033 -2160
606452 -2160 -1733 -2295 -2140 -2084 314 36 -305 -1320 -329 936 -805 568 -1169 -156 -106 608 804
609181 804 -429 -936 114 -472 -660 77 -1575 122 418 -677 -503 -370 -701 -824 -2324 -763 -633
611912 -633 -899 -1263 -187 -68 39 -292 44 -1222 -1638 -375 -1999 -982 -778 667 117 -839 -699
614641 -699 -2685 -219 325 1415 149 -336 -713 1014 580 -42 -203 179 -451 54 -740 -1103 -273 -71
617531 -71 -110 847 -232 -1448 -1635 -864 843 -1185 -329 105 -913 153 -946 -1601 -598 -961 -704
620261 -704 -1246 -297 -756 -1057 -425 -884 -488 -1289 -811 -899 -43 -1112 -988 -461 -565 -1060 -99 -1272 -1500
623311 -1500 -1493 -290 253 -262 -150 -927 -452 -355 674 998 -1010 -316 -119 -542 -225 -445 17 387 -610
626363 -610 -161 630 -678 405 107 -451 -1456 -31 -460 437 -432 -124 387 395 -1054 -1140 1246 -1268
629253 -1268 -1123 824 1053 270 953 286 -977 -1607 -480 1841 -145 -457 740 2171 1454 -986
631821 -986 -984 -1486 -554 -445 -716 -1416 82 -697 76 -288 699 -18 365 95 -213 195 2887 915 326
634872 326 -555 554 -1533 -830 28 -1186 384 -22 -76 -701 156 427 242 346 216 -1487 -1666 -2165
637762 -2165 -791 -1529 -692 -462 -1073 -2193 -278 493 252 487 -411 -1426 -164 1059 560 1070 581
640492 581 -1665 -1428 -643 -1796 -1323 -1034 -144 165 188 -337 61 -921 -962 -552 -1093 -1147 -574 292 1 -475
643703 -475 -1563 -1624 -75 463 -196 -126 -474 -94 -1128 567 769 -481 -274 -1134 -1380 -396 -265 -435
646593 -435 363 -620 -1224 340 134 2090 449 366 -2317 -1173 -754 -1343 926 -1017 -41 -1916 -2027
649323 -2027 -987 266 -807 238 30 -2199 -2092 -369 -213 -564 453 -772 -693 -1073 -1146 -1491 -1212
652052 -1212 -1667 -1693 -1138 663 1061 506 27 701 -119 -468 543 -1950 -301 -594 -686 -240 -515 -741
654943 -741 -1605 -992 -1388 -619 -153 133 -1086 -2122 -249 -674 -402 -324 -857 -1306 -1591 -1042 -1320 -1387 -1079
657994 -1079 -338 400 506 644 559 -1473 -66 -291 -719 -438 -2290 -1391 -1740 -81 -267 -1746 -1733 -858
660884 -858 -1126 -2071 -956 671 1379 380 -905 -2224 -115 1695 249 -502 -1514 -769 -1062 -1172 -1063
663613 -1063 -649 -1186 -1561 -2678 -1948 -1364 -1325 -404 -1532 139 -651 -235 -1117 -428 -24 -2083 -709 -848
666503 -848 308 -516 -467 -2126 -2072 -84 88 -2213 556 -1141 -679 -430 -647 -929 667 -78 -1028 285
669394 285 -1511 -1361 -909 -832 -1781 -1321 -2490 -7 -214 936 688 912 1212 -682 -1689 183 -460
672124 -460 -404 -118 501 -698 250 677 954 -832 601 -296 -1425 -32 -838 -588 -42 -1429 875
674853 875 259 -397 236 938 1071 -801 99 -744 1899 937 443 1245 821 -914 -378 443 713 -1153
677743 -1153 -946 -717 -863 -271 -791 566 -7 847 -2325 -816 -1860 -564 -700 773 533 -1139 -1555
680473 -1555 -453 55 -611 1494 1160 1889 1256 69 -1465 -789 -1479 -1472 -650 -544 -668 -174 -1419 -861
683363 -861 -294 -137 133 -356 354 713 1998 1891 1287 628 1624 4709 3503 1997 882 435 1268 2075
686253 2075 2383 2462 1604 935 2818 7315 13481 34044 139406 535415 170123 98198 60951
688341 60951 36967 26900 22366 16498 11471 8585 4866 3516 4611 2956 3723 5621 3445 1597
690588 1597 1904 1272 1172 514 1660 1786 859 421 1504 1869 1184 -1183 -1326 -207 -354 -200 -261 823
693479 823 15 -348 1062 -305 -1188 -189 -28 -961 -527 -425 -1255 -471 272 -1995 1089 -323 -265 -795
696369 -795 -896 -603 217 -625 1491 674 511 -561 -702 -2460 -1462 -991 1012 518 792 -646 -358 -130
699259 -130 -105 -725 463 -489 113 -131 -238 -905 103 -141 -809 -889 -126 -1166 -1053 -20 445 838 -397
702309 -397 -1259 47 -347 2004 979 -2119 -838 -290 -206 -657 818 -213 -614 -1543 -2386 -831 -1590
705039 -1590 -1565 -804 1374 776 69 -839 -846 -1142 957 -990 -926 -488 -53 -180 826 1829 961 1615 -905
708090 -905 -1701 -1979 -1798 -830 -1395 -1330 -1162 982 243 1586 -168 -81 -3 -1628 -52 -499 42 -150 -666
711141 -666 304 -535 -42 -671 -733 -1285 185 598 754 -417 490 1866 2205 656 -146 -21 -362 -1137
714031 -1137 -533 -378 -975 448 -268 300 -12 1307 1126 870 466 1647 414 -73 -938 -932 -1829 -2261
716921 -2261 -995 -1070 135 1128 315 836 -601 -308 -1274 517 -266 398 -1094 -2065 -76 -291 -1363
719650 -1363 -1749 -236 570 1290 663 1260 326 769 128 -1125 -907 400 -955 -353 -566 803 -606
722380 -606 -728 -566 416 -82 -319 1058 1187 806 -1553 -1583 -666 -687 496 -555 -540 -1260 -1224 -627 774
725431 774 -1540 -514 -146 1509 604 -614 -1965 -501 -1024 -244 -623 -860 917 698 232 853 674
728161 674 497 -1444 -321 -201 459 865 542 1121 688 -492 -180 304 1446 1 -1193 -542 -1348
730890 -1348 -1288 -953 -530 490 348 31 -18 -44 -964 -553 -399 782 556 -397 -571 332 1324 579 -373
733941 -373 471 1311 1607 1003 523 -303 -920 -212 -630 -434 -1792 -1829 -1126 -924 -1407 -1026 187 -1421 878
736991 878 -1382 -13 -91 505 455 1451 -145 245 -545 283 -1115 15 1094 487 918 903 -266 -1305
739882 -1305 266 -314 -80 618 -539 316 253 408 -870 495 2214 1803 1091 734 471 -2466 -1290
742612 -1290 -424 -862 258 -430 -505 -1728 -744 -836 1584 1575 1110 2317 1545 -140 -701 -221 415 602 -1952
745662 -1952 1199 948 1628 1193 1354 853 -433 -1545 -1135 -1869 -564 -1383 -182 -1017 -780 418 218
748391 218 115 -943 -1648 -671 337 -2025 -1053 -1256 133 1056 941 590 1542 502 1001 -45 -850
751122 -850 666 295 -115 522 368 476 -1228 486 233 -500 447 1164 -1498 -876 71 63 1048 90 -407
754172 -407 -1387 -412 -326 118 489 364 -76 784 1854 380 1496 -223 -332 785 1175 192 1207 615
757062 615 820 1438 -111 3105 1789 2550 2068 2555 1436 2211 2521 2829 2334 4636 3402 4259 3802
759792 3802 4914 6373 8196 16117 26394 46895 111025 301446 324060 172867 108677 69817
761719 69817 49471 38830 31703 24996 20267 15606 13029 10236 8539 8207 7639 7841 6354 5594 6106
764127 6106 8201 11320 15745 22669 39097 85039 238249 374352 200229 122120 79468 54196
766053 54196 40233 32289 26070 21104 17382 13703 11859 11178 9372 9193 7164 7673 7963 6641 8393
768463 8393 11735 13261 20045 35513 69615 179822 376501 240537 138009 88282 56284
770228 56284 41083 32762 27170 20323 16980 12804 9249 8255 6927 5238 3651 1785 1732 2239 3339
772637 3339 2195 1366 1994 1166 1469 1619 1258 153 1707 2034 2102 211 2677 1940 1334 387 -841
775366 -841 321 -304 1985 1141 578 681 2301 964 643 -377 -49 -628 -371 -1254 421 -732 -576
778097 -576 -1350 -461 -306 830 78 -1053 -242 908 -267 447 -899 -247 -1130 744 289 332 -512 312
780987 312 639 760 490 -44 1439 -87 -186 -1358 -894 -42 847 643 58 -568 406 13 -1051 -489
783877 -489 -1237 -2714 -1370 -694 -1236 655 511 131 -2132 -1165 34 -266 -1064 211 1830 1824 746
786606 746 1283 71 397 -426 1523 -138 661 532 -868 731 635 16 -1106 -342 -420 -386 -3 1618
789496 1618 -945 -520 -1338 -1348 -317 987 -982 -714 -1487 360 1087 -343 -987 -2193 -816 -850 -670
792226 -670 -678 -635 -823 -1880 -773 -1674 -336 402 204 691 367 468 -373 -370 -601 882 157 1207 -539
795277 -539 -2710 -3471 -2475 -1061 -290 -466 -958 -283 -521 -215 1157 529 1082 680 -1190 538 1360 -40
798167 -40 -629 1579 -183 501 565 -915 -1398 327 620 1003 -224 -788 274 410 958 -1043 -852 452
801057 452 409 148 -388 1238 58 250 -2312 -837 864 -979 1206 -207 -700 -1116 -2035 575 -173
803787 -173 -367 -1280 -2197 -144 -715 -1928 -731 -1762 -1109 -28 233 377 -1084 -2203 124 -845 -1834
806516 -1834 -894 42 -267 95 -116 1355 388 -339 -500 459 -93 -990 -945 -241 1686 719 1044 847 1050
809567 1050 108 945 754 409 -952 87 -1363 -1523 -1191 -1393 248 -1134 -817 -18 -685 397 1161
812297 1161 -1533 -340 10 -1260 -719 54 -187 -458 -1548 662 -157 -97 1175 571 1057 94 -118
815027 -118 -1078 -759 490 513 284 -586 214 575 1380 1472 -1355 -1028 -528 -158 592 -104 -467 -58 -990
818077 -990 1315 666 837 1331 1066 332 -445 -16 -1308 -565 1046 -852 -723 2 -224 580 1198 -358
820967 -358 -2343 -1513 -835 -636 -521 -806 210 -1612 -1033 -1660 -487 799 1253 174 -124 265 519
823696 519 1061 -669 -923 -141 -792 542 -68 -423 -998 682 173 -1400 -491 -503 240 105 361 -671
826587 -671 -1332 -776 -287 -280 -313 -765 -1385 -1678 -296 -1052 487 794 1436 141 273 -1729 264 -475 -47
829638 -47 623 608 -346 -757 294 -328 -475 -889 -115 61 -692 -1855 -1322 -1409 -601 722 104 -306 -524
832689 -524 -654 -48 -1202 -1770 27 367 726 455 -1051 -296 -266 1203 928 1300 -27 -1035 -183 -713
835578 -713 -786 -1075 -1464 -750 785 1788 2097 -123 -83 -1371 609 638 -413 -2003 414 -1080 -392
838308 -392 -1534 899 -1089 -1316 -1541 -1938 296 -565 -1709 22 -787 791 505 551 359 -1667 -1660 -2230
841199 -2230 -852 -517 -294 -127 -1324 -64 -419 -81 -92 1704 2172 43 795 786 -667 -571 -1152 -873
844089 -873 90 -712 -2401 -819 -1240 -1267 -86 -2027 -184 818 -2585 -1785 -2012 -2089 -370 -1280 -1028
846818 -1028 558 320 -1538 -1183 -629 -881 87 -926 -1223 -1740 -2347 -794 926 1500 -158 836 607
849548 607 -130 110 -892 -219 607 -399 -1876 140 -32 946 183 -1591 -1702 -1431 -526 -778 -596 428
852438 428 -122 -689 941 -140 -413 -809 410 276 -1263 -654 -743 -785 1481 2190 1293 132 87 1011
855329 1011 472 -96 -1344 -96 410 480 543 -848 -1973 188 -232 -378 -3500 -1892 -1246 -1143 394
858058 394 -130 713 812 1418 -154 438 74 835 671 183 1094 -177 -554 -335 -262 -1918 -54 -785 -1250
861109 -1250 -1573 -381 -1278 -2089 -1133 194 -318 -1895 -2557 -1377 -961 -2719 -1028 -1744 -801 -117 -122 1518
863999 1518 668 655 1918 -464 -594 -674 -375 -366 -285 -1223 -461 -443 -1324 -1445 -896 -2326 -2002 -605 337 -88
867210 -88 392 426 688 155 152 -558 -197 -1559 -131 -496 -281 -31 -296 -473 -1001 -451 -797 267 94 766
870421 766 333 627 738 -1194 -716 138 -81 1617 1478 931 -164 28 668 461 1004 1142 472 -105
873311 -105 1194 1886 1366 631 -1256 1302 1489 873 465 1012 515 816 744 634 -447 -646 -76 213
876201 213 -691 121 1315 -189 -1503 -1373 -383 -438 755 -1457 542 923 -1016 471 1126 232 266
878931 266 -1597 -160 -254 -408 271 -52 360 13 -1430 -522 -309 39 996 -140 170 436 -638 -483
881821 -483 253 146 -608 881 599 569 1680 -296 -1313 -999 -842 -38 -1491 -1034 -174 -409 498 422
884712 422 135 -298 -1653 -1938 -1607 -382 1459 27 -218 292 747 873 70 205 -1376 -1107 -1376 303
887602 303 -340 555 180 52 -1614 717 86 -369 76 -475 -1011 -598 295 126 22 562 1087 -649
890492 -649 -72 340 -570 -666 1258 1144 1246 859 -408 -756 -492 10 -959 -704 -229 295 -140 2146 1108
893543 1108 898 13 956 -167 958 575 -1008 -1285 -1686 -714 -676 -776 -979 -1054 -414 -744 790 1073
896433 1073 -230 115 92 -160 -1102 253 -1857 671 877 664 -1346 -433 -978 -1970 -3289 -2873 -2609
899163 -2609 -2216 -1340 -640 -1669 -2571 -1427 -1648 -297 -200 -111 2013 -134 601 1193 635 -996 881
901892 881 1500 1056 623 -1414 -444 -122 -354 -807 -1572 -508 26 332 22 1462 121 1915 644
904622 644 612 741 -687 -1692 -1119 -1065 -1032 -1165 -363 -1863 -2808 -1484 878 -285 547 -196 1713 601
907512 601 -282 -1456 -787 -1923 -607 -1082 -288 -584 967 -913 -678 -944 -1770 -22 -196 434 -560
910241 -560 -1009 -1120 629 -1143 -2143 -215 364 957 1476 -126 -438 -2363 258 -1089 1030 -205
912810 -205 -187 -209 81 28 -1381 -713 211 731 -936 -1023 335 -8 -42 6 -966 -1734 -1212 -929 -229 20
916022 20 -1357 -1226 -1107 47 -589 -1935 -13 1162 918 -150 -1211 -81 -306 -807 -830 -99 831
918752 831 629 -1067 -654 -254 -422 -579 -1693 -2484 -1031 -430 -665 -245 1359 560 733 -336 88 459
921642 459 317 -996 -623 -998 -1088 -847 213 -393 -853 -175 291 237 949 894 -154 -1167 -1611 -1829 -1058
924692 -1058 170 951 1972 693 -426 -310 -917 -1017 -789 -1727 -2156 -1001 -1770 -1829 341 -68 414
927421 414 -1198 -1550 -591 851 -805 -1405 75 -672 -980 -965 -879 -436 624 676 504 -254 -866 -813 -1197
930473 -1197 712 1155 -620 -1454 -683 -986 -884 34 -1515 -1273 -347 -848 582 945 401 922 160 298
933363 298 154 988 806 168 -330 -143 -1060 -391 -1257 523 -764 -15 -1042 -679 -733 -839 -1125 -2190
936253 -2190 509 511 151 -801 -281 -1193 -849 -510 -795 202 -416 -855 711 1412 -545 114 -127 -299 -308
939304 -308 614 -935 804 -389 -679 -514 188 448 1071 -861 -1323 -1024 -428 1506 769 323 938 -317
942194 -317 345 -899 -2368 -209 797 -355 -982 1117 30 1742 593 243 -1124 36 -558 -367
944763 -367 -974 -1573 703 472 1093 -272 -884 719 1295 -291 -86 -1215 -1314 -549 797 1800 604
947493 604 1992 1870 -101 -310 -49 33 -997 1756 58 -1178 458 -288 45 1375 1097 240 -304
950223 -304 -573 700 1828 420 -833 -56 -99 -37 -442 978 1218 1399 316 -1237 -1051 -489 354 865
953113 865 1353 1179 -729 -1490 -1271 -149 -800 1100 1293 1895 2249 1041 581 118 631 413 1760 566
956003 566 -640 -1380 -1838 -1063 548 -199 1069 561 -1244 -603 -451 -60 -257 -622 192 -633 -270 -809
958893 -809 -745 -1431 -670 1826 1358 2085 1546 -463 -344 -188 -355 566 1938 398 -1061 -21 201 -516
961782 -516 -1621 -1458 -1722 -1446 -8 203 245 -555 -1531 -1431 261 499 -208 180 688 -195 -384 -1961
964673 -1961 -615 -686 -1242 374 -428 -7 -1102 -522 -839 1280 -846 -1788 -267 873 -341 -383 616
967403 616 237 1178 -593 -197 378 -448 -1260 -1222 -302 -1122 -1271 169 616 597 -406 -303 1037 1227 898
970453 898 -1487 -2081 -386 -1022 465 242 -1199 -50 67 -401 129 871 668 -572 -342 794 -560
973183 -560 124 1418 -368 -1281 -79 1156 615 -297 65 -595 -1205 -812 -842 -503 -114 353 1181 932
976073 932 948 -1396 -571 1491 987 1143 1280 1710 -1136 -892 200 1026 716 -75 -360 669 -1514 695
978964 695 586 290 480 579 -52 -856 -345 412 1199 283 -1473 -535 132 -100 -492 -1481 -769 -1397 -1768
982014 -1768 155 318 172 -1502 -1826 -1668 -489 297 477 198 -1519 290 876 1317 588 -442 1719
984744 1719 -428 -2357 -603 -50 458 -151 -1078 -472 -1683 149 -571 -165 -1737 57 763 1698 278
987473 278 -246 -127 -864 -354 -188 395 206 -1510 -223 -265 -1602 1143 1205 928 -201 -1458 -239 -157
990363 -157 -1246 -329 -2319 -740 766 57 -198 -868 -319 209 1477 665 -359 -234 -715 -406 1360
993094 1360 1834 -351 -394 1392 -92 -839 -290 -181 365 -384 1509 835 275 -1629 -219 -124 -1006 -965
995984 -965 -340 -784 455 1169 -560 -268 1098 -916 1 1324 21 544 -10 589 373 -455 788
998713 788 333 -964 -981 -84
##END=
