##TITLE= Isobutanol, 1PDFA pulse sequence (Coupled with NOE)
##JCAMP-DX= 5.00 $$From Command Line Converter 1.0
##DATA TYPE= NMR Spectrum
##DATA CLASS=  XYDATA

##ORIGIN= Exported from Command Line Converter 1.0
##OWNER= MS
##$URL= http://wwwchem.uwimona.edu.jm:1104/software/jcampdx.html
##SPECTROMETER/DATA SYSTEM= NUTS EXPORT
##.OBSERVE FREQUENCY= 75.480980
##.OBSERVE NUCLEUS= ^1H
##INSTRUMENTAL PARAMETERS= 1H
##XUNITS= PPM
##YUNITS= ARBITRARY UNITS
##XFACTOR= 0.0001003847
##YFACTOR= 30.2205580000
##FIRSTX=   0.274200
##FIRSTY= -23984.000000
##LASTX= 100.658900
##NPOINTS= 12415
##MAXY= 29828722.000000
##MINY= -391836.000000
##DELTAX=   0.008086
##XYDATA= (X++(Y..Y))
2731g94j627M77K353j595j535k396j163K653N90K242J987q46k121j345j849
3939d969R47N54r34j163o06l725L967M439L061l330j661L881J155R33O85J789
5228E023l435p08j462p78n29J251K394n63l60o92J53l25j43N70j244k002k413
6597e263j567L189Ln10m81M054J481l042Q62j36M73l03j802j009j169K402K010
7967h08l05j806l54K446K06j043o06J458J963J390k599O94K539J95k528j661
9255h19K141p71k849j797O63Q15L737r56o68l30K566m56n9J83Q90o19j745p41
10706h15J553j60K21J070K491J435j857j966K21K04r5o409j144K832q87j009
11995d315j25j72R35J761L942j140M23M09j412r40M3P24r70j03r72K81K468j492
$$ y = [-794, -2421, -1944, 409, -1186, -2721, -5117, -6280, -3627, -3037, -795, 1192, 346, -1775, -3120, -4969, -4022, -3468, -4402, -5565, -6171, -9896, -5929, -1490, 1571, -1759, -3420, 461, 1616, 2549, 3234, 5023, 1588, 880, -582, -1360, -1889, -638, 1756, 1193, 833, 141, 294, -31, -174, 396, -848, -2850, -5263, -6830, -3641, -3638, -4148, -4629, -575, 906, -2136, -1274, -1410, -937, -1240, -3042, -4051, -5220, -2818, -808, -1113, -2919, -3273, -827, -621, -1664, -2270, -812, 1151, 2541, -58, 636, 3175, 3370, 842, -819, 1322, 551, -2298, -4095, -3432, -2617, 1120, 164, -504, -834, 1732, 1276, 1217, 1400, 2290, 1671, -74, -815, 738, 578, 799, 1869, 4360, 5795, 3938, 1972, 2193, 2397, 2302, -4107, -5251, -2419, -3306, -4315, -4440, -4612, -3677, -1916, 2026, 886, 1309, 1718, 306, -634, -591, 133, -837, -940, -1912, -1631, 837, -655]
13444f55m68q33P02J7r05j926j914M71J804K561m88m7O47q4j118J54q40K235
14895f87J367k648j069N386k16k426J145J727J085k240q87M57K567N57j964P23
16183B877J06j190R77j1q22k616J228r00j162L19L99P98p93J465K646j09N55
17553C767k139N62j93l610l156M72Q20J11J40K27l7J541K10k920j199J041M38
18922c925K849M42Ll295J00K401r30L072j569L75k107J857K418k451k644J473
20211a931M396P60m225j698j582K847R76J677J7j631j401k024L46K114N15r04
21500a748J326Q12k585M29L835j001j997l62j86R24K331J358l53J488p87J93
22789C677j753j272K56k124p68N98J595J331r07p33k96J621j378j208p70j35
$$ y = [-655, -1123, -1956, -1254, -1237, -2142, -4068, -5982, -5511, -3707, -1146, -1634, -1681, -1034, -1118, -2236, -2082, -2922, -687, 680, -1968, -3037, 2349, 2133, -293, 852, 2579, 3664, 1424, 537, 994, 3561, 4118, 2154, 2877, 2983, 1793, 2770, 2759, 1937, -679, 549, -351, -1513, -1194, -795, 3, -790, 675, 3321, 3212, 3767, 1628, 2190, 1997, -1613, -4769, -4297, -3477, -3366, -3226, -2999, -3036, -1495, -1285, -4205, -5404, -4363, -3925, -1076, -634, -631, -3926, -3826, -1425, -2355, 717, -852, -477, -2584, -727, 1691, -760, -3404, -1931, 2465, 3225, -1000, -2698, -4280, -1433, -457, 1220, 1237, -394, -1795, -3819, -3473, -1359, -844, -1748, -422, 390, -2195, -1766, 2069, 1068, -929, -1291, -1477, -553, 1778, 3136, 2783, 4271, 3484, 3677, 1924, 652, 908, -1216, -1984, -1386, 209, 1540, 633, -100, -396, 1225, -153, -1361, -2131, -2266]
24078b266J878m69k641K641k231P60K403j755n97Q52j498q54M464K815n769j609
25367c876M674m79j413R30J182J426k524l760J573J061j893N66q24q62R62N96
26655b661J527J257j789j2O16K141o03P40r68M39J212J647q58K58j553J13L2
28025A538r9J063J0j540p94m36k556l972K136P75J127L428k8O14J454Q11o61
29394B870j207k573j509K026J746j915m47J44K203ml761J90K051Q4l218k983
30684f303M263M653m30P94j514L78l377J285l9j386K2k109J08M42o94p4q74J13
32133d742Q95J353P36L531Q44J562k418p37l99j85l126J188R5J532k81k79L409
33503B978K496k886k246j437J003J102j473o54k102K599O69k572l579l20M280
$$ y = [-2266, -388, -857, -3498, -857, -3088, -2328, 75, -1680, -2277, -1425, -2923, -3777, 687, 3502, -2267, -3876, 798, 319, -1094, -164, 1018, 2444, -80, -3840, -2267, -1206, -3099, -2533, -3357, -4219, -3257, -2661, -1134, 123, -1666, -1678, -1062, 1079, 476, 1216, 248, 687, 1899, 3546, 2688, 2946, 1393, 1506, 1538, 1439, 2502, 2512, 972, 178, -258, -2814, -6786, -4650, -3875, -2748, 680, 652, 1266, 2720, 3531, 2870, 1663, -910, -2419, -393, 1353, -562, -1009, -865, 1338, 1334, -2427, -2237, -186, -102, -3320, -6303, -2040, 2613, 2183, 2977, 1463, 1841, -1536, -251, -290, -1676, -1654, -3763, -3655, -3213, -3907, -3981, -4855, -4742, -3847, -2494, -1758, 1773, 2617, 4179, 1761, 1024, 625, 440, -2686, -1498, -1403, 129, -152, -431, 2978, 5474, 2588, 342, -1095, -92, 1010, -463, -1117, -3219, -620, 49, -2523, -6102, -6422, -2142]
34711b142o08j615Q77J49L980L012l97m89k601j165k59Q41J194l091P04Q36n65
36081a339k48J064j500M134J479j457k745m055J007M017J55n6j04k311q80k212
37369e051O64M130n61r50J046k480j994K471J520j717n6k934m65K163P56n28
38658c986j322J797J326j439j964j787Q82L183N88Nk139o03J481j469j684L560
39947c571J036j276O3n87K257K306l221K71P38M15n3P52J216R49K402l63k584
41317G50k492J102M58J130J508k257j555O24Q96k85J716j786k118M19J834j435
42605a491j078p23Q68R94J852k749M7K309j0J189l847L62L421K160l195J98j399
43975a092k598l05N6J809K067Q75j199k088j557M63O78J739O70k298J227J124
$$ y = [-2142, -2750, -4365, -3488, -3339, 641, 3653, 3256, 2767, 166, -999, -1258, -417, 777, -2314, -1610, -774, -1339, -1587, -523, -2023, 2111, 3590, 2133, -612, -4667, -3660, 357, 512, 456, 352, -1959, -2839, -5051, -4387, -257, -818, -1768, -722, -3202, -5196, -2725, -1205, -2922, -2978, -5912, -6377, -4214, -3458, -3986, -5308, -3511, -2185, -3624, -5588, -7375, -6493, -3310, -2722, -2717, -4856, -5459, -3978, -5447, -7131, -3571, -2535, -3811, -3748, -4335, -2078, 228, -2993, -2722, -1984, -1569, -1622, -870, 346, 1295, 3697, 3334, 750, -1742, -640, -182, 948, 2456, 199, -1356, -732, 164, -121, 1595, -191, -2309, -1890, -56, -1491, -2569, -3292, -2424, -1430, 422, -2327, -2280, 29, 19, 1208, -2639, -2277, 1144, 3304, 109, 307, -1092, -3690, -3995, -3939, -2130, -63, 812, -387, -2475, -4032, -3569, -2891, -1152, -482, -2780, -1553, -429]
45263d29J782M04R94k081j13J815N75k58N35k579N63K425j079J65p21l62N89
46633B225k976l223N0J159j13J510R68j0K021l006j598M154N35j624K66N32j325
48002d55R71l99J275l17J194J798j374r40k397j152j639n41J519J95J729m43
49291i76Q22L606p65k213K059n16k173L89k338j726K543J705K044q58j975l152
50580c524J274J617L073J180j904j815j350k5K00j481K729j24j249j537K768
51789a68r65K047j898l318J8K004J046k276K124L172j44j542J756l77j31R64
53077B312L86J545n684l364K913K020r31m61m32J100J471j297k776r34J197J367
54366a568j877P49P13P24n39r66N06J836J548j898j690J52J255J310k342N21
$$ y = [-429, 1353, 1757, 2751, 670, 557, 2372, 2947, 2689, 3224, 645, 1208, 3633, 2554, 2719, 1998, 1636, 2225, -751, -3974, -3924, -2765, -2878, -1368, -400, -410, 1611, -1395, -2993, 1161, 1696, 72, 338, 870, -455, 516, 117, 1392, 1075, 2269, 4067, 2693, 1753, -644, -1796, -3435, -3976, -2457, -2262, -533, -976, -154, 3452, 2687, 474, 2533, 2017, -156, 233, -2105, -3831, -1288, 417, 2461, 1603, -372, -3524, -2250, -633, 2440, 3620, 1716, -99, -1449, -1474, -1274, -2755, -26, -150, -1399, -2936, -168, -1133, 914, -984, -4302, -4284, -2280, -1234, -3510, -1386, 1786, 1642, 100, 1856, 1479, 1348, 2312, 2698, 4243, -1441, -4805, -1892, 128, -803, -1264, -1696, -596, 875, -422, -3198, -4132, -2935, -1568, -3445, -2696, -1983, -1259, -1798, -2764, -2258, -422, 1126, -772, -2462, -2310, -1055, 255, -2087, -1566]
55655a566q49j275J432K474J958k731p37P12l265J223J41N03n47J064j272K781
56944D6J418j084j981q43J293K366j132l764m9K900J65k404J037k149J848K81
58233b052K502j987J434J620n70l293O92n44J38Q99j328l742K117J895P31P77
59522g11K113J99o17N254r04o71m869k772K428O49l709r40J521J979J879j28
60810G01K01l35M89q5j79k044k53l71M24J133j88K38m92j632j144R55L27J698
62261e57M402J37j338j627M71k471j816K382L63K312q5J805j475j785O45j714
63549c51L50Q19j928K376j413k714j207J338j81P66M310j43j124j195Q68J674
64838B245j99k893J942K434l790N98O46p3M42l42k194q20J45J611K138J578j681
$$ y = [-1566, -2415, -3690, -2258, 216, 2174, -557, -1294, -582, -3847, -2624, -2483, -1980, -2527, -1463, -2735, 46, 1464, 380, -1601, -2444, -1151, 1215, 83, -3681, -3730, -830, -665, -3069, -2032, -4181, -2333, -2052, 450, -1537, -103, 1517, 947, -2346, -1654, -2198, -2060, -1161, -2489, -6231, -4114, -2219, -1488, -711, 1402, 1601, 984, 6238, 5334, 4663, -206, -2978, -550, 99, -3610, -4550, -3029, -1050, 829, 701, 902, 567, 1056, 971, 792, -1252, -1505, -1876, -1452, -319, -507, -269, -761, -2393, -3537, -2582, -2255, -557, 3845, 3982, 2644, 1017, 1488, -983, -2799, -417, -54, 2258, 2173, 3978, 2503, 718, 1363, -351, -1, 818, -1110, 1266, -147, -2861, -4068, -2730, -2911, -2145, 2165, 2022, 898, -297, 571, 2245, 2046, -847, 1095, 3529, -261, 337, 983, 910, 1352, 1010, -1184, -2004, -1859, -248, 1890, 3468, 1787]
66207A787p07J747K082r38M94k618m470o7L019O79J758j002j103j342o38J285
67497c4L010r97l554j231M36R25K107K88N8k305J475K353k274K680k174K82j497
68866d52l711J119j639K855J829j916J055k82j222J848M17J31k090j376Q13K308
70155c13k688R04K199k45k962K000M454K908j912j884o57r10l528Q7K996j95
71443B54o72K166j945r97l19J647K106j172l067l35J859k204p26K041j34n29
72733b027J715j23J306P51J228p47k470j861L547Q46j198j876j254m66N7J306
74021a266Q02j004k24J39j715K324p75J155j559k37L88o22j751K306J628j544
75310a955J042k68J849L368l44l549o39L1j684J794k32j717L31J483L33j423
$$ y = [1787, 1080, 2827, 4909, 3971, 4465, 1847, -2623, -2690, 329, 1008, 2766, 1764, 661, -681, -1319, -34, 2976, 1979, -1575, -2806, -2370, -1445, 662, 950, 1008, -1297, 178, 2531, 257, 2937, 763, 1045, -452, -4163, -3044, -4683, -1828, 1, -1915, -860, -1142, -2364, -516, -99, 32, -2058, -3434, -2621, -313, -3001, -2097, 102, -143, -3105, -1105, 3349, 6257, 4345, 2461, 1804, 894, -2634, -2547, 449, 254, -418, 1748, -197, -1194, -1513, 134, 2240, 1068, -1999, -2334, -475, -2679, -3405, -1364, -1498, -2027, -312, -435, 871, 1622, 2850, 2103, -367, -2228, 1319, 2165, 967, -909, -2163, -2629, -2572, -1266, -464, -1468, -1692, -1553, -3268, -944, -1719, -564, -2123, -2360, -1972, -2594, -4345, -2039, -411, -1955, -913, -1181, 668, 4036, 3692, 143, -496, -465, -2149, -355, -587, -2304, -1973, -490, -157, -1580]
76599a580O32J822j170k466P77k230j95R74K260J8J826K472l45l453L4J618n02
77969D92J325L79r43m42k38j313J95J122J468j001R5M51o99l38O75p79k031r13
79418b495P23Q46J69L27j926L93P56r7k567o34K357K036L9j877j12J23l14l30
80869b583Q95o47r95n71M62p71K229J708p46k681p30%J011J746L188k367K616
82238A764n51L3k370J433K282k173j552R34N63L38J782r01k754K524K212K04
83527C768j183o46r0j737K62Q86j541k569Q18N73R95k083R67J404n65k64J234
84896B29Q55K155J691p45k102k901R74j020J771L496r44k571r49J093n41o24
86185a33j631J040K81J968J046J012o92K272j482P49k432l021j753j789Q10k63
$$ y = [-1580, -948, 874, -296, -2762, -1985, -4215, -4410, -3436, -1176, -1158, 668, 3140, 2795, -658, -624, 994, 492, 1817, 2196, 1253, 811, 573, -740, -545, 577, 2045, 1044, 1139, 1590, 891, 553, 1228, 449, -1582, -2495, -1772, -926, -757, -430, -2356, -1963, -1207, -1304, -3871, -4505, -2148, -112, -73, -1950, -2062, -1939, -2253, -2583, -1688, -2335, -3330, -3901, -3439, -4210, -1981, -273, -1019, -3700, -4430, -4430, -3419, -1673, 1515, -852, 1764, 1213, 1246, -1124, 309, 2591, 418, -1134, -200, 363, 701, 2483, 1582, -1172, 1352, 3564, 3768, 2585, 1939, 1849, 112, 374, 1260, -281, -2850, -2032, -1459, -464, -2547, -1580, -176, -741, -1005, 229, 1084, 3239, 4930, 4185, 2083, -818, 156, -864, 907, 4403, 3459, 888, -61, 1032, 491, -133, -1764, -724, -443, 1525, 2571, 3583, 2891, 5163, 3681, 4430, 1998, -1023, -2776, -4565, -3755, -4018]
87474d018L62Q95N84R44J379j195k689m16J730J673N60J296L747n74m046j507
88763a275j595K752k667J191L344k879J58K138l71k792J93r60J060j040J492
89971a251k271j132Q91J097Q15j611j585J518M043J423k080J231R73j572J374
91180A863j51M98O09j480k935P9k424K535L953r31l272O66L64J48K72p07m34
92549a347p18l130q79J727K206J680q32R44J432K01l48Q88l466j533J760P3r88
93918b330o49J433l040J067K926k364j379J158L640J537r73j963l39K110L18
95126A152j185K065P91p19N34j593P2L799J300p57l25o45k409J567o46k501k354
96496a854N31j925K007J126J511l63Qj821J909n13j491J75k74J078k746Q00J46
$$ y = [-4018, -3656, -2761, -2177, -1233, 146, -1049, -3738, -4154, -2424, -751, -191, 1105, 4852, 4278, 232, -1275, -2870, -118, -2785, -1594, 1750, -1129, -971, 1167, 796, -1996, -1803, -2763, -1703, -2743, -1251, -3522, -4654, -3763, -2666, -1851, -3462, -5047, -3529, 514, 1937, -143, 1088, 2061, 489, 1863, 1712, 2210, 2819, 1339, -1596, -1517, -3941, -1406, 2547, 1616, -1656, -990, -626, -478, -206, -913, -1347, -2065, -5195, -6074, -4347, -2141, -461, -1293, -349, 1083, 1284, 936, 1824, -1642, -3175, -1415, -1342, -2330, -2979, -1546, -4586, -3519, -593, -2957, -4336, -3178, 462, 1999, 1026, -937, -1276, 834, 1152, -33, 2032, 2823, 2104, 2638, 1045, 1117, 4916, 6216, 5459, 5134, 4489, 2080, 3647, 3001, 500, -1854, -1323, -3248, -1241, -115, 1396, 1033, 1041, -780, 1129, 616, -875, -700, -974, 104, -2642, -1842, -1696]
97865a696K101N86j670j042k148P03K910J450j57j732L76p51k215n76L750O98
99154E87o57n39j826J98j831J275M14J768K461j338j305l70j68J580j037j492
100443b280K062j04k209N14k395R35K998J040l405q31r20K993K811J041J714J839
101732E803q58q45n04q15l867k88R16N10K337J742k693j42q54r09P40K619j941
103101I51O00J622R60p8j878k857m503J13J069J426l486J098L41L559J768N80
104390A285K204l62k111l666o43J325M28M08K067l136k439K321K892O96l73J541
105679B437J361j415o32P97n04n36j637k560J266L11J587J460n48k147j316J806
106968b70K525K023j607l712o04K109q22k285L78L88N29R87Q04k368j881K75J330
$$ y = [-1696, 405, 991, -679, -1721, -3869, -3166, -256, 1194, 1037, -695, -319, -1070, -3285, -3861, -111, 587, -70, -609, -2435, -2237, -4068, -2793, -2379, -611, 1850, 512, -793, -1163, -1331, 249, -788, -2280, -218, -322, -2531, -2017, -4412, -3477, -479, 561, -2844, -3675, -4595, -1602, 1209, 2250, 3964, 5803, 4945, 4100, 3596, 2781, -1086, -1374, -458, 52, 2389, 4131, 1438, 1296, 442, -467, 273, 2892, 951, 1551, 3173, 4133, 4055, 2177, -680, -5183, -5070, -4001, -2575, -6061, -4963, -4622, -1063, 705, 1285, 3489, 3127, 1016, -2650, -3293, -1968, -1540, -1132, 935, -2201, -4640, -2319, 573, 1269, 896, 2437, 3798, 2383, 1751, 2548, 2044, 1508, -129, -2689, -1423, -1112, 475, 1935, 1387, -760, -2076, -270, 2255, 4278, 2671, -1041, -1645, 464, -358, -2643, -2265, -1877, -1348, -361, 443, -1925, -3806, -3531, -2201]
108337b201j686j01L832K394K448k323j712l88O86k675k904p12K973k5J401P52
109626b41M834K298j695m667m96M52j347j027J351K069q07J988j275m2j481j48
110915b34q67P65J046q58k401J378K396M34K55M46j560M00l56m24J476Q40o2o41
112365B033K24n219J209L026j116j766o71J292J895j535P59L583j135j930n0R91
113654A590l661J115K354j374N52k5m55k956p45r71%M286L23Q83m3L82J19j061
115104C13N21j913K95q24Q01Q36J14n29o11K032k907k139j15L91J59M321j52J045
116554A638j239J65K360k746j731k65N75q9K294j437m50j039j50R59n8J149p11
117923g75l313M97J137j196l58j20o34J720J871L05J175j632m52K796j95m0l78
$$ y = [-2201, -3887, -3988, -156, 2238, 4686, 2363, 651, 263, 949, -1726, -4630, -5342, -2369, -2394, -993, -241, 4593, 6891, 5196, 529, 33, 485, -862, -1889, -538, 1531, 724, 2712, 1437, 1395, -86, -234, -1101, -336, 710, -148, -2549, -1171, 1225, 1659, 1914, 2360, 800, 1200, 844, 420, 1896, 2736, 2674, 2033, 2257, -2962, -1753, 1273, 157, -1609, -2280, -988, 907, -628, 131, 3714, 2579, 649, 599, 1590, -2071, -956, 1398, 24, 576, 551, 96, -2860, -3605, -4576, -4576, -290, 33, 916, 873, 1255, 1374, 313, 834, -1079, -784, -1608, -807, 29, 143, -386, -997, 1035, -1872, -4011, -4126, -3735, -3576, 745, 593, 1638, 399, 564, 2924, 178, -1553, -1818, -1243, -1332, 962, -475, -925, -1964, -2114, -1155, -1213, -64, -775, -4088, -3591, -2454, -3650, -4008, -4128, -4762, -3042, -1171, -866, 309, -1323, -1775, 1021, 826, 786, 408]
119293D08k939j852PJ162J706N08O31L79J735K123j808j393l115o08k077K386
120582b747M227J025m29k026l15L0J594j835O54k347j173N364K259K343l26j581
121870D717j931m37K195J869J860j393q54k045j851q81q22K347k198N13K67l001
123159a645J138l885j003j06M2J951Q99k564R28K340j772K86J254Q56k359N96
124448c044j74J056K122J663J147m71p29m27o08K077R74j730o59J771k704N1j605
125818a290j86P41J236j555j010K765L91j814m53J569J162l10k767L25o90J554
127106c32k068l514J39J604p96J408o38R41K413j55K30k332K872K216J331L190
128396F509K50k758l6l174k484l06o18K749L230j884j076n12O50j67P73q42L18
$$ y = [408, -2531, -4383, -4376, -3214, -1508, -1000, -369, 10, 1745, 3868, 2060, 667, -2448, -3056, -5133, -2747, 1480, 2505, 2076, 50, -265, -235, 1359, -476, 178, -2169, -3342, 2022, 4281, 6624, 6298, 4717, 2786, 2349, 4544, 6413, 8273, 6880, 6026, 3981, 2130, 1249, 427, 2774, 576, 1089, 1356, -1645, -507, -4392, -5395, -5501, -5459, -3508, -2609, -5173, -4245, -1905, -3677, -3391, -2137, -1281, -3640, -3044, -3218, -2162, -40, 1623, 2770, 2299, 1570, 1143, 535, 2612, 3586, 1856, 1197, 2968, 264, 315, -1290, -1476, -735, 501, -1054, -2064, 701, 1092, -722, -1175, 394, 1556, 1246, -1521, -1196, -1886, -332, -2400, -5914, -5775, -4171, -4967, -3559, -4197, -3256, -843, -998, -768, -3100, -228, 1988, 3319, 6509, 6759, 4001, 3965, 791, -1693, -1999, -2617, 132, 3362, 1478, 402, -110, 540, 373, 1146, 304, 622]
129764F22k062k361J712K832o93J53o04O34K722n82m59j638k309J267M85k467
131054b748J694K866r52q41K385j186j205L30o0R28j56J18n72M22p41p20K195
132424A757P15j475J42k908m81K215p55r17K172m11J233Q38l189J621l44j650
133712a437l633j021J793L350J012l183l33K11K42p14j951K225k74Q9M09K129
135000a086J68R72J04q34N23n69J472K1N31N51M41Q89J873k078q14l372J389J019
136451A200m41k569Q80N80j150R83J188J611m28j989l510l25j648N35J632M325
137740H74J832j557R66J09Rm1J960j102j096J711l695p7L531Q34L418J000j516
139109G160k859l089J152K952M00k869o44N12l108J082N89J211L960j077k823
$$ y = [622, -1440, -3801, -2089, 743, 50, 203, -401, 233, 2955, 2373, 1914, 276, -2033, -766, -281, -2748, -1054, 1812, 860, 19, 2404, 1218, 13, 343, 283, 1211, 1055, 1173, 601, 1023, 282, -438, 1757, 2472, 997, 1139, -1769, -2250, -35, -790, -1707, 465, 54, 1287, 2125, -1064, 557, 213, -1437, -5070, -6091, -4298, -948, 64, -3119, -3452, -3241, -2999, -3713, -5664, -3439, -3713, -3624, -3215, -1086, -918, 54, 158, -676, -153, -722, 750, 771, 1302, 1853, 2294, 3183, 5056, 2978, 2164, -1208, 181, 1200, 759, -1810, -930, -350, -1500, -517, 671, 2282, 1854, -135, -3645, -3970, -5618, -5083, -3451, 874, 2706, 1149, 2115, 2224, 2233, 2192, 4152, 3050, 1954, 3665, -30, -107, 3424, 4258, 7676, 8676, 7160, 4301, 1212, 2364, 5316, 5716, 2847, 2203, 2715, -393, 689, 1278, 2489, 6449, 5372, 2549]
140317B549k008r33j983K098P97O95J788q72j900m05J460J752j348k751J321K320
141606B580k104l482k6N970M61l959J122j932o75n39N51J39l10J170k3q88j009
142976b954M528j738r99N9K952j558r68O81j425j248J245L93m65K733L17n68M56
144345A441j58J713o95k572j54L055M88l718j502J013M17l96K228M58k765J761
145634F14N22K41q65K322p76l387l064L335L40J813p18l07K956R71k369j022p98
147003a92J931j323L5J615j757n36p46p18j12J813J485j894L091K452j301K02
148293D045N47k219m30l50p56k602k822J448K750j553j217L45K053O91nn21L94
149662b02j178k29J002N35J175j58o39j880q41J496L438L344n5l778j927j530
$$ y = [2549, 541, -392, -2375, -277, 520, 1215, 3003, 2131, 231, -174, 1286, 3038, 1690, -1061, 260, 2580, 476, -3006, -3032, 2938, 3399, -560, 562, -1370, -2045, -2584, -2033, -1894, -2204, -1034, -1057, -1945, -2954, 1574, -164, -1163, -1104, 1848, 290, -678, 3, -1422, -2670, -1425, -1032, -1497, 1236, 1553, 985, 1441, 1283, 2996, 2301, -271, -425, 2630, 3118, -600, -2102, -1089, -672, -1068, 1160, 1618, -1147, 614, 1136, 1377, 512, 2834, 2058, -1329, -4393, -1058, -718, 1095, 377, 70, 3026, 3997, 1628, 606, -192, 1739, 416, 451, 2066, 309, -227, -973, -1691, -1803, 10, 1495, -399, 2692, 5144, 3843, 4045, 4592, 2373, 1943, 1593, 837, -1765, -4587, -3139, -389, -1942, -3159, -2814, -761, -70, -75, -596, -202, -1380, -1609, -607, -72, 1103, 945, 306, -1574, -2415, -919, 2519, 5863, 5808, 2030, 103, -1427]
150951a427J79j130o53K169L386K3j27J490m00Q63o91k994J637K768k198k42o88
152320A965K60J013q7J128Q28Mk85k831J370Q40k864K46j528j659J187L794j666
153690A715M99m68n405J155J063O78J219j241P51K00J023J0J871Q01J647m60j059
155059C999l45K791J182j121J462K87n45L78Q20l125p71k44k362O55j929K910
156348D042J693k748k07k582l39J248K361j3j704l09J143o4K943O3K341L23j075
157717G116k477o24J922j620r75l817K853K28L38L378j230l20K576j134j571J843
159006F486j156l040L187K605J276k539k991n16j29l24J681P79k721j819K075
160214B854L102K511R98Q95J549P261K395l663j39M333Q768J5317J1894K56O638
$$ y = [-1427, -1248, -2378, -3031, -862, 2524, 2547, 2420, 3910, 3510, 4373, 3682, 688, 2325, 5093, 2895, 2653, 1965, 2225, 3238, 3151, 4279, 5107, 5111, 4826, 1995, 3365, 4205, 1341, 1587, 59, -1600, -413, 3381, 1715, 2214, 1746, -3659, -2504, -1441, -763, 456, -785, -34, 166, 1189, 1199, 3070, 3871, 5518, 5058, 3999, 3654, 6445, 7627, 6506, 7968, 8255, 7710, 8088, 8908, 5783, 5012, 4768, 2406, 3061, 1132, 4042, 5735, 2987, 2780, 198, -141, 1107, 3468, 3455, 1751, 1442, 2585, 2521, 5464, 5527, 7868, 8191, 7116, 4639, 4015, 5937, 4317, 3342, -475, 2378, 2606, 2944, 6322, 5092, 4772, 7348, 6214, 4643, 6486, 5330, 2290, 5477, 8082, 9358, 6819, 3828, 3312, 3183, 2859, 4540, 5319, 2598, 779, 2854, 5956, 8467, 9465, 10360, 11909, 19170, 21565, 17902, 17763, 22096, 30864, 46181, 58075, 58331, 64969]
161423F4969q335k510R838J8426J6092L5683r183j6679K688o698P163L8383M862
162470A54699o758J3212l8218k0523M583J060J1588K6503k8333k1783j5124j6521
163436F4385m268M073q670j416j373j5668q063k429k398P4k249n269j709l093
164565A1927n828m549P06J996K499J78k496l485k531K543R73N98O83q79M86l044
165853b23R94J304J898l14j89l28J565n28j184o53P37m48l49M70j865r80k055
167223b148J395L625j977j928J150L78n5K027j100j64M00J831k991k474Q28N75
168511f28K620N280j575l544j247J103J841j013k72L76q44j147K649r43n78O03
169801B681K601j520n62l7R04L05N08M089j867J353K299j336j500M37j42L75j417
$$ y = [64969, 56634, 54124, 63962, 82388, 98480, 134163, 124980, 108301, 110989, 104291, 111454, 149837, 154699, 147941, 161153, 122935, 102412, 106995, 108055, 119643, 146146, 117813, 96030, 80906, 64385, 60117, 64190, 55520, 54104, 52731, 37063, 29000, 26571, 24173, 24247, 21998, 16729, 15020, 11927, 6099, 1550, 2256, 4252, 6751, 6929, 4433, 948, -1583, 960, 1933, 2531, 3214, 2335, 2821, -223, 771, 2075, 3973, 3659, 3470, 3142, 4707, 4179, 2995, 2342, 3079, 2631, 2282, 2752, 887, -93, -2148, -753, 2872, 895, -1033, 117, 495, 440, 2467, 1367, 1203, 1603, 3434, 443, -2031, -1203, -628, 1992, 7272, 5697, 2153, 906, 2009, 3850, 2837, 2565, 2941, 2097, 950, 3599, 2656, 2078, 2681, 5282, 3762, 3200, 3163, 4067, 4372, 4880, 8969, 7102, 8455, 10754, 9418, 7918, 8355, 8213, 8588, 7171]
171169G171j80J1j223J225K5j20O57Q34Q3j431P07o06J333L9j873p0j22q0J988
172700H368j671r83L215J340O76k428l363J018J73k143K762J411j526j291o61
173908D897J964J98j502k873L09K354J979L400J635j830k399P07n29L04J059J711
175198A1384m82j296k393J053J833L366j458J324K191N18l182J855L844O30K702
176405B1889j744j255J461J036L019M361K641K589R258J8222k178r092L93J2306
177534F2906L1684N2046O859J1225J9289k5416O107N3754L5381P0200Q4676p3521
178500C35190k4258o567q885N8768J08785l2959K7565o268j07093k9249J3147
179386C28176m967O0588L6276r9360m2990m8261m2668M325J8061k9391K916k7831
$$ y = [7171, 6991, 7002, 5779, 7004, 7029, 6909, 7566, 8400, 8483, 7052, 7759, 7153, 8486, 8525, 6652, 6582, 6460, 6380, 8368, 6697, 5714, 8929, 10269, 10945, 8517, 5154, 6172, 6345, 4202, 6964, 8375, 6849, 5558, 4897, 6861, 7059, 5557, 2684, 2993, 5347, 7326, 10726, 12361, 10531, 8132, 8839, 8310, 8614, 9673, 11384, 10902, 9606, 7213, 8266, 10099, 13465, 12007, 13331, 15522, 16040, 12858, 14713, 18557, 19187, 21889, 20145, 18890, 20351, 21387, 24406, 28767, 31408, 33997, 43255, 61477, 59299, 50207, 50600, 62906, 94590, 146636, 153495, 164720, 184009, 158593, 164700, 218454, 253835, 324035, 408711, 335190, 310932, 304365, 295480, 354248, 463033, 430074, 457639, 451371, 344278, 315029, 328176, 323209, 383797, 420073, 320713, 277723, 229462, 186794, 191119, 209180, 179789, 182705, 154874]
180353A54874n0104k7779j1914l016J897m378j5831j0253o028n966n947l452o439
181400E664L01M10m78J43k516j458P49L87l66j279l52n8n30j158J49j980j926
182770d298j890q94K340N204Q09k449L05K328l279k474j457L359R8M10J304l922
184058d506N57j815Q48m18L142J056k469k769J705n79j2L262J150j53K464j509
185348d6j381j692P91l49K066R52R79l24K05j984M83J298O55k137J897Q12k290
186716f5J338J5j437L727J365J973L383K047m026m51n13n82n81m85M92j799j712
188086B689K438p13j391J077Q74r18J58K160q57j104K248K417j813p00l79N7K739
189455H982L734M495m688m933l639j329m384J346N135J726j37j372j614J719M00
$$ y = [154874, 104770, 76991, 65077, 62061, 63958, 59580, 43749, 33496, 27468, 21502, 15555, 12103, 5664, 5965, 6375, 5897, 6040, 3524, 2066, 2815, 3202, 2836, 1557, 1205, 1147, 617, -541, -392, -2372, -4298, -6188, -7082, -4742, 462, 1271, -1178, -873, 1455, -1824, -4298, -5755, -2396, -2298, -1888, -584, -4506, -3949, -5764, -4916, -5334, -2192, -1136, -3605, -6374, -4669, -5248, -5260, -1998, -848, -1001, 1463, -46, -1427, -3119, -2328, -2677, -611, 341, 1320, 996, 1201, -783, -300, 998, 1653, -484, 1413, 2225, -65, 1273, 1288, -149, 3578, 4943, 6916, 10299, 12346, 8320, 7869, 7356, 6774, 6193, 5708, 6200, 4401, 2689, 5127, 4414, 3023, 4100, 4974, 4056, 4214, 6374, 5517, 4413, 6661, 9078, 7265, 6565, 6186, 6243, 8982, 12716, 17211, 12523, 7590, 3951, 2622, -1762, -416, 4719, 6445, 6308, 4936, 3322, 5041, 5441]
190664E441j787K505o52M28j376j38p0p24K62J52K618R69k981J632M253J890j682
192033A0740j702Q39l66O28K889M14j460p11Q99R61J588P44J114R38P26K901L168
193403B4310N353P412J1873R354n210J334M507J6815L7783L9188m500K5249j920
194450A71548k1493K3808N3036L5578R9781K9933p4500n703k1322P939R5892O7883
195417D62380l4360N1291p2979q6382l601R817Q067Q7784l2831q5787l3138n4977
196383B15284k5177J6595o333k4251J364m6830l7085j6671j1085n099K905j0723
197350E2894j5260p880p422r091K82m97k598r37r43m212o79K292l068n20k653
198558b92k788j077J042P12j905n47K81O59J049K455l15k234k05R60j26Q2l377
$$ y = [5441, 3654, 6159, 5507, 5935, 4559, 4421, 4351, 3627, 3889, 4041, 6659, 7628, 4647, 6279, 10532, 12422, 10740, 9038, 9877, 9511, 10139, 13028, 13442, 11982, 11271, 12170, 13131, 14719, 15463, 16577, 17515, 18241, 21142, 24310, 29663, 37075, 48948, 58302, 53092, 54426, 58933, 75748, 113531, 152719, 148219, 173468, 171548, 150055, 173863, 226899, 262477, 362258, 392191, 317691, 311988, 290666, 298605, 394497, 462380, 428020, 479311, 406332, 319950, 316349, 326166, 334233, 422017, 389186, 303399, 270261, 215284, 190107, 206702, 200369, 176118, 177482, 130652, 93567, 76896, 65811, 60712, 63617, 52894, 37634, 29754, 22332, 13241, 13523, 13026, 10428, 9491, 8548, 4336, 3657, 5949, 2881, 2361, -292, -3080, -4157, -3115, -2403, -4308, -4855, -4574, -3915, -2866, -411, -726, -2960, -3165, -2205, -2331, -2249, -5626]
199927e626J366L415k92N81j575o35J552k115j209O01m01O91k500m02j053L09
201217g293L232O38j417M86j303J499J920M35M05M53l82J172K28r98J033N5l8
202586A25N29O3o30k567j893K758R88k726N69J279M00J2K403%k583o09J161p20
204036a441J56R36R82k922j493M10k69J778L163J614k083j960L05P31L58m78L65
205405A52k62J927j241K400J648k876j252J093P85n95J122j059N09n62J60j73
206694A776K282j519J377j13m28j403j096l16K880P34j492j201N26M61J241R28
207983D637j032l235K85M83J237J95k398k553L446J39q0K535p9l19l886j401J323
209353g03L230J176p58K352j308M10J082K412J516N639p19m584j588M519J0332
$$ y = [-5626, -4260, -845, -1137, -556, -2131, -2766, -1214, -3329, -4538, -3937, -4338, -3647, -6147, -6549, -7602, -7293, -4061, -3423, -4840, -4354, -5657, -4158, -2238, -1803, -1398, -945, -1327, -155, 73, -925, 108, 163, 125, 654, 717, 87, -2480, -4373, -1615, -627, -3353, -2784, -1505, -1105, -1093, 1310, 1310, -1273, -1882, -721, -1441, -1285, -349, 633, -2289, -3782, -3372, -3641, -1863, 1300, 2914, 831, -1129, -824, -93, 265, -213, 152, -110, 1817, 576, 2976, 4624, 1748, 496, 1589, 2374, 1779, 2901, 1842, 2351, 1789, 1949, 1776, 4058, 2539, 3916, 3803, 3375, 1972, 876, 560, 3440, 4174, 2682, 1481, 2007, 2468, 3709, 4637, 3605, 370, 655, 1138, 2375, 2570, 172, -2381, 1065, 1204, 1124, 3659, 3580, 3261, -625, -2026, -703, 2527, 3703, 2945, 5297, 3989, 4399, 5481, 7893, 9409, 15048, 14329, 9745, 8157, 12676, 23008]
210560B3008K0679P277K26P839p410j307J2438J5581J7817L5135j2551j7811l382
211608I7539n195J1976M0370K809m711R992l4623j6038N327j49Q355K5529k6577
212655A14604j9698j3844j8222l592R171r918k553L85j6835j2161n577p04k046
213703A9010K805m281m782n412k435j813l75j644k389r93k612r66K750l64N29
214911b972n06K763l55P79j704j682q73L116R20K3l137k367Q83J726M07k651K699
216280b931l23l74j877p09J632J275J467N97R53j068k333L42j302Q59Q90J03R92
217649a807Qk066n49L04j155M240j574k113k052J909J12K341L86J600k98q94j283
219019b891M5j000j67j687r03J434L668J185j146l529J277P20j111J028J856M95
$$ y = [23008, 43687, 50964, 51190, 59029, 51619, 50312, 62750, 78331, 96148, 131283, 118732, 100921, 97539, 92344, 104320, 144690, 147499, 142788, 152780, 118157, 102119, 107446, 107297, 115652, 141181, 114604, 94906, 81062, 62840, 59248, 68419, 58501, 55948, 56333, 39498, 27337, 21760, 21056, 19010, 21815, 17534, 12752, 7340, 4905, 3092, 2717, 1073, -1316, -2309, -4921, -5887, -3137, -3501, -2972, -3478, -715, -1070, -291, -1995, -3677, -4550, -1434, -514, -491, -3628, -5995, -5112, -3386, -2979, -5630, -2931, -3254, -3628, -5505, -6214, -4582, -3307, -1840, -1243, -290, -1358, -3691, -3349, -4651, -3792, -2902, -2799, -1807, -1799, -3865, -4414, -4110, -5265, -1025, -2599, -4712, -6764, -4855, -4743, -2402, -2016, -416, -714, -1608, -2891, -2846, -3846, -4013, -5700, -6603, -5169, -1501, -316, -1462, -4991, -3714, -2994, -4105, -3077, -1221, -726]
220308g26L132j546l310L98j883k214K460K675j445r75O76K60K071L350Q64j967
221596A820j076l304j4O25L87K61j254j542n82N32N44N71j191j940N98j170J408
222966e327q92J758N01j41k93K69J169M71J752P30j589J861K535k479J498j95
224255A628n72j998j677K122N3K692J639k461j438j293Q2k094J111q94j570J591
225544c079p32J75r23J389R39L51r77N8J889J628j156l280J006j537l280J703
226833e826N7r57L481j413k266n16K154j613J000J121O92l24J202J216O39Q58
228121d95m858k040K523J058P17j02K833J527J777l914k879j186K141L197j559
229329a260m203J393O86N51P41j621R36J444k18o02J232K263j304l046o86k397
$$ y = [-726, 2406, 860, -2450, -2052, -3935, -6149, -3689, -1014, -2459, -3434, -2758, -2498, -427, 2923, 3787, 1820, 744, -2560, -2574, -1949, -1562, -1301, -2555, -4097, -4679, -4147, -3603, -3032, -4223, -6163, -5565, -6735, -5327, -6219, -4461, -3960, -4101, -4394, -4125, -2956, -2485, -733, -3, -1592, 269, 2804, 325, 1823, 1628, 1056, -942, -2619, -497, -444, 2248, 3887, 1426, -12, -1305, -1223, -3317, -2206, -3100, -4670, -3079, -3811, -3636, -4559, -3170, -2231, -1880, -2857, -2799, -910, 718, -438, -3718, -2712, -4249, -7529, -5826, -5769, -6726, -3245, -4658, -6924, -7440, -5286, -6899, -5899, -4778, -4086, -4410, -3208, -1992, -1353, -495, -5353, -7393, -4870, -3812, -3095, -3197, -364, 1163, 2940, -974, -3853, -5039, -2898, 299, -1260, -5463, -4070, -3384, -2833, -2092, -3713, -2777, -1333, -1551, -2153, -921, 1342, 38, -3008, -3694, -6091]
230619f091o81J757L879k082M50J441o74Q14J015j216j761L62J603O0k353j215
231908d692K231J347m6J3j501J723o57L19j126k720J2N588R78k364j589l02J31
233277b655L60J448j337m82L64q92J309Q43r10P11l926j181N259l54o65O38O4
234646a406j160R25o5Q52l7j064qm05o50J277n91k694K055n83j363K923K010j700
236096a684J768J8j645o83j504n98j033k54P14j159J38R81J536J048N77O84O37
237466d59j284j281o803J224K400K321m59n75L57j261J3J371K573J215J494j189
238755c43l451j559J763L060l07m75r04j976R66o03j604J134Q03m99j396L093
240043b298J383K068l4L319q26r92j417N16J62j229j311L31j942j76O92J167r19
$$ y = [-6091, -6772, -5015, -1136, -3218, -2768, -1327, -2001, -1187, -172, -1388, -3149, -2787, -1184, -1124, -3477, -4692, -2461, -1114, -1160, -1147, -2648, -925, -1582, -1263, -2389, -5109, -5097, 491, 1469, -895, -2484, -2786, -2655, -2295, -847, -2184, -2666, -2302, -3194, -1885, -1042, -1952, -1241, -5167, -6348, -1089, -1443, -2108, -1470, -1406, -2566, -1641, -1706, -854, -891, -1955, -1963, -2368, -3018, -1741, -2332, -5026, -2971, -3554, -4917, -1994, 16, -1684, 84, 102, -1543, -2226, -3730, -4328, -5361, -5615, -4901, -6060, -5922, -4941, -3405, -2357, -1780, -1096, -459, -1743, -3024, -9827, -8603, -6203, -3882, -4341, -4916, -4559, -5820, -5807, -4436, -1863, -648, 846, -343, -3794, -5353, -3590, -530, -837, -1312, -2216, -4192, -3226, -3829, -5433, -4299, -3496, -3995, -5391, -2298, -915, 1153, 1119, 4438, 3612, 2620, 1203, 1719, 1881, 652, -659, -328, -2270, -2446, -1754, -587, -1506]
241413a506j311J41L5P93j788l105J74j720L179L706O20k458L64J854l79l153
242702d554J208K779R40j786L32L91k309K500K13j475j581N87Q25L84K090k802
243991b258l276o34L41K665q30l357p26L344n84J194L440K77k628j058j419J100
245280d409R10K939q47P85j738J371o39j08k21N85K773q12j366K241k419j183
246568b138P42O73k53j02n83n62l057M32P3K765J480J848j241P07J95k84k817
247938b122l123J566q90J296L664N05k896j900L123q1k326k61R07k826j464J182
249227e646n5R5J725J747J11J87k47j093l10J775j658j959jj642N29J476J904
250597c062N47J2n33k11L65J767O46J979j60j238Q20j392O88l37l98n85J041j130
$$ y = [-1506, -2817, -2676, -2641, -1848, -3636, -6741, -6567, -8287, -5108, -1402, -782, -3240, -2876, -1022, -1401, -4554, -3346, -567, 373, -1413, -1081, -690, -2999, -499, -286, -1761, -3342, -2755, -1930, -1546, 544, -2258, -5534, -6168, -5827, -3162, -3992, -7349, -8075, -4731, -5315, -4121, -681, -404, -3032, -4090, -5509, -4409, -3499, -560, -1407, -622, -2360, -989, -1628, -1736, -1957, -1372, 1401, 589, -777, 1464, -955, -2138, -1396, -723, -976, -1078, -1661, -2223, -5280, -4848, -4775, -2010, -530, 1318, 77, 784, 979, 695, -2122, -5245, -3679, -4569, -3273, 391, 896, -2000, -3900, -777, -858, -3184, -3445, -2538, -5364, -6828, -5646, -5701, -5606, -3881, -2134, -2023, -1836, -2083, -3176, -3486, -1711, -3369, -5328, -5329, -6971, -6442, -4966, -3062, -2515, -2503, -3036, -3247, -2882, -1115, -469, 1510, 1350, 112, 932, -460, 228, -109, -507, -1092, -51, -1181]
252046a181J049N18k728k04P18j116l010m52K089k04K328k004p80L96n97o72k029
253416g879M68L256K641J947K145P18n26O6j758j162j559j911Q79k100j321j671
254704g767K792M753N18r19M46J645j714P68q90k82m261k675K248Q23M73r58J836
256074c164k163l12L895L87M27p72K64k9J228L081k709l820J634J454m41M78j960
257443b522k587j196K103j513K023M519M577k172p97m818k104J154R08K85j887
258652d027N12Q65K352K311k387j401j780Q59L910q55j156P35K096j299j781m581
259940e627K251O15k165j740K386L737j99j839n3K288j083r68J251k173M17Q13
261230b089L8J653j718l556K6L857M1J14J765J500J678k415k406j479p79J571
$$ y = [-1181, -132, 386, -2342, -2546, -1828, -2944, -5954, -6406, -4317, -4521, -2193, -4197, -4977, -4581, -5178, -5850, -7879, -7411, -4155, -1514, 433, 2578, 3296, 2770, 2836, 1078, -84, -1643, -3554, -2675, -4775, -6096, -7767, -4975, -222, 296, -623, -177, 1468, -246, 522, -368, -650, -4911, -7586, -5338, -4515, -4042, -5000, -3164, -5327, -5639, -1744, -1357, -930, -1702, -1438, -1467, -239, 2842, 133, -3687, -2053, -599, -1040, -562, -2522, -5109, -6305, -4202, -5715, -3692, 827, 5404, 3232, 2435, -2383, -4487, -3333, -2425, -2140, -4027, -3515, -2650, -298, 2013, -374, -1775, -3555, -2696, 1214, 359, -797, -62, 2034, 735, -1046, -5627, -3376, -2761, -4926, -6666, -4280, -543, -742, -2581, -2634, -346, -1429, -2397, -1146, -3319, -2902, -2089, -2051, -398, -2116, -5672, -5646, -1789, -1748, -1634, 131, 1631, 3309, 894, -1512, -2991, -3770, -2199]
262518b199oQ99q94K713J962k962l592M9L042j35J03J48N40l88l175J8M9j551
263968e379J414OM68M13J584l800m27K6K126J95o21O94N05K22J168K99R36J796
265418A625j16k124m34J978q09j219k307k196K883k236K049L323o73m20k958m8
266707c682J871p19M73K74J290K778k213%N50j181j518k120j859Q97K99J858K463
268076e39K08J67j525j340j000r25k8Q15K103j034j357k2j594J362K546m06q96
269446c465l208K971O87j14K644m45j66Q71R05k496l493n91L101K56j913L346
270734a110K506k427k236J566J092J032J814N23j864n249j978m6J391O36LO53
272024c694J264j351q21J523J259j972J812L119O76n91j675J014r16j181K823
$$ y = [-2199, -2205, -1306, -2200, 513, 2475, -487, -4079, -4030, -988, -1123, -1020, -872, -332, -720, -3895, -3877, -3828, -5379, -3965, -3959, -3491, -3078, -1494, -5294, -5721, -5695, -3569, -3374, -3995, -3301, -2796, -2574, -1406, -1107, -171, 1625, 1509, -615, -1049, 929, 120, -1099, -3406, -5602, -2719, -4955, -2906, 417, -256, -676, -3634, -3682, -1811, -2530, -2057, -1783, -493, 2285, 72, 72, 622, -559, -2077, -4197, -6056, -5159, -4860, -3002, -539, -331, -164, -1689, -3029, -4029, -4954, -4982, -4167, -2064, -3098, -4455, -4477, -6071, -4709, -2163, -2569, -3465, -6673, -3702, -3015, -3129, -485, -930, -1096, -225, 680, -1816, -5309, -5900, -2799, -2543, -4456, -1110, 1396, -1031, -3267, -1701, -609, 423, 2237, 2760, 896, -4353, -6331, -6377, -4986, -4350, -4347, -3694, -2430, -3781, -4602, -3079, -1820, -3792, -1980, 1139, 1815, 1224, -451, 563, -353, -1534, 1289]
273232A289J843l407j081j363l18j215K36j442K041L536J285j762r94L977m99
274440B126J562k518N1L3O39j641J039l050P12J938K604l02n59j973j204l119
275729c662j030k442K282K865j939k37K858O3N55k968o56K49L83J806m7k000j382
277099e302R60K199q26j312J760L082m57j39J094N21l39j25k328j413J023q4O59
278468a027P65L2K206k214l046J534J689J761j518k695o04L72K79M234K16j594
279757C90l22j374k66R73J372k50j378j382j035J804J482J386j329N79K29j601
281045g22P74m84j47o05r17K331J385k197j015k227j468J901M87K162o78j126
282335b546P50k011j668q91K880K209N44J050k725o62j268J91M295nJ027l51k348
$$ y = [1289, 3132, -275, -1356, -2719, -3037, -4252, -4016, -5458, -3417, 119, 1404, -358, -1352, 2625, 2126, 3688, 1170, 1221, 1254, 1893, 252, 1291, -1759, -1047, 891, 3495, 3193, 2634, 661, -543, -3662, -4692, -7134, -4852, -1987, -3926, -4163, -1305, -1242, -687, -3655, -4311, -4062, -3679, -1873, -1920, -3920, -5302, -4342, -2143, -2969, -4281, -2521, 561, 104, -35, 1059, 1580, 1241, 1116, -1212, -2625, -1602, -1686, -1027, -262, -230, 1976, -238, -3284, -1750, -61, 1700, 182, -2513, -3117, -2745, -2466, 1768, 1984, 390, 68, -1306, -1572, -599, 773, 523, -855, -2237, -3272, -1468, 14, 1400, 71, 650, 879, -722, 52, -432, -579, -1184, -2101, 230, 1615, -582, -1597, -3824, -5292, -3391, -2904, -742, -1420, -2546, -1796, -3807, -5475, -6366, -3486, -1277, -733, 317, -2408, -3070, -4338, -4147, 148, 143, 1170, 819, -1529]
283704a529o37j637k094K710J032J414K34l868J67L184j800N77q54j144M44M51
284993c350m55k056O00J044K843N6k89j279l303R12M77K120M300J481j551k95
286281A255m35kN3J17k364N20K674p95J420q6j860K17k567o92J368P61K404J006
287732B994L67j510n52J6j626J544K446J969j698k100J13j195k261J203K090k442
289020f42k143p78J840N63l85j612Q31L92n08l226J090K459L503k66k05O53l791
290390b225j267r61j481n42J417R35J278k444L123M073J311R4j422k103Q78J296
291679A960K549J297k850J39N27m47J777N28k357j000j207j741K835R73o82N01
292968B802J93p90PO39n9J558j995j069k64M098J955J892O79q93k36J326l218
$$ y = [-1529, -2166, -3803, -5897, -3187, -2155, -741, -507, -4375, -4208, -1024, -2824, -2247, -3101, -4245, -3801, -3350, -3805, -5861, -5261, -4217, -1374, -1318, -1607, -2886, -6189, -5277, -4800, -2680, 1620, 3101, 1550, 1255, 820, 818, 871, 988, -1376, -856, 1818, 1023, 2443, 2357, 497, 714, -1853, -2545, -1177, -416, 1988, 2994, 3361, 1851, 1299, 1315, -311, 1233, 3679, 5648, 3950, 1850, 1963, 768, -1493, -290, 1800, -642, -2785, -3563, -1723, -1160, -1545, -3157, -2326, -1934, -2442, -5668, -4578, -2119, 1384, 1118, 913, 1566, -2225, -3492, -4453, -5934, -6476, -5059, -4124, -2846, -5290, -2167, 1906, 3217, 3311, 1889, -214, 664, 1960, 4509, 5806, 2956, 3095, 3622, 3175, 4952, 5480, 3123, 2123, 916, -825, 2010, 2983, 2301, 2802, 2995, 2205, 2212, 2851, 2792, 4350, 2355, 1286, 1022, 5120, 7075, 8967, 9646, 8753, 8517, 9843, 6625]
294337F625o62K843j562j753L597J382j249M170L214J408J894K469Q40L532N327
295546C2075K998J2790K0582l991O337L0695J3498n169L5435L1414k5345J8828
296512A70147P3108k1622j6080O2068P973m2005M0661O3497p4083j1898N4154
297398C05920l1583m6488L4582l10o6904p157J7281m2033k5706P026k5489k6149
298365I2990m911l945k0637j3058m461q058n063k927n033m172k762n92j992n501
299492I878j555j97L59k659j435j505k489K260M074j653m750q37m71J344Q56j477
300782b57j542J727o57K17l109k21P36N894J83l22j175k580l765j899K196K089
302070b485L429K629j841R50j230j163j000j895J766J229j131k281j071r21r3
$$ y = [6625, 5963, 8806, 7244, 5491, 9088, 10470, 9221, 13391, 16605, 18013, 19907, 22376, 23216, 26748, 32075, 35073, 47863, 68445, 64454, 70791, 101486, 114984, 109815, 145250, 176664, 151319, 170147, 243255, 221633, 205553, 267621, 275594, 233589, 274250, 337747, 263664, 251766, 305920, 274337, 227849, 262431, 262121, 195217, 188060, 205341, 163308, 137602, 144628, 119139, 92990, 88079, 84134, 63497, 50439, 45978, 37920, 32857, 29930, 24897, 20725, 17963, 17371, 15379, 9878, 8323, 8126, 8485, 5826, 4391, 2886, 397, 2657, 6731, 5078, 328, -509, -980, 364, 1220, -257, -1799, -72, -729, -512, -3621, -3842, -3106, 2788, 2971, 2649, 1474, -1106, -4871, -6770, -4574, -2485, 944, 3573, 1732, 2682, 1452, 289, -711, -2606, -840, 389, -742, -3023, -4094, -5015, -5108]
303279e108L796L088J01m60r44J07p48J563jk929k063j805k380K794K441L14q90
304648c124j197k533M62K475R22k63J632j603j08O23K508J109j354j6k91J162
305937D04K441K540k544l931R63j847J622K211k419k408l21O96J475L494j180
307145A196j630j562J689j208L114J421j035k46M49l366K010L197J90O57l147
308354A729k237j609J494j36J89K885Q7j523j613J239M92q30J548r40k815o82
309642b722k31N78J400n3Q75J037R50j974K395N51o5j65K80o25M269M310l760
311012G050l332L00J500O07J207P78N69J915J170K192J874N20M62R423M131L623
312300C3989J4506J7769o264Q176L3582O031l995M1430K2813j9943L3593O8617
$$ y = [-5108, -1312, 1776, 1877, 1417, 473, 580, -168, 1395, 1394, -1535, -3598, -5403, -7783, -4989, -2548, -2234, -3124, -4321, -6854, -6392, -3917, -2995, -3258, -1626, -3229, -3337, -2714, -206, 903, -451, -467, -758, 404, 2845, 5385, 2841, -1090, -127, -1974, -352, 1859, -560, -2968, -3289, -2593, -1118, 2376, 1196, -434, -1996, -307, -1515, 1599, 3020, 1985, 1739, 2188, -1178, 832, 4029, 4219, 4876, 1729, -508, -2117, -623, -759, -570, 2315, 2402, 879, -734, 505, 997, 167, 1715, 775, -2040, -2722, -2953, -2375, -975, -1028, -153, 884, 1834, -140, 2255, 2806, 2741, 2576, 2856, 2231, 6500, 10810, 7050, 3718, 4018, 5518, 6125, 7332, 8110, 8679, 10594, 11764, 13956, 15830, 16350, 16812, 26235, 30366, 33989, 48495, 66264, 60000, 68176, 101758, 107789, 103794, 145224, 168037, 148094, 181687, 250304]
313268B50304l4482o400O3684q493l6817N1658N1195p7096P94N1822m6178l5028
314234B24963M2140j5911n9541L02J6033m4310k1608P563l1701k3488J253q398
315200H7297k2938j1997p355q494n743j369k534o456m044k745k421m527O13J686
316329H973q01m354O75M16j536N69k458k061R11R34J103k284Q31j58K797J21k158
317698A520k058l081L152m75k713n70j432K127k247J852K414q82J39J083J545
318906C74P48J886j353j361o14k793L18J751J024M96j660j404j795oJ835n48r71
320275d073K984j211L73K414M10j659k560P09j373q24k74J947l97j514J097L503
321565d48K413l598J021k61m68n45J196n99k48P19l36q7J527q23r81k527p18K079
$$ y = [250304, 215822, 209422, 273106, 264613, 227796, 279454, 330649, 253553, 254347, 306169, 259991, 224963, 267103, 251192, 191651, 191953, 207986, 163676, 142068, 149631, 117930, 94442, 95695, 87297, 64359, 52362, 45007, 36513, 30770, 29401, 26867, 20411, 16367, 13622, 11201, 6674, 7287, 8973, 8172, 3818, 4493, 4909, 3373, 3942, 1484, -577, 334, 1268, 2371, 87, 918, 760, 3557, 3678, 1520, -538, -3619, -467, -942, -3655, -4225, -5657, -3530, -5777, -3925, -1511, -2393, -2254, -1171, 374, 1122, 3008, 1655, 294, -320, -3113, -2795, -1044, -20, 476, -1184, -2588, -4383, -4389, -2554, -3102, -4073, -1089, -2300, -1927, 487, 897, -762, -3322, -2613, -3986, -4810, -5084, -3137, -3534, -5048, -3951, -448, 1965, -1633, -612, -873, -1341, -1886, -690, -1289, -1537, -818, -1154, -1241, 286, -537, -1518, -4045, -4763, -2684]
323014b684k17J783K075J189l98k142j818N47N49J422k005J375k060K81k61J576
324303g88p73n23J574J642j091j692j097q26k45m0j154Q85J682J106J079P48K352
325672B839J17k508m063k470K884N57l94J111l879j327j287M444J736j398N66
326881c072K71P3m86J558j060P69n69n33n80K376P95j950Q76K851Q8k954J297
328250b50J571K48k180j325M58K424j313o71k666m95p88J124K251j484K63j226
329539d059K172M84j984K037q93J99k651j262K311K442j351j753p7L79J530k49
330828b725J3p59j582l6k430j221K99K754J272J970N78l610j09L75J603J366R89
332198a253k771Q96p56r04O97n41L53K821J383j62q13J268q76Q46J99l48R57N26
$$ y = [-2684, -2901, -1118, 957, 2146, 1748, -394, -2212, -1665, -1116, 306, -1699, -324, -2384, -2103, -2364, -788, -1561, -2084, -510, 1132, 41, -1651, -2748, -3574, -3819, -3859, -5013, -4128, -2446, -1340, -261, 487, 2839, 2956, 448, -3615, -6085, -3201, -2644, -3038, -1927, -5806, -7133, -8420, -3976, -2240, -3638, -3072, -2801, -2728, -3214, -1656, -2716, -1947, -2516, -3049, -3629, -1253, -458, -2408, -1532, 1319, 1407, -1547, -250, 1321, 1569, -611, -1936, -1478, 946, -367, -1038, -3704, -4199, -4987, -3863, -1612, -3096, -2833, -4059, -1887, -1403, -3387, -1350, -2243, -2044, -4695, -5957, -3646, -1204, -2555, -4308, -4385, -4006, -2476, -2725, -2712, -3471, -5053, -5089, -7519, -8740, -8441, -5687, -4415, -2445, -1867, -5477, -5586, -5211, -3608, -2242, -1253, -4024, -3128, -3884, -4788, -4091, -4632, -4279, -1458, -75, -237, -1050, 218, -658, 188, 387, 39, 996, 1522]
333647A522m75k80%k416j481K922P47j703j723M41K411k270k929O11j058J124
334937d557M44k637Q36M590L505j671k110j709J056K567O15j923n89L06j502J089
336225a690l96J084J68r29k628n33k545J84J350J651j344q38J346K773p55j962
337514e064M83p77J930R15r82k02N00K39m54j141J063J840j888l0J584M70K934
338883A420k888k480p56l95L792L47n862J179l33R15M95J007l413R6J208k145
340173g813j623J861M508K819q03l123j359J848j256M66O27j424O32j388J416
341380d612L990m16j166j568P86J085J096j761J040j156L339L37r25k97m681K336
342670b573R57J285o38l5n05j043j2M34O14N29K27J98k403N79J330K329q79k781
$$ y = [1522, 1047, 767, 767, -1649, -3130, -208, 539, -1164, -2887, -2446, -35, -2305, -5234, -4623, -5681, -4557, -4113, -6750, -5914, -1324, 2181, 510, -1600, -3309, -2253, 314, 929, -994, -1583, -1277, -2779, -1690, -2086, -1002, -834, -1763, -4391, -4924, -7469, -7285, -5935, -4284, -5628, -6466, -5120, -2347, -3102, -5064, -4581, -5358, -3428, -2513, -3495, -3697, -3197, -2958, -3412, -4553, -3490, -1650, -3538, -3568, -1984, -1514, 1420, -1468, -3948, -4704, -5099, -1307, -960, -6822, -5643, -5976, -5061, -4566, -3559, -6972, -6876, -5668, -7813, -9436, -7575, -3067, -248, -1051, -4174, -5533, -3685, -4941, -4475, -3848, -5272, -4640, -6028, -4612, -622, -1038, -2204, -3772, -2986, -1901, -805, -2566, -1526, -2682, 657, 994, 69, -228, -4909, -2573, -1616, -331, -969, -1004, -1509, -2552, -2564, -2130, -1516, -987, -760, -562, -2965, -2386, -1056, 1273, 394, -2387]
344119b387K216K225O36p70j640k359k97o50K47Q63l36q28q18o17K298J587n98
345489a228J19k653k099J772j772L049K914j361k735J632N82o00o3j38K154R27
346778E00j289k591R80k030r22K153K621l225j024n64L858M271j092m89k91k094
348067a228r06J397N46O47O08k254l573o43J963J886n47k839N44K030p88j171
349355d328J452K87k255L81J916m40n7k285nQ24L837Mm65K382m43k553j082R3
350806b737J738k505m097J850K448M08J651J29K851j524l332l28J513L996j151
352014I10J087j192k769j698J598K67j210m73J260J034j069k67k236N03j083p97
353303f135L156J894l64Q94Q3l087k283J0J105j433r06K689l09K131j520m161
$$ y = [-2387, -171, 2054, 2690, 1920, 280, -2079, -2376, -3026, -2779, -1916, -2252, -3080, -3898, -4515, -2217, -630, -1228, -1109, -3762, -5861, -4089, -5861, -2812, 102, -1259, -3994, -2362, -1780, -2380, -2443, -2581, -427, 500, -789, -3380, -2400, -4430, -5352, -3199, -578, -3803, -4827, -5391, -1533, 2738, 1646, 1157, 866, -1228, -2134, -737, -191, 456, 1064, -1190, -4763, -5406, -3443, -1557, -2104, -4943, -4399, -2369, -3157, -4328, -2876, -2589, -4844, -4463, -2547, -2987, -3044, -5329, -5334, -4510, -673, -669, -1134, 1248, 805, -1748, -2830, -2737, -999, -3504, -7601, -5751, -3303, -2895, -1244, -1115, 1736, 212, -3120, -3448, -1935, 2061, 910, 1997, 805, -1964, -3662, -2064, -1797, -3007, -3480, -2220, -1186, -2255, -2522, -4758, -4255, -5338, -6135, -2979, -1085, -1449, -555, -472, -3559, -5842, -5832, -4727, -6160, -7066, -4377, -4686, -2555, -4075, -8236]
354591h236l50J902J072R01j057K084n66j675m74q92K259L368K042k625k372J130
355881c489L610j850l790k108r16L477L947q1k72K000J231k348p90l47m9J368
357169d07P99q49j50p03K811p91o32L30k564Q92m93j037K32m34J587J354Q58j785
358619i82j786O91k63j182Q82p66l085P83J744m85l32L702J53k130j215k417O48
359988f040K791J640K952J1m50j174O33m55n83l7m65j573Q44k459J489K078J235
361358D37j313K715K417k491j234p41k308r62k186j83K124L085N43j739O42k471
362647c665q96j195K454K162j176j482N84J61j160Q77L665K65l340k77j880K33
363936d670M32J273J63K325L59k712M65j812l262j245o80J847L704k98p88K737
$$ y = [-8236, -8586, -6684, -5612, -4711, -5768, -3684, -4250, -5925, -6399, -7291, -5032, -1664, 378, -2247, -4619, -3489, 121, -1729, -5519, -7627, -8543, -5066, -1119, -1200, -1472, 528, 1759, -589, -1379, -1726, -1775, -407, 392, -457, -607, -1310, 1501, 710, 78, 408, -2156, -1264, -1757, -2794, -2562, -2996, -1409, -55, 803, -982, -2768, -2077, -2340, -3522, -2640, -3406, -6491, -5708, -3964, -4449, -4781, -1079, -926, -3056, -4271, -6688, -6040, -3249, -1609, 1343, 1354, 904, -270, 363, -92, -675, -712, -1177, -2750, -1906, -4365, -2876, -798, 437, -876, 1839, 4256, 1765, 531, -210, -2518, -3480, -5666, -5849, -3725, -640, -97, -1836, -1194, -3665, -4561, -5756, -3302, -1140, -2316, -3798, -3214, -3053, -4213, -3336, 329, 594, -2746, -3023, -4903, -4670, -4238, -2965, -2802, -477, -118, -2830, -2365, -4177, -7439, -8684, -9364, -7517, -3813, -4111, -4899, -2162]
365224b162J855Q36j489K227l01l032l815J490M441j69j540J309N93j032l019
366433c808K062L95k072j73m41N93K101O49n04L61J930k088Q71K548L52j530P82
367802B028m291j490K079l73R50L35j882j467k80K120J065K30o2j377K86j338
369092c467L015j892R53J125k362k498LJ995L551k898J017k473J229L238J140
370299A676q61j456K26k496J800P91o42o30r98r25J766J607n8j387k902m23K179
371669b733L071j557j038J696J129j542j891J021J079N91k194J726J392r51j872
372877b073j784j397K652L00j223j191p46J265R60p49r62J143J634k066M70M82
374166c285n07k248j055L041K77n82J648r57N347Q42k7j416j269Q73P04j037j287
$$ y = [-2162, -307, 529, -960, 1267, 966, -2066, -5881, -4391, 50, -119, -1659, -350, 243, -789, -3808, -1746, -1351, -3423, -3596, -4037, -3444, -1343, -694, -1198, -837, 1093, -995, -124, 2424, 2776, 1246, 2028, -2263, -3753, -1674, -2047, -1097, -762, -2644, -4111, -4391, -2271, -1206, -976, -1038, -2415, -2129, -3467, -452, -2344, -1391, -266, -2628, -5126, -5123, -3128, 423, -2475, -1458, -3931, -2702, 536, 1676, 815, -641, -415, -2911, -1111, -320, -962, -1592, -2590, -3515, -1749, -142, -200, -1587, -4489, -4912, -2733, 338, -1219, -2257, -561, 568, -974, -2865, -1844, -765, -174, -2368, -642, 750, -201, -2073, -3857, -5254, -2602, -2302, -3525, -4716, -5462, -4197, -3237, -3986, -4948, -3805, -2171, -4237, -3767, -3285, -3792, -6040, -7095, -4054, -3777, -4359, -2711, -3668, 1679, 2521, 2494, 1078, -191, 682, 1386, 349, -938]
375535i38j016j826J719K475qK70O07p96j040J300k57k68l420L37Q52P6J186J607
376986H60J09l029j267J837q4j947J330K09P75J273k626Q97J299q02J563r67k64
378355h34j535J288n16M87l075J532J182m46k39M140k876p588L421J089J168l32
379644c134l007J215k84L585J028o10L887L13k197k569K83j435J08N5J521o88
380932a929l825j57k425J147K738q76J89K97n50K225J152M673L25k094k618J313
382222d15k208Q6K222J739l024r18K478J133r38j190J764r49j059K699J15j653
383510a18l510L143m7M05q35m52J380K721l565l154J434Q79p39K178l22j471j027
384880c100K186J307M27P8K86k755k131J109O23j261j856j756j93J405K038R67
$$ y = [-938, -1954, -3780, -2061, 414, 406, 676, 1283, 487, -553, 747, 490, 222, -3198, -2861, -2009, -1933, -747, 860, 969, -2060, -3327, -1490, -1574, -3521, -2191, -1982, -1207, 66, -2560, -1663, -364, -1166, 397, -570, -834, -2369, -1081, -1597, -1110, -4185, -2653, -1471, -1917, -2156, 1984, -892, -8480, -5059, -3970, -2802, -3134, -6141, -4926, -5210, -1625, -597, -1207, 2680, 2993, 796, -1773, -1490, -2925, -2817, -2762, -1241, -1929, -5754, -5911, -8336, -7189, -4451, -5327, -5138, -4841, -5391, -3166, -2014, 2659, 2984, 890, -1728, -415, -2623, -2537, -315, 1424, -1600, -2518, -40, 1093, 155, -1035, 729, -220, -1279, 1420, 1535, -118, -3628, -485, -532, -127, -962, -1414, -34, 2687, -878, -4032, -2598, -1719, -2458, -280, -602, -2073, -3100, -914, 393, 820, 898, 1184, -1571, -3702, -2593, -1970, -3231, -5087, -6843, -7036, -5631, -3593, -2626]
386168b626M82pR16J493m17M92o65j873j473J734J690j454j797K308j68L4J541
387538B10N62k341k611j0N604j880k228J007q15k68J767m03j856R53J353Q21p02
388907h37J77j864J6N57J275j405J254q03L87K263k090q54L12N64k92L04p64K119
390358C19P60j048q44q48P84M5K659j178M69k87j788j204r37m50R33N80r71L85
391807b621N53j69J6j10l569J358L29j164J134K499K91k289J691J140J192m188
393097c907k656l21J007r73L961O91j144L7k94j65J343j240P99J330m62J675J022
394466G03k762Q80k31K106m16K019k408M3K965K5Q95l805m054K246m56j062j132
395835d444O35J266J583L75o76j401N1j705K299J688j345K826L000j511l308j483
$$ y = [-2626, -2144, -2151, -1235, 258, -159, 333, -332, -2205, -3678, -1944, -254, -1708, -3505, -1197, -1365, -1331, 210, 772, -1569, -4180, -4190, 1414, -466, -2694, -1687, -2502, -2770, -1003, -1406, -3262, -2309, -956, -135, -837, -660, -2524, -2508, -1951, -676, -2081, -827, -1630, -1243, 1020, -1070, -1924, -1612, -1048, -1340, -1036, -1800, 319, 1079, 31, -813, -1661, -877, -832, 1827, 649, 1118, 831, -957, -2161, -3098, -3548, -2615, -2035, -3006, -2621, -2068, -2237, -2221, -2331, -5900, -4542, -4213, -5377, -4243, -1744, -1453, -3742, -2051, -911, 281, -3907, -6563, -6884, -5877, -6850, -2889, -2198, -3342, -3305, -3599, -3764, -2421, -3661, -2862, -1532, -1994, -319, 703, -2059, -1179, -1410, 696, 280, 2299, -109, -66, 2899, 2924, 3819, 14, -4040, -1794, -2250, -3312, -4444, -3809, -2543, -960, -585, -1261, -2662, -2611, -4316, -2017, -329, -1674, 1152, 4152, 2641, -667, -2150]
397124b150j542q7R27j107j901J990Q79L359j898p17r49J759o77m525J702K618
398413b319j721m58J111j916l29Q26J513J018l533j530M09J703J759J67j603K070
399702b833P16j004p75p24J354J531J198K174q65k26j305k89K557j032j953K388
400991I12J04n51j783m69J156j079n110J015j735j498J413L120j658J240L200
402200a723n56l15q99k520L371J931l80k205k557j869L374J827N13J658K93Q30
403488G73K043O8m081k54L21J660j782O7O81j887q14K045q06n72P66m0k638j305
404938e755J70K224J85l54K156j112j68P34j729P1J509j363J039j601k85j041
406227e320L65J876j636q86L992M087m4l673j911K909j719J005J41n92K47r05
$$ y = [-2150, -3692, -3779, -2852, -3959, -5860, -3870, -2991, 368, -1530, -2247, -3196, -1437, -2114, -6639, -4937, -2319, -4040, -4498, -3387, -5303, -5632, -4806, -3293, -2275, -5808, -7338, -6929, -5226, -3467, -3300, -4903, -2833, -2117, -3121, -3896, -4620, -3266, -1735, -537, 1637, 772, 546, -759, -1048, 1509, 477, -1476, 912, 1016, 465, -1318, -1787, -631, -1710, -6820, -5805, -7540, -9038, -7625, -4505, -6163, -4923, -1723, -2279, -2594, -3493, -6013, -2642, -711, -1091, -3296, -5853, -7722, -4348, -2521, -2008, -350, -57, 773, 2816, 2884, -1197, -1451, -1130, 530, -1252, -1185, -504, -2391, -3205, -1160, -1966, -2538, -1772, -1812, -4450, -5755, -5585, -3361, -3176, -3530, -1374, -2486, -2654, -1920, -3649, -3578, -2069, -3432, -2393, -3994, -4279, -5320, -4955, -3079, -4715, -5601, -1609, 2478, 2434, -1239, -3150, -241, -1960, -955, -814, -1406, -1159, -2064]
407516b064J746P9k532l542p80L199N63K602K880j096p09j256k039P01J971o40
408805i17J100p88n39j247J03j714j4R8K67n3n88N22M30q74J691M03j270L49j603
410335d644k63q85J752N91Q43J300N22q74J321j787j731j044L701K594q08L867
411624D455j759j518k303l348o27M364L610r66j829j051j844P07P31J340j193
412833a231j770M31k43K448J706P06n157q29j288j555L567J216r1N90j108N47
414121b061K072o56r16M289p25j3j525k379P08k074L45m59J205J591j511n60K777
415491A08J962j030k513n97J891O13J368J31l782R66o91l42R59J37k53o63k436
416860d172J655M464j484k732j722j363j054J148p25K227J358m12Q05j361L479
$$ y = [-2064, -318, -239, -2771, -6313, -7093, -3894, -3331, -729, 2151, 1055, 346, -910, -2949, -2248, -277, -917, 183, -605, -1144, -2391, -2288, -4002, -4016, -3918, -3651, -3704, -4292, -3770, -3340, -4214, -2523, -2120, -3390, -3041, -4644, -4907, -5792, -4040, -3449, -2606, -1306, -784, -1658, -337, -2124, -3855, -4899, -1198, 1396, 588, 4455, 2696, 1178, -1125, -4473, -5100, -736, 2874, 1908, 79, -972, -2816, -2109, -1378, -38, -1231, -3001, -2570, -2813, -365, 1341, 2047, -3110, -3939, -5227, -6782, -3215, -1999, -2090, -1500, -2608, -2061, 11, -645, -1561, 2728, 2003, 1990, 465, -1914, -1206, -3280, -2935, -3394, -2189, -598, -2109, -2669, 108, 2070, 1040, -1473, -2070, -179, 434, 1802, 1933, -1849, -883, -1574, -1916, -957, -820, -1073, -1736, -4172, -2517, 1947, 463, -2269, -3991, -5354, -6408, -5260, -5985, -3758, -2400, -2812, -2007, -3368, 111]
418069A11L765j452m475K172K602j603R94j555j264n15l82k797q06K597K30J319
419357a059k28k05k188J388m33J187N89j184j101q34J967j82j970J055R37l29
420647b590Q19K311m89j088J228K178j664r25J868j426k413o59O6R96j675J851
421935a612J306j439j940K15j182k223J309M397Q29k797m31J217L7k679L01J745
423223b947j486M34r74K207K407j62p30j881M683o59l667k014L357K72k956k39
424513d355J603J710j796J148r31K265l34l263O21m45J020J215j973J161J654
425721g00j277j995O32q10J808k327k38L510l16J969J043k100r88q36j354R88
427010b991r68P54j136L701J863j432k026P63K07l368m497J841N703k25k87L92
$$ y = [111, 3876, 2424, -2051, 121, 2723, 1120, 2114, 559, -705, -1220, -1602, -4399, -5205, -2608, -2378, -1059, -1287, -1492, -3680, -2292, -2725, -1538, -949, -2133, -3234, -4068, -2101, -2283, -4253, -3198, -2261, -2590, -1771, 540, 51, -1037, 191, 2369, 705, -220, 1648, 222, -2191, -2850, -2784, -1788, -3463, -1612, -306, -1745, -3685, -3470, -4652, -6875, -5566, -1169, -340, -3137, -3568, -2351, -2314, -4993, -4692, -2947, -4433, -3999, -4973, -2766, -359, -521, -1251, -3132, 1551, 892, -2775, -4789, -1432, -1160, -4116, -4355, -2752, -1042, -2838, -1690, -2621, -356, -690, -3953, -3332, -3777, -2757, -1542, -3515, -2354, -700, -1977, -3972, -3340, -4150, -2342, -4669, -4907, -1397, -1713, 256, 1299, -801, -1789, -2625, -3979, -2991, -3959, -3205, -4341, -640, 1223, -209, -2235, -1472, -1265, -4633, -9130, -7289, -1586, -1811, -2098, -1706]
428298a706O91J097J683O73n83p06j278j398L52k902p3o9J820K275r57l313K302
429668b092k168j407K120L671q63O03j322l384M58J710p75p12l94M302j164j360
430957b777q34j595j312K171J973j717R25O8K73K626k33l431j36J08k050j134
432246g075J19M537j033m24K253J68J11m91j435M057k065J372q66M00L1k241R54
433616a628K094j631j892P74L282K426j35l629k267j032L64J283j045O10r48p76
434904d150J295M61N01J71L46L90J04p59J677j137k980K77J732o30N84K011j147
436273a254j96n528K95J185o09N614K84l653O66r67J747O01q30k318O15k05p4
437643d627L494j44N26k19j07j691J440R13k081j004L68Q76J568j140m90L785
$$ y = [-1706, -1015, 82, 1765, 2438, 1855, 1149, -129, -1527, -1175, -4077, -4150, -4219, -2399, -124, -1081, -4394, -2092, -4260, -5667, -3547, 124, -739, -136, -1458, -4842, -4384, -2674, -3449, -4161, -4555, -253, -1417, -2777, -3611, -5206, -6518, -4347, -2374, -4091, -3166, -3098, -2825, -199, -432, -3863, -3999, -3891, -5941, -7075, -6956, -2419, -3452, -3876, -1623, -1455, -1344, -1835, -3270, 787, -1278, 94, -772, -372, -341, -2582, -1628, 466, -1165, -3057, -2283, 999, 3425, 3290, -339, -2606, -3638, -3274, -1991, -3036, -2426, -3374, -4150, -2855, -2394, -1893, -1722, -1376, -986, -882, -1641, 36, -1101, -4081, -3804, -2072, -2702, -2118, -107, -1254, -1450, -6978, -6683, -5498, -6107, -493, -209, -3862, -3196, -4163, -2416, -1815, -2645, -4963, -4348, -4553, -4627, -1133, -1277, -751, -970, -1077, -2768, -1328, -415, -2496, -3500, -3132, -2256, -688, -1828, -2318, 1467]
438932A467K603k59l260j279R28o62j501R48O20j73n10N39J88l161j891M058j210
440301b555j300R93q70J754K494k413j490J210N08J455J477J20o88N07j086n97
441590d81k205K024J105L476L93n204o65J478p35j113J713K840J345m638j996
442798b663K203P48J488k640k884j709Q46P90j647O83j435L290l6j860J906P17
444088b203J682l272K46N96J090J17l554o45K147J044J260j512j886J101O60j63
445376c292J640j272j292m95K249p29j513k395K233L481K572k813m014j245N31
446585f354L33J444J004q03K193K158j101r37m72r81K554p45P92l536l609J232
447874f828P41L25J639J860q25J729J297q58L210Q00j7j163l107L700j850k433
$$ y = [1467, 4070, 3811, 551, -728, 200, -462, -1963, -1015, -395, -568, -1078, -539, -351, -3512, -5403, -1345, -2555, -3855, -2862, -3732, -1978, 516, -1897, -3387, -2177, -1669, -214, 1263, 1383, 695, 1202, 116, -481, -2686, -662, 443, 3919, 4312, -892, -1557, -79, -814, -1927, -214, 2626, 3971, -667, -2663, -460, 288, 1776, -864, -3748, -5457, -4611, -3821, -5468, -4785, -6220, -2930, -2966, -4826, -2920, -2203, -521, -3793, -3547, -2951, -1861, -1744, -5298, -5943, -3796, -2752, -1492, -3004, -4890, -3789, -3129, -3292, -1652, -2924, -4216, -4711, -2462, -3191, -4704, -7099, -4866, -1385, 1187, -1626, -5640, -6885, -6354, -6021, -4577, -3573, -4376, -2183, -25, -1126, -2063, -2535, -3516, -962, -1707, -915, -4451, -8060, -6828, -6087, -5762, -4123, -2263, -3088, -1359, -62, -920, 2290, 3090, 3073, 1910, -1197, 2503, 653, -1780]
449162a780j497J58L417j319o01Q15k066p16j788j513J956L079k844j921L465
450371c155J699j391L31OK70J287Q37r71o84J304o92n324R05J251J453P25p00
451740b849J407R40o69p06J474M67K8J246o82j185l027j672j09j64M83L456J161
453110d01j481j211Q67J52k285j36K180J118j356p98L937J962q26k368K22l119
454398c543j110K984l911k276L124L905N99R66K37j840k078j639K023N08j309
455607c360L80K265j16l85J608j666K82j765J833K72k871q45L469L1j069j86O54
456976a469j076K0O1q32J142R34m68j99K41j068k91j52j379J864J50K5K376p42
458426h63O64k18o99n32n31J728L72j950P05K988j883k161k05K603j666k805N24
$$ y = [-1780, -3277, -3119, 298, -1021, -1622, -807, -2873, -3589, -5377, -6890, -4934, -1855, -4699, -6620, -3155, -1456, -2847, -2516, -2510, -2240, -953, -116, -1087, -1771, -467, -1159, -6483, -5578, -4327, -2874, -2149, -2849, -1442, -502, -1171, -1877, -403, 64, 92, 1338, 656, -529, -3556, -5228, -5337, -5501, -5018, -1562, -401, -1882, -3093, -2226, -2074, -4359, -4495, -2315, -1197, -2553, -3351, 586, 2548, 1722, -646, -424, -3543, -4653, -1669, -5580, -7856, -4732, -827, -228, 738, 975, -865, -2943, -4582, -2559, -2051, -3360, -2980, -715, -831, -1216, 392, -1274, -992, -2757, -924, -652, -3523, -4368, -899, -868, -1937, -2123, -1469, -2545, -2525, -2464, -3296, -2154, -1220, -1688, -1887, -1646, -2714, -3005, -3157, -4536, -2672, -2522, -2497, -121, -863, -199, -417, -1116, -1648, -2179, -451, -79, -2029, -1324, 1664, -219, -2380, -2585, 18, -1648, -4453, -3929]
459795c929K281M9r24o02m14J282L177k380m980J564K623J144k466K226j448l623
461084f420o68J94K480K072l09K210m26P25j503R46J854r36j498r32M86q14j03
462454b642L897Q80j342j930j209l25J072J75l6m91J029n23n01j095j542J59K539
463823a885J875j657J946J162k653q84J153J453P91o78J296K7k545k133K448L06
465112B2M6k24J022j175k21r19J999P3Q05p02m072K42L07J028j997O24L491O45
466562I94m675p48J528k277L568J407L01K63O69o03m6j128J200K29j138k200j557
467932d213n76k468K953k70K59J05J6K108K929k258j310L20j057q31K163J392
469220g38m27j463J468j630k559j288N89K912J925K009o40j690n05N87l054j241
$$ y = [-3929, -1648, -1599, -2523, -3125, -3539, -2257, 920, -1460, -6440, -4876, -2253, -1109, -3575, -1349, -2797, -6420, -7088, -6894, -4414, -2342, -2651, -441, -867, -142, -1645, -699, 1155, 219, -1279, -2211, -1725, -2539, -2642, 1255, 2135, 793, -1137, -2346, -2671, -1599, -1424, -1460, -1951, -922, -1445, -1946, -3041, -4583, -4424, -1885, -10, -1667, 279, 1441, -1212, -2096, -943, 510, 1301, 623, 1919, 1946, -599, -2732, -284, 22, 68, -156, 866, -309, -530, -1449, 550, 623, 1428, 726, -3346, -3104, -2797, -1769, -3766, -3142, 349, 994, -3681, -4429, -2901, -5178, -1610, -203, 98, 361, 1030, 427, 381, -747, 453, 682, -456, -2656, -4213, -4789, -7257, -4304, -4574, -4315, -4210, -4194, -2086, 843, -1415, -2725, -2405, -3462, -4293, -2130, -738, -1165, -2628, -1160, -2790, -5349, -6637, -6048, -3136, -1211, 798, 158, -1532, -2037, -1450, -4504, -5745]
470510e745K15L954j89o53q6j276Q40N29N10N96K366j306q32J770j357L62j079
471878a381o64k355n82J424j16j395j50J394k45k793k89K696L337j272q18M56
473168b753J054J609N17J867j275l485k314K451K858O76k556j546r3j884l30k57
474456e461K62R32N03j78J40J259R4j180Q81R47J79k211P91j056K45J606l11r06
475907c464M47M69q96J003P53k69k327j649N71L71K885K176j301j272J00O83J833
477276A13m69j662n52k255J709J996j276j42j189J642j976k86L13K132N29n20
478565a893O84l88l184o65J162J024L990m58j452k244k99K17K434J312K189j815
479853F14j954k227J084k401O37J919q05r73K518J750k230j478J255J35K069j45
$$ y = [-5745, -5530, -1576, -1765, -2418, -2504, -3780, -2940, -2411, -1901, -1305, 1061, -245, -1077, 693, -664, -302, -1381, -2045, -4400, -4982, -3558, -3674, -5069, -5219, -3825, -4070, -6863, -7152, -4456, -1119, -2391, -3209, -2753, -1699, -90, 427, 2294, 1019, -2466, -4780, -2329, 529, 1205, -1351, -2897, -2990, -4874, -5204, -5461, -5199, -4267, -3764, -3942, -3802, -2543, -2449, -3629, -2748, -1801, -1622, -3833, -3042, -4098, -3853, -2247, -2558, -3464, -3017, -2548, -3444, -2441, -1688, -1957, -4284, -5933, -5362, -4991, -2106, 70, -1231, -2503, -2403, -1720, 113, -356, -2018, -2570, -4825, -3116, -1120, -2396, -2538, -3727, -2085, -4061, -4347, -4034, -1902, -1373, -1893, -1209, -1597, -4781, -5446, -4284, -3260, 730, 272, -1180, -3424, -3723, -3506, -1072, 240, 2429, 614, -1340, -3567, -2483, -4884, -4247, -2328, -3133, -4106, -1588, 162, -2068, -3546, -2291, -2156, -87, -232]
481143b32L37n99j784O87K29J896K522M50j715k490j077j42M18K622j293j50O26
482512C05j258P02l0p99Q9j442J937J354l060l68K479K434J394j559k147j342
483801a311J272k577j851J512q41O62L69L066j055j467m17q08Q45K905p79p55
485089a230R30K659p82q70r34j924j177j130K82R22o11K102J383j312o8j249l05
486459c314J130j565J210k15Q06L47j707k519k450L167M38Q82L053K407Q43k464
487748D9j157j595n96k511O00L670m26k617N32j157r57J022K963k464l858R25
489037g577J764J265K895J129M86M06k8l390k75M82J331j542l32j831N27K664
490325b026K794j973j554N64j814k914K549J862J622j477n53J031J600j05k277
$$ y = [-232, 105, -494, -2278, -1591, -1362, 534, 3056, 3506, 1791, -699, -1776, -1918, -1500, 1122, -171, -321, 305, -953, -251, -281, -1080, -991, -2433, -496, 858, -2202, -2570, -91, 2343, 3737, 2178, 31, -1311, -39, -2616, -4467, -2955, -3796, -3134, -2765, 301, -754, -2221, -2638, -3446, -2601, 304, -475, -1230, -300, 2359, 1577, 707, -227, -2151, -3328, -4458, -4176, -3254, -3865, -1763, -380, -1692, -1760, -3009, -3314, -2184, -3749, -2539, -2754, -1948, -1601, -3308, -5827, -8277, -5110, -4672, -3790, -737, 1670, 2513, 49, -1108, -2703, -3299, -5810, -5210, -1540, -1966, -4583, -4051, -5208, -6165, -5143, -2180, -4644, -8502, -7577, -5813, -4548, -1653, -524, -38, 368, 340, -3050, -3325, -2843, -1512, -3054, -3386, -5217, -4690, -2026, 768, -1205, -2759, -2195, -4009, -6923, -4374, -2512, -890, -2367, -2920, -1889, -289, -394, -2671]
491534b671J606J717j68j771J342l72j223M79m800k158J886R27L97J79J456j601
492823d775j963K88J95K482J865j004n83l60M43M23N10p34n54J770K010j600l944
494192e531j494N13j38J01J025O59K146k442j110O31m9J793R21Q09J394o75K01
495561a246K206j74j573q23j914j159L377n92k080l91K536Q72j818J701J697j23
496851D96K27j692j873J877m00J051k464L09O55J883j074l85N90j970k80J473
498139a577m355o20J804J675l913q4R20J677o04J390J099K144J037P95j899q45
499428a356j685M13n06l19J407Q06o46q5j373L368K301j787m345N81L139K437
500717B350j720m52N81L38J422j259k966P76J633j603k374K299k20q54l572M251
$$ y = [-2671, -1065, 652, 484, -1287, 55, -317, -1540, -1061, -5861, -8019, -6133, -5206, -4809, -4630, -3174, -4775, -6738, -6450, -6255, -3773, -1908, -2912, -3495, -3855, -3412, -2989, -2479, -3213, -3767, -1997, 13, -1587, -5531, -7025, -6512, -6650, -6549, -5524, -4865, -2719, -5161, -6271, -5640, -5689, -3896, -2975, -2166, -772, -1447, -1246, 960, 786, -787, -1610, -3524, -4683, -1306, -1898, -3978, -4369, -1833, -961, -2779, -1078, 619, 496, 723, -969, -2842, -965, -1365, -314, -2778, -2469, -1814, 69, -1005, -1390, -800, -2770, -3050, -1577, -5932, -6552, -4748, -3073, -6986, -7070, -6150, -4473, -5077, -3687, -2588, -444, 593, 1388, -511, -1356, -3041, -2628, -3134, -3453, -2046, -1240, -1886, -1971, -3344, 24, 2325, 538, -3807, -3226, -87, 2350, 630, 178, 759, 1097, 2519, 1260, -1706, -930, 703, -900, -3274, -975, -1195, -2049, -5621, -1370]
502006a370m97J902j768q00J034J853l721q20o84J123J245K15k07j454N21j53
503295c581r64Q4J978K56L57q99k456m06K254J846m1J406J726m170o65O81J301
504664a293k209R16P74J50n03l63M51j663K018j397J022k235J711l83J798j601
505953b807j642r18K227P00L6o47Q84n18J26L04k950J578J147K243j735J502o41
507323a111k523k126q47K057L439J614n70j390k843j521Q63J56K280n63k306J539
508611c852K261j141K0J649j93j040j026L27j034k379J832L475K424m318N92K727
509900C24j072l992l927J606L425N18k225k484m01L222M31J147K248k732j50N88
511189c474J755j403J25L673j688k942k112K574J753k326N37N405q23r26l02k232
$$ y = [-1370, -1867, 35, -1733, -2533, -1499, 354, -3367, -4187, -4871, -3748, -2503, -2288, -2495, -3949, -3428, -3581, -4545, -4461, -2483, -2227, -1870, -2769, -5225, -5631, -3377, -1531, -1572, -166, 1560, -2610, -3275, -2594, -1293, -3502, -2586, -1812, -1662, -2165, -2528, -2077, -3740, -1722, -3119, -2097, -4332, -2621, -3004, -1206, -2807, -4449, -5367, -3140, -2440, -2404, -3051, -2167, -2685, -2559, -2255, -5205, -3627, -2480, -237, -1972, -470, -1111, -3634, -5760, -6607, -4550, -1111, 503, -67, -1457, -4300, -5821, -4958, -4802, -2522, -3085, -5391, -3852, -1591, -2732, -2712, -1063, -1256, -2296, -3322, -2995, -4029, -6408, -4576, -1101, 1323, -2995, -2403, 324, -748, -4740, -8667, -7061, -3636, -3118, -5343, -7827, -8228, -5006, -4575, -3428, -1180, -3912, -4062, -3474, -1719, -3122, -2997, 676, -1012, -3954, -6066, -3492, -1739, -4065, -3528, 1877, 1054, 128, -174, -2406]
512478b406n37o19L36K218N47l583j884R96j537K487L956k049l681L7k67L480
513767b506O29k544q84N08L272R98l101k373K487J234k388m842j179N500L620
514976a569l701J5M665k143n072k46l64j93J0M85J461L005K468l93r86j717J014
516344c261j30K12n31Q28m10M52J368j748p43J02p63K257Q46K868n80l735q28
517714c796K735J733J696j629m21J725j051k301K010J243m405k707P97L40j417
518922e448k021J794L089J582N52Q23K268N40m278k519k57p32L518M89k839k132
520212e571J360K481O45L153R43k948j386J928N08Q37q5j463J539N05J51j294
521500A303K256Q79l148m179J714l22o10k669q5K079K090j845j248O89K432o5
$$ y = [-2406, -2943, -3562, -3226, -1008, -461, -4044, -5928, -4932, -6469, -3982, -26, -2075, -5756, -5719, -5986, -2506, -1877, -4421, -5305, -4797, -1525, -527, -3628, -6001, -3514, -2280, -4668, -9510, -10689, -5189, -1569, -5270, -5255, -590, -2733, -7805, -8051, -8415, -8608, -8598, -8113, -6652, -3647, -1179, -1572, -2558, -4275, -3261, -3391, -3179, -3710, -2882, -3292, -2840, -1472, -3220, -3963, -3861, -4624, -2367, -1521, 1347, 767, -2968, -3796, -1061, 672, 2368, 739, 318, 2043, 992, -1309, 701, 1944, -2461, -5168, -4371, -4031, -5448, -7469, -5675, -2586, -1004, -452, 371, 2639, 3179, -1099, -3618, -3875, -4607, -1089, -600, -3439, -5571, -4211, -1730, -1085, 2068, 3011, 63, -1323, 605, 1113, 1950, 1865, 402, 1941, 2446, 2597, 1303, 3559, 4438, 1290, -2889, -1175, -1497, -2107, -4776, -4861, -2782, -692, -2537, -3785, -3096, -664, -729]
522788g29j259k331J455j183k079K155J461l47L39l558L01O54m24P88K144O13
524078b000M08j84k470J460J314K849r13k404k525L566J668l415K61Q09R71p28
525367a333o29k005k79Q11K907j97m256k364J931L380J022J868M66K64J302k996
526655a08k284j22m4k833j169K530K55P0o20k093L936O58j244n31L531P60k608
528025a916k920q9j572O60L82K361K441j664j459M670j207m89J021K53K418j242
529314A648k331N72n68K50K366q75m043l15l08J116K146n77J353M36j432r01J729
530684B66L837P19j409q05N18k164O50j179j336k325j429J311o66k178j580L876
531972c894K389M08J600l57L29o3J257m617j612J788q71k163M467o89n73j159
$$ y = [-729, -1988, -4319, -2864, -4047, -6126, -3971, -2510, -2857, -2518, -6076, -5775, -5121, -5545, -4757, -2613, -2000, -1592, -1776, -4246, -2786, -1472, 1377, 464, -1940, -4465, -899, 769, -2646, -2385, -1576, -605, -1333, -1962, -3967, -4246, -3435, -528, -725, -4981, -7345, -5414, -2034, -1012, 856, 1322, 1586, 2888, -108, -2392, -2514, -2558, -5391, -6560, -4030, -3775, -3705, -4325, -6418, -2482, -1824, -3068, -3599, -68, 692, -1916, -4836, -4925, -6497, -5837, -5455, -3094, -653, -2317, -3776, 894, -313, -802, 219, 472, 2890, 1648, -683, -111, -679, -429, 1937, 1062, -2981, -3296, -3604, -2488, -342, -919, 434, 870, -562, -1463, 266, 4103, 4822, 3413, 2608, 3126, 962, 1612, 433, -903, -3228, -4657, -3346, -4012, -6190, -7770, -3894, -1505, -1097, 503, 146, 475, 412, 1669, -2948, -4560, -2772, -3643, -5806, -1339, -2028, -2601, -3760]
533261c760o11J526J308k283Q59L622M51j111j300j570m93M5J228j13N3j228k157
534630e534l311J30M894N935j36j221K844j557j257q74R3M64j893J5J007K65j617
536000a753L584j48l049n72O7o94J096J923J218k20k736k373J344q28J19r52P49
537369c225J094J346o39k88J69l28l07P7K539O07j039j2l571n02J267l27j966
538739e105L92K555J317k99k058Q59j876k341M023J106J108m72Q21r50l444j04
540027d468j493K610J056J66M07K692r12l637k021l85J511j194K189k096k740
541236h315n99J242M305L318l788k156j107K257J645K421J061J291k552q41J334
542444d84j502m10q86M07j218j580K100J304Q52J15J138L88n31n60r70J991j795
$$ y = [-3760, -4371, -2845, -1537, -3820, -2961, 661, 1112, 1, -1299, -2869, -3362, -3317, -2089, -2202, -2149, -3377, -5534, -8845, -8715, -3821, 2114, 1978, 757, 3601, 2044, 787, -87, 6, 470, -1423, -1408, -401, -136, -1753, 1831, 1683, -1366, -1938, -1871, -2565, -1469, 454, 1672, 1452, -1284, -3657, -2313, -3141, -3022, -3974, -3225, -2131, -785, -1424, -1712, -1543, -1871, -2178, -2101, 438, 1045, 6, -6, -3577, -4079, -2812, -3139, -5105, -4713, -2158, -841, -1140, -3198, -2339, -4215, -6556, -2533, -1427, -319, -791, 30, -920, -4364, -4468, -5961, -3351, -2295, -2129, -1722, 970, 58, -3579, -5600, -5985, -4474, -5668, -3479, -5575, -8315, -8914, -7672, -3367, -49, -3837, -5993, -7100, -4843, -3198, -777, 284, 1575, -977, -1818, -484, -1986, -2396, -3282, -2875, -4093, -5673, -3573, -2269, -1417, -1302, -164, 224, -307, -867, -1837, 154, -1641]
543814a641j837K186J67K561K3K984j070l139j436J820j644m363m99L986p00L484
545102H82R23q49j253o10J730k84k311o84Q45k28N57j499n57p67k731J37J990
546472d709J710L117K790j846q80J96O53j601j444N78j77j495L475K141l817j410
547761b719L97n95k057O0J830k56j290K705K152j575J563J612j392l843m21J42
549050c687J323P06J382m637K20L001J955J084K34n93k086l665J557R85l256m93
550338e970J748L524k24j040K633K773J691j925j590p89j361k041M62k68K080
551547b97r60l150l015n8L260n51O59L783K364R1j701m145o40l88N27n2J780j402
552997c895o58j155L78J917N62r08J631j504k88J582J989q35P57R85N27K572j819
$$ y = [-1641, -3478, -1292, -1125, 1436, 1459, 4443, 3373, 234, -1202, 618, -1026, -5389, -5888, -1902, -2602, 882, 1805, 956, -297, -907, 823, 539, -1772, -2456, -1611, -1839, -1282, -2781, -3338, -4105, -6836, -6699, -4709, -2999, 118, 2908, 1062, 182, 378, 1031, -570, -2014, -1436, -1613, -3108, 367, 2508, -1309, -2719, -2322, -2917, -4974, -4914, -3084, -3340, -4630, -1925, 227, -1348, 215, 1827, 435, -3408, -3829, -3687, -2364, -1658, -276, -4913, -4693, -1692, 263, 1347, 1581, 988, -1098, -4763, -3206, -2221, -5477, -5970, -4222, -698, -922, -1962, 671, 3444, 5135, 3210, 1620, 831, -530, -2571, -2109, -2377, -297, -1257, -4407, -7422, -7480, -4220, -4771, -4112, -329, 2035, 2126, 425, -3720, -4360, -4748, -4221, -4273, -2493, -3895, -4553, -5708, -5330, -3413, -2851, -3759, -2128, -3632, -3920, -2338, -349, -1184, -427, 558, 1085, 3657, 1838]
554366A838k239n28O05L149q15k227J978l77k145j653K320j320l34k28k778N21
555655d233L84L12J691j601p75K392L93J844J686j117k017j083j873J641K067
556864b89L59p6j896J165J029o31l33j415k562K331L79J69K13k73l197J797M96
558233b734l066K34k5L123o89j591k471p6j097K105L357j140r93J119l42L340
559522i46M04J348j83j986j677j710j263r02J708K795J085K021o87k129K441q98
560810e79L70m030k370M2J339L109Q8k911l426J233K743Q28J670o88K456J189
562100A063j905l515K848J263J490O22L966r08n855j220l70L75L863k102m827
563308e212p71L706K278R03k941j170j213K755K191j400j322K309k622J860K080
$$ y = [1838, -401, -929, -324, 2825, 2010, -217, 1761, 1384, -761, -2414, -94, -1414, -1748, -1976, -4754, -4233, -3849, -3537, -1846, -3447, -4222, -1830, -1437, 407, 2093, 976, -1041, -2124, -3997, -2356, -289, 70, -6, -1902, -737, 292, -339, -672, -2087, -4649, -2318, -1939, -1770, -1557, -1830, -5027, -3230, -2734, -5800, -5566, -5591, -2468, -3157, -4748, -7219, -7295, -8392, -6287, -2930, -4070, -5063, -3944, -4286, -946, -542, 806, 623, -1363, -3040, -4750, -6013, -6915, -5207, -2412, -1327, 694, 7, -2122, 319, -579, -209, -4239, -6609, -6567, -5228, -2119, -2031, -4942, -8368, -7135, -4392, -3564, -1894, -2582, -126, 1063, -842, -4357, -1509, -246, 1244, 1866, 5832, 4924, -931, -2151, -2521, -2146, 1717, -385, -5212, -5983, -2277, 1, 904, -2037, -3207, -4420, -1665, 526, -874, -2196, 113, -2509, -649, 1431]
564516A431J523k327l509j824K691K226k391j491J918J43r16j326L10J305J499
565724g38m32K506P69k678l919k364J060J351J64k53p47L229j068m193k22M73
567013g062L496J490n41j345o27J48m90O77m91K358Q91m30j820j00p70J991k76
568382b901j31J191j93p94m59k480J085L248M98K114k242n2K008K561R21j686
569671B688n454l664m9k198k8L187J204J85J037n06o06J474K613k456Q1J676j535
571041b351l776N25J845J220n34o0K308J572L17k868l655K173J904J184R52n94
572330A62O0k643K323m23j159l14J874j2p80j396j66p32N23K203o66p82J075n42
573780a395J252k169J41j403K831K858k767k773p32j254P56K445R54l614j615
$$ y = [1431, 2954, 627, -2882, -4706, -2015, 211, -2180, -3671, -1753, -1610, -2526, -3852, -3542, -2237, -738, -1170, 1336, 2105, -573, -4492, -6856, -5796, -4445, -4281, -4534, -5281, -2052, -3120, -7313, -7535, -7062, -3566, -2076, -2617, -3962, -4589, -4441, -4931, -4254, -4745, -2387, -1496, -1926, -3746, -3846, -4616, -2625, -2901, -3032, -1841, -2034, -2828, -3287, -5767, -4682, -1434, -936, 1178, -1064, -1116, 892, 3453, 4374, 2688, -2766, -6430, -6479, -8677, -8705, -5518, -4314, -4129, -3092, -3598, -4204, -2730, -117, -2573, -2492, -816, -2351, -6127, -5602, -3757, -2537, -3071, -3131, -823, 749, 1066, -1802, -5457, -3284, -1380, -196, 756, 162, 222, -2421, -98, -521, -1680, -1994, -120, -132, -912, -2308, -2474, -3206, -2683, -480, -1146, -1928, -853, -1395, -143, -2312, -2171, -3574, -743, 2115, -652, -3425, -4157, -5411, -4655, -2210, -1256, -4870, -6485]
574988f485J842J195R83N06M75o5q62J48K130j63j76l08Q44j219o16J533p79n33
576438a550J076O44q05J315j483j184j669N537J001j991o36k411o13j807L68K091
577727b117l15n44k216N71K433K825J620j814l5J215J82j30rk73l103j200K203
579096g07J445j107j656q06j268L15L106p63j882O04J327o04k068P66J071J834
580385c93l309o37K831R56K754J187k619m816J177J094o41l19J249J65j190J081
581674a430J473o81j222N79p06r53K394K73L02j952j16L19j437k012L151L81j377
583044c014K297J214j023j671m36j30Q21j063q05N35o3m21j590j445q43J206J817
584413d614q37j143J517K509J871j984j44Q89n15j724j363K374k85P16j26K710
$$ y = [-6485, -4643, -3448, -2465, -1959, -1484, -1549, -2411, -2263, -133, -296, -472, -780, 64, -1155, -1771, -238, -1017, -1550, -474, 170, -635, 680, -803, -1987, -3656, 1881, 2882, 891, 255, -2156, -2769, -4576, -4208, -2117, -2432, -2976, -5192, -4621, -2188, 637, 2257, 443, 408, 1623, 1805, 1675, 1666, 1393, -1710, -2910, -707, 738, -369, -2025, -2831, -4099, -3784, -678, -1441, -3323, -2719, -1392, -1996, -4064, -3298, -2227, -393, -3702, -4339, -1508, -552, 2202, 3389, 770, -4046, -2869, -1775, -2416, -2735, -1486, -1321, -2511, -1430, 43, -638, -1860, -1281, -1987, -2940, -546, -273, 29, -1923, -2039, -1720, -3157, -5169, -2018, -1637, -3014, -717, 497, -526, -2197, -2633, -2763, -1942, -3005, -3810, -3275, -3338, -3759, -5349, -6794, -7637, -6431, -4614, -5451, -6594, -5077, -2568, -697, -2681, -2825, -1936, -2451, -4175, -5538, -3164, -3449, -2733, -2859, -149]
585702a49n42n9J007j424Q01K986k98k281k437M21O33o19p94m06Q21P5q80j652
587151d797K356K50j640J530m07l571p97J644J989N41j61J882o51j481j114n64
588441d991J477K75l74k631N24j743o14J88L736Q64k24N29J150K237K38k213k962
589810d534P33O49K643J621p62j522J21k521J536L90L90k624j821L010L050J541
591099A900j064j089m011K15K09K049l42k103n80J039k757L607L310M312m229
592307D66k706M14K13J217J095J35P3k000L65l95n07j855j220J094K484L180j494
593677E59j649j732O95J469J55j821j441J507K269j694j385J40J459K814J30n296
594965c821k452K733l96k10M041P4l249J663K517J743l668k363j260p67J54Q82
$$ y = [-149, -691, -750, 257, -1167, -366, 2620, 2322, 41, -2396, -1975, -1342, -1961, -2755, -3161, -2340, -2265, -3145, -4797, -2441, -2191, -3831, -2301, -2708, -6279, -7076, -5432, -3443, -2902, -3063, -1181, -1832, -3313, -4427, -4991, -3514, -3239, -3613, -6244, -5720, -7463, -8077, -7889, -4153, -3289, -3513, -2984, -1834, 403, 641, -1572, -4534, -3801, -3152, -509, 1112, 350, -1172, -1051, -3572, -2036, -1646, -1256, -3880, -5701, -2691, 359, 1900, 836, -253, -4264, -4049, -3840, -1791, -2133, -4236, -4816, -3777, -6534, -2927, 383, 4695, 466, -2240, -1826, -1613, -396, 699, 834, 907, -1093, -728, -1123, -1630, -3485, -4705, -3611, -1127, 2053, 559, -1090, -2822, -2127, -658, -503, -2324, -3765, -2258, 11, -1683, -3068, -2928, -1469, 1345, 1475, -3821, -6273, -3540, -3936, -4146, -105, -31, -3280, -1617, 900, 2643, -1025, -3388, -4648, -5415, -5261, -4379]
596255d379J730J438k120k012J504L020k127j592N09K338J949l05l17k455r5J168
597543a746r09L57K113j518k97k457l75n10P17K70q16M40J995J727J064l477j61
598913c583j85J647LJ317J209p00L61k15l44m53K139k274j673K82o07J197j686
600282c565J713R99J491L19K290j2j106j645m574j02J17K437j083k563l37k3k74
601652e918J086k715j265M474L586Q75j530j81r68j918k054J826K036L15n3j102
602940c506M61R67J442n73k926j144L40M59K097P68j35J742m36R66J406j141j445
604310f58J09k310j659J23K166k268j058K775O98O10J491L040k902k639p52k551
605598e785j385m73L190J720K271k163k917O11K291P80J301J051J44k441k465
$$ y = [-4379, -2649, -1211, -3331, -5343, -3839, -819, -2946, -4538, -4029, -1691, 258, -47, -364, -2819, -2914, -1746, -2655, -2298, -185, -1703, -2000, -4457, -4832, -5342, -4625, -4355, -5171, -4731, -2736, -1009, 55, -3422, -3583, -3768, -2121, -2118, -801, 408, -292, 69, -146, -490, -943, 1196, -1078, -2751, -2469, -3076, -1879, -3565, -1852, -853, 638, 957, 3247, 3235, 2129, 484, -4090, -4192, -4075, -1638, -2721, -5284, -5621, -5644, -5918, -4832, -7547, -8812, -4338, -752, 123, -1407, -1588, -2556, -4474, -6528, -4702, -2666, -2351, -2404, -3506, -3045, -2078, -636, -1209, -4135, -5279, -4939, -4480, -2383, -1615, -1750, -8, -444, 522, 1928, 787, -658, -549, -2859, -4518, -4395, -2229, -4497, -5555, -2780, -2082, -1472, 19, 3059, 157, -2482, -3234, -5785, -7170, -7643, -4453, -2733, -462, -2625, -5542, -4931, -2640, -1860, -559, 492, 636, -1805, -4270]
606807d270k08q27K366J42j247k86J879k114K10N090K21k40k729j528q56P50J633
608176b014p39L511N75l420k027M11J347L09L58l376j731K726K787J048J263k078
609465a050n73j377k294N19J021M81j661k093J050K63J52J258p49K036P42M02
610754a873j938k829j62K133K581J434J814k009P6J167N11j539k338j24N16j405
612043c985J95p27j250j948O22L578M70p43K50p93o72Q29o39m310q33J605J726
613412f625J796M43k26K767J648j554k026r37j010J756K446n51j173P72j595M61
614701c608J839n69q56J292m88o66k067J176M57J094P76J289J662j544j98O41
615990B30J286o955q41J819R38N71Q31n86k453P26J612L87P14j292J019J955L847
$$ y = [-4270, -4478, -5305, -2939, -2797, -4044, -4330, -2451, -4565, -4355, 735, 956, 716, -2013, -3541, -4397, -3647, -2014, -2753, 758, 1333, -2087, -4114, -3703, -2356, -2047, -1689, -5065, -6796, -4070, -1283, -235, 1028, -1050, -1623, -3000, -5294, -4775, -3754, -3273, -4934, -7027, -5977, -5714, -5562, -4304, -5053, -3017, -2275, -1873, -3811, -6640, -6802, -4669, -2088, -654, 1160, -849, -773, 394, 905, -634, -2972, -3096, -2580, -3985, -3790, -4517, -5767, -7715, -7093, -3515, -3045, -3788, -3538, -4331, -5003, -4174, -4813, -9123, -9956, -8351, -6625, -4829, -4386, -4612, -1845, -197, -1751, -3777, -4714, -5724, -3968, -1522, -2073, -3246, -2474, -4069, -3608, -1769, -2338, -3194, -1902, -2390, -3056, -5123, -3947, -3490, -2396, -1620, -331, 1331, -213, -411, 230, 1516, -5439, -6280, -4461, -3523, -2952, -2121, -2707, -5160, -4434, -2822, -2435, -1721, -3013, -1994, -39, 3808]
617360C808j769n69j018L1k339Q93P70r68j670P09J104L81K568m256M69j33K3
618729a966o42j522j134L158R92j505r5j202n66R7K570J252k595l598n005M152
620018g609M773K037P67K66J451L98k747r10J95k8j375l9J760m97L63J259K002
621387B066Q2m223j214J137J115l347q5L442Q09n61j485j005l196O31L230J425
622676a179j703J75K438l48J330k818k074J126r06q74L52o04o91K31M51p07m6
624045e847j46L191M66R56l87l562L89R30K968J133l03M65j97j392l18k52J937
625415C1M53m017P8p56o03Q88J705J333J83j036L03j178O6M00k469k393l30J619
626864e723K679j378p27J202J427R69m25N17j130j447o57j920J453M90j392j2
$$ y = [3808, 2039, 1470, 452, 483, -1856, -963, -193, -1161, -2831, -2122, -1018, -637, 1931, -2325, -1856, -1989, -1966, -2608, -4130, -5264, -2106, -1114, -2619, -2714, -3916, -4482, -4385, -1815, -563, -3158, -6756, -11761, -7609, -2836, -799, -32, 234, 1685, 2083, -664, -1574, -1379, -1407, -2782, -2821, -1061, -1558, -1195, 64, 2066, 2148, -2075, -3289, -2152, -1037, -4384, -4469, -1027, -218, -779, -2264, -3269, -6465, -5834, -2604, -1179, -2882, -2707, -269, -617, 713, -2105, -4179, -3053, -3959, -4833, -4481, -5085, -5776, -5545, -5094, -5801, -5847, -5993, -2802, -2336, -1380, -1767, -5329, -4940, -4010, -1042, 91, -212, 253, 56, -1336, -1654, -1906, 31, 484, -3533, -3455, -4211, -4814, -3926, -2221, -888, -705, -1741, -1438, -2616, -2550, -2150, -4619, -7012, -7342, -5723, -3044, -4422, -5149, -3947, -2520, -1551, -1976, -1459, -2589, -4036, -4693, -6613, -5160, -4670, -6062, -6074]
628154f074M465Q68O06j547r85J63J407j506j458K068j018j343k95L307J047K202
629442A907j645j033k398k463J00K250J706L52O43J181l049K4L62q14o20j628
630732e125L80J6q79J649J758J48k014K51L507L303p43m233m673j321J228J358
632020e390l59j203R28J247O60N05K087J4j094j984m88j721N30O74J619K855J792
633390F72k392j399R99K153K900j205j242R43J549k419j192q08L8m83k295j419
634678e600j016M032R23l75Q49k101P39J699J163j192k64o04j706j278L04J100
635968c327j118K23j197j172N39L907K982k513k99L927j777k052Q13J608R44n42
637256I46j409K307J630J91o75j541q25k053J031Q07r53N00K265J479k001Q51
$$ y = [-6074, -1609, -741, -135, -1682, -2667, -2504, -1097, -2603, -4061, -1993, -3011, -4354, -4649, -1342, -295, 1907, 262, -771, -3169, -5632, -5532, -3282, -1576, -1224, -581, 600, -2449, -2425, -2063, -2877, -3497, -5125, -4745, -4729, -5608, -3959, -2201, -2053, -4067, -3816, -309, 2994, 2251, -1982, -6655, -7976, -6748, -5390, -5749, -6952, -6024, -4777, -4117, -3612, -1525, -1511, -2605, -4589, -5077, -6798, -6268, -5594, -3975, -1120, 672, -1720, -3119, -2120, 33, 2933, 1728, 486, 1429, 2978, 559, -633, -1441, -1403, -1886, -4181, -5600, -6616, -2584, -1661, -2036, -1187, -3288, -2549, -850, 313, -879, -1143, -1747, -3453, -4731, -4427, -3327, -4445, -4222, -5419, -6591, -6052, -2145, 837, -1676, -1975, 1952, 175, -1877, -1064, 544, 1488, 946, -463, 1844, 3474, 3665, 2990, 1449, 624, -1429, -398, 409, -544, -44, 2221, 3700, 1699, 2550]
638545B550Q02k365l222k79k55q84L04k094J64p12J810L658K114j220J110l31
639834A150O79j279j087l90Q76L49j303R54j305j037k906j382L907N036M48n025
641123b315k77k469r36j462O00l59K923L36j530k110K224J259J449p60l828j086
642412h341K174L116J571j744K653n2j788k552l540J598M793j771l440J817J661
643620c845K72P70q28j680R08O66k188J605J477k202R79j87j27K349n88R17L38
644989a364J01j626J158K908m50l011k075K296m14r4k99j912J136m0k434L190
646279b930Q63m89l97j52p80J218p06k715J646J855L04r7J745J990m034R22k533
647648d290P47j059l78M99O00K28j15j253K792J992r58l12n90l866l198L72p85
$$ y = [2550, 3352, 987, -2235, -2514, -2769, -3653, -3349, -5443, -5279, -5991, -4181, -523, 1591, 371, 1481, 1150, 1829, 550, -537, -927, -51, 298, -1005, -51, -1356, -2393, -5299, -6681, -2774, 2262, 2710, -2315, -2592, -5061, -5997, -7459, -6859, -7218, -4295, -3959, -5489, -7599, -5375, -4116, -2667, -3427, -7255, -8341, -6167, -3051, -1480, -3224, -571, -623, -2411, -4963, -8503, -6905, -2112, -3883, -7323, -5506, -3845, -3573, -2803, -3631, -5311, -4403, -3737, -5925, -4320, -2843, -5045, -4066, -4253, -4380, -2031, -2619, -1702, -1364, -1263, -2889, -1731, 1177, 727, -2284, -4359, -2063, -2477, -2571, -2870, -4782, -3646, -3686, -6120, -2930, -2067, -2556, -2953, -3105, -3885, -2667, -3373, -6088, -4442, -2587, -2283, -2380, -635, 1355, -2679, -1757, -4290, -3543, -4602, -4980, -4481, -3881, -3653, -3768, -5021, -2229, -237, -1195, -1507, -2097, -5963, -9161, -8789, -9574]
649017i574Q88o7n22K69J885K459J112l74J947k925l316J154L514J808R59j633
650306b416j488j905K055R93j081k770J24J931J017o430M60L305J206J864j261
651515d396j701J481K38k204M56R21P02L81M01J476K313j304q89K66M56l007j820
652884f230k34k695L263K050j003k382J248R77n89j941K896m99K23K267J106q99
654173b442l467J371k991k28J305J976m110j096M634N38n64j099j75K279P06p92
655461d155k871P96Q65K166n56R98Q78k656O57M368K88k917r40k64j9L340J396
656831A374j071k729j705J195k516n95J103k30K429q79o26j682k017K233O14K958
658120b144o14J884nl552k449k25J135J903J111K53O71k783P05K233Q42K6L285
$$ y = [-9574, -8686, -8753, -9275, -9006, -7121, -4662, -3550, -3924, -1977, -4902, -8218, -7064, -3550, -1742, -783, -2416, -3904, -5809, -3754, -2761, -3842, -6612, -6488, -4557, -3540, -9970, -9510, -6205, -4999, -3135, -4396, -6097, -4616, -4378, -6582, -6126, -5205, -4503, -4122, -3721, -2245, 68, -1236, -2125, -1859, -1403, -4410, -6230, -6464, -9159, -5896, -3846, -4849, -7231, -5983, -5006, -5595, -7536, -4640, -5139, -4916, -2649, -1543, -2442, -5909, -4538, -7529, -7757, -6452, -4476, -8586, -9682, -5048, -4510, -5074, -6173, -6348, -4069, -3363, -4155, -7026, -6230, -5365, -3199, -3755, -2757, -1879, -4535, -3878, 490, 778, -2139, -3079, -3343, -3362, -22, 1374, 303, -2426, -4131, -2936, -5452, -6047, -4944, -5174, -2745, -3624, -4250, -5932, -7949, -5716, -5102, -2144, -2758, -874, -879, -4431, -6880, -7105, -5970, -4067, -2956, -2703, -2032, -4815, -4110, -1877, -1035, -1009, 2276]
659490B276l224l925J038p68J03K24J553K644j123o85N27J431k368l025K128K204
660778i90J326k964o55m55m236R77K811k785k309J979L649J871P4k452r97p64
662067e920J437K456K452j355k566R14Q7m50k728K023L829q5k412m012J797L56
663356d177o91l30j581L675N327j738k072k507p23o74k222j470J941L871m39j06
664645c916K49j643r20n36L772K2k602Q58R86K861k491r84P08k137o66j710J394
666014f755O13l40K453K938J615k640Mj990k404mL89J994L385j402j892j705J114
667384d627j272L283j714j705J982K320j322n64p36m01Q57L721o53k913k338P39
668672e343j036j481N40K131K231J847j213J302j767K450R6j971J076j252m1J973
$$ y = [2276, -948, -4873, -3835, -4603, -4500, -4276, -2723, -79, -1202, -1887, -1360, 71, -2297, -5322, -3194, -990, 336, -2628, -3283, -3738, -7974, -6997, -4186, -6971, -9280, -7301, -3652, -1781, -1707, -4159, -5156, -5920, -4483, -2027, 425, -930, -3496, -2582, -2495, -2945, -5673, -3650, 179, 94, -2318, -6330, -4533, -4177, -4868, -5198, -6779, -3104, 2223, 485, -1587, -4094, -4817, -5491, -7713, -9183, -7242, -3371, -3810, -3916, -3667, -5310, -6230, -6766, -2994, -2972, -5574, -4716, -3730, -869, -3360, -4344, -3636, -5773, -6439, -8149, -6755, -6142, -6482, -4029, -1091, 524, -2116, -2112, -4102, -6506, -6510, -6121, -4127, -742, -2144, -4036, -5741, -4627, -5899, -2616, -4330, -6035, -4053, -1733, -3055, -3619, -4355, -4756, -3899, -178, -831, -3744, -6082, -5343, -6379, -7860, -7320, -5189, -2958, -1111, -2324, -1022, -2789, -339, -243, -2214, -1138, -2390, -2431, -458]
669962d58L327k442o83R536J6201J1953j1400j1549m335n36L635J0428J9503M6662
671089H9842K9733l8203k8548j1908n199J721J6402L9335Q2575L2284p1056m4589
672056I2389k0940r646m316R875L9477Q5888K0626p3233m5836j9890q567n886
673023E9941K827K1941M9557L709m3941k7305j1938j0339o528k870L645J7063
673989E5762k320j5317j0985p152m079l200j906o31K480j222m164k442Q74q43
675117D855K63k26K358l031m906L07J393j57j042K93N43J423k146j500J016j65
676406g22o62J372K050l21J546p49O70j918j364R2j26j503P05J352k652Q67K25
677775a138m57K700O39k570j039Q92K759l933j335J969O54j075r04o73o88k635
$$ y = [-458, 2869, 427, -256, 9280, 25481, 37434, 26034, 14485, 10150, 9614, 13249, 23677, 43180, 89842, 119575, 81372, 52824, 40916, 35717, 37438, 53840, 93175, 175750, 208034, 136978, 92389, 71449, 61803, 57487, 67362, 106839, 192727, 213353, 140120, 94284, 74394, 65827, 59941, 62768, 84709, 134266, 137975, 94034, 66729, 54791, 44452, 37924, 35054, 38699, 55762, 53442, 38125, 27140, 19988, 15909, 12709, 10803, 10172, 12652, 11430, 7266, 4824, 5698, 4855, 5118, 4892, 7250, 4219, -687, -380, 1013, 856, -186, 107, 650, 2073, -73, -1573, -557, -722, -1384, -12, 2038, 1717, 3263, 2514, 3184, 1266, -98, -6, -132, -1635, -930, 422, -2230, -1363, -1138, -1595, 1105, 1744, -826, -1865, -973, 1786, -2147, -3482, -1513, -859, -1934, -2838, -3511, -4199, -6834]
679064f834m72M540k21j390K12k58k77n49R26pJ47j734Q77K747M98l3K455k035
680514a408M71L40j799J530l32m36J243pk778m80Q06R81J225j495l617M91N018
681883b47k895k175J991K204J081q53k046j505q5J088o60p60J10k109K054P40
683172d067k589j309L651O25Q89o08r34K057J224l99j637m10N76j395j983m94
684461f803q4J863J307j695L52j902J67k464J065K189K634P96l003L0L283r39
685750c204p98j592K72N97j6j148L095J247k42q93m78n11m112K41J239O76k134
687119g761J010J09j677j12Q17J939K84j71M009K78L22N163P798j378m584l58
688408E688K688j621l81J0076K3908L7957r584k5464j2429l510J271J0220K5738
$$ y = [-6834, -7306, -2766, -2987, -4377, -4165, -4423, -4700, -5249, -4323, -4330, -4183, -5917, -5040, -2293, -1795, -1828, 627, -1408, -937, -597, -2396, -866, -1198, -1634, -391, -398, -3176, -3656, -2850, -1869, -644, -2139, -5756, -5265, -247, -3142, -5317, -3326, -1122, -41, -894, -2940, -4445, -4530, -3442, -4102, -4862, -4752, -6861, -4807, -4067, -6656, -7965, -4314, -3689, -2800, -3408, -4342, -2285, -1061, -1460, -3097, -3507, -2931, -4326, -6309, -6803, -6887, -5024, -3717, -5412, -5060, -6962, -6795, -9259, -8194, -6005, -3371, -2575, -5578, -5548, -2265, -3204, -4002, -5594, -5322, -4725, -4741, -5889, -2794, -1547, -1789, -2682, -3160, -3671, -7783, -7542, -6303, -5627, -7761, -6751, -6642, -8319, -8431, -7614, -5675, -5391, -5562, -1553, -1275, -953, 4210, 12008, 10630, 6046, 5688, 8376, 6755, 6374, 16450, 40358, 78315, 68731, 43267, 30838, 27328, 28599, 38819, 64557]
689455F4557P2850J04711l2158p7393l4304j7770o368J4577M7794J25273J64666
690342D26435q0292j21363o0398l1409j4282O065M4743J28588J47180r8126j18284
691228B28857o0642l0941j7030m678K4804Q0037P9420p0497p4606l7551k3970
692113I3203j2622l915N503K1430J9331k8907k1479j6103j1549r005n402l330
693081B7155J257L20l880j734n57k267k556l945j822o48J8Q94K25J088m752k102
694369F694j067Q03k563l472k219N595J545l47K6J20n440K89O33P76J537J839
695659D749J307j450J5j036k41r57r14K625J817j982j875J247J494K330j886l677
696947A566j729j677J965J268J723l43J010j854J748j290r15k705qK81J93k681
$$ y = [64557, 137407, 242118, 209960, 132567, 98263, 80493, 74125, 88702, 136496, 261769, 426435, 346143, 224780, 164382, 132973, 118691, 124756, 169499, 298087, 445267, 347141, 228857, 168215, 137274, 120244, 115566, 140370, 220407, 299827, 229330, 154724, 117173, 93203, 80581, 76666, 82169, 103599, 122930, 94023, 72544, 56441, 44892, 35887, 30485, 27155, 28412, 28732, 24852, 23118, 22561, 20294, 17738, 13793, 11971, 11323, 11341, 12235, 12460, 13548, 8796, 6694, 5627, 6430, 3867, 395, -1824, 3771, 5316, 4969, 4995, 5115, -325, -36, 597, 1373, 2910, 4749, 6056, 4606, 4621, 3585, 3344, 2387, 1473, 4098, 5915, 3933, 2058, 3305, 4799, 7129, 5243, 1566, -163, -1840, 125, 1393, 3116, 2773, 3783, 1929, 3677, 2387, 1472, -1233, -1241, -960, -767, -3448]
698236c448J566L76Q77p1j272k587k107J302J137k172j497J144M191k410m82K111
699525c342N56K861l04k190O22K059K719k401q67j685j684j81J412Q91k816j494
700814e844J193K591J056j464J867J265j647K149L97j49l167M4R54j833J185K614
702103A211J745j135j895Q05l57j204K225J751l222l402k96M88J399o35p49o42
703392c913R47M54Q65R13j644j579Q02j037K523K490J524j260p42K896p26O70
704680C183L97k452k565j557p34j991M1N529j646j791J356J603m21l6L393r49
705969A360j598j731l51J073O9R44J059Q71K217J213J043k159j20q74K763Q461
707258A4240J5144Q895j1717j0140l641k207M223Q206K2552M9785K3592l9006
$$ y = [-3448, -1882, -1506, -629, -700, -1972, -4559, -6666, -5364, -4227, -6399, -7896, -6752, -2561, -4971, -5453, -3342, -2786, 75, -229, -2419, -1797, 262, 2981, 580, -287, -1972, -3656, -3837, -2425, -1534, -4350, -5844, -4651, -2060, -1004, -2468, -601, 664, -983, 1166, 1563, 1414, -1753, -1709, -755, -2588, -1403, 1211, 2956, 1821, -74, 731, 374, -830, 1395, 3146, -76, -3478, -3774, -3286, -1887, -2522, -3271, -3913, -2966, -2512, -1647, -734, -2378, -3957, -3155, -4192, -1669, 821, 2345, 1085, 343, 3239, 2513, 3183, 3580, 1128, -1437, -2994, -3728, -5719, -5678, -149, -1795, -3586, -2230, -627, -1048, -1084, 2309, 1360, -238, -1969, -2320, -1247, -1178, -234, 825, 1696, 3913, 5126, 6169, 4010, 3890, 3016, 5779, 14240, 29384, 38279, 26562, 16422, 12781, 10574, 14797, 23003, 45555, 95340, 118932, 79926]
708224G9926k8032q821k211L381J2883M2001Q6520J9477p1817m3733k1311q851
709192E9412L316J2120M2492Q5757O179p4340l9647j9542j1690n926O280K5630
710158I0041N4776o302m3463k5209j5828j0630m485K70O311J5518p145j6872r000
711206B7982n207k603m218k449J809J954l885m205Q20J767j865m049j563j142
712333C146j436J472N60Q37n83j054l83j659j733L01J747N59j343k9k543P29K134
713702G22l15j072l808K788M114K743r0J649j673m158j51o64L60k624L450L566
714991D837J245l367k265j188J176Q49k151k85L853j380n13k709o65J584J333
716200C54k80M20q95j464K512M38q55p87j874J999p05J092K21j253q18M7j968
$$ y = [79926, 51894, 43073, 40862, 44243, 57126, 99127, 185647, 205124, 133307, 89574, 68263, 59412, 62728, 74848, 117340, 203097, 209276, 134936, 95289, 75747, 64057, 58131, 64411, 90041, 144817, 138515, 95052, 69843, 54015, 43385, 38900, 39170, 45481, 60999, 53854, 36982, 27982, 22775, 20172, 15954, 13505, 15314, 17268, 13383, 9178, 9998, 11765, 9900, 5851, 4288, 3146, 1710, 3182, 3742, 4579, 3996, 2942, 2559, 900, -833, -532, 1215, 1774, 431, 402, -2141, -1412, 722, 407, -665, -4473, -1685, 2429, 5172, 5082, 6731, 5058, 900, 749, 85, 445, -2179, 1271, 4837, 6082, 2715, 450, -738, 438, 1287, -864, -1149, 2704, 1324, 811, -1898, -2563, -979, 354, 74, 494, -401, -1865, 647, 1085, 230, -557, -2431, -432, -1137, -45, 176, -1077, -1895, -1848, -3816]
717569c816j21J100O34K170j245K105J792j466K704o59r51k197j617J369o7j130
718857a395m06l339l048R60K063N109P46l338J407J565K304l064N23j453J70P45
720147d51R65On76j201m60p19K765J569k364k021K445n75P55j000O64J72j721
721517a747J419K932K069k831k847l368o93J048j096j705O78J717K564M27J085
722724c48R56m39J668N64J030j620n29j60j324J093p5r64j586J817M95j238k302
724093b962j53R86K495J65J735k296l592j013J824J934j629k165J734K50j22J915
725383h94K246k652k500o36Q49J732K08L72J002j450j488l8j94j302q40j699K97
726752f987K302N29K269k79J682R78N43K871r59j034q84JJ303R11k966k625j809
$$ y = [-3816, -3937, -2837, -2203, -33, -1278, 827, 2619, 1153, 3857, 3198, 2247, 50, -1567, -198, -265, -1395, -1801, -5140, -8188, -7228, -5165, -56, 690, -2648, -1241, 324, 2628, -436, 87, -1366, -1196, -451, 514, 520, -56, -1257, -1717, -2436, 329, 1898, -466, -2487, -42, -617, 138, -862, -198, -26, -1747, -328, 2604, 4673, 1842, -1005, -4373, -5066, -4018, -5114, -6819, -6141, -4424, -1860, -1433, -348, 608, 169, 1837, 2401, 3431, 1811, 1282, 1122, -202, 891, 816, -148, -1734, 83, 578, -660, -2962, -3115, -2129, 366, 531, 2266, -30, -3622, -4635, -2811, -877, -2506, -4671, -2937, -2687, -2809, -894, 1352, -1300, -3800, -4436, -3587, -1855, -1647, -1275, -273, -1723, -3211, -3249, -3443, -4745, -5585, -7284, -6987, -4685, -4156, -1887, -2166, -484, 494, 1037, 3908, 2949, 1915, 1031, 1032, 2335, 3246, 280, -2345, -4154]
728122d154r68K521l31k06j832P15j200J699L454k275j781K654K040j993J74Q22
729410f61j831k147k70p89j916Q85K687j515O59L652J611N6j269n41k536m10j274
730780e609n20K360j397J477P96r0L079O70j096j786J767o85j094r8J461j376
732068b141J37J663J666n43l195j239J774o76J82j846R23l844L78J511k013K135
733358e128Q42O33K164r6l160p2j329j427L556J85K229l6l701J017j396l46p82
734727f847j98J374P24L11K06O44j213J401Q22j199j528L162J230l10J108r33
736016a246k262jl07M158j622q05p13j369O14J644J28k73J232R89m86J315k189
737385a193r36k70j644J380M526j276l123o28P28K25j003K67j261l906M43K465
$$ y = [-4154, -5122, -2601, -2932, -3138, -4970, -4255, -5455, -3756, -302, -2577, -4358, -1704, 336, -1657, -1483, -661, -2492, -4639, -4909, -5698, -7614, -6729, -4042, -5557, -4898, -1246, 365, 421, -848, -1389, -3925, -4335, -5609, -6129, -3769, -5166, -3689, -2893, -2983, 96, 766, -330, -2116, -349, -1034, -2128, -2226, -765, -2141, -2004, -341, 1325, 782, -2413, -3652, -1878, -2554, -2372, -4218, -3295, -7139, -6761, -5250, -7263, -5128, -4286, -3653, -1489, -1585, -4745, -4817, -6146, -7573, -4017, -3832, -1603, -1639, -5340, -4323, -5719, -6065, -6847, -7045, -5671, -4947, -4636, -4430, -3786, -4999, -3598, -2776, -3975, -5503, -2341, -1111, -1421, -313, -1246, -3508, -3509, -3816, 342, -1280, -2085, -2798, -4167, -3553, -1909, -1781, -2054, -822, 167, -319, 996, -1193, -2129, -2399, -4043, -2663, 1863, 587, -2536, -3164, -2436, -2211, -3214, -2947, -4208, -8114, -7671, -5206]
738674e206k44k560Q06j42N83M972L059k790k60l83J814l019Q1P35l281m325K368
740044g792K982J777j637K144j904j435J750K012r43P02j454K128K95n37l414
741252e326k020k63n54J680j039L04M29L174L056j549n52j397l38r87J004L254
742540a124k521k37o96J785j984j402N80K8J201K216j827J199J27n71j216L91
743830d051J039j051J197qk116j893P64J816l5R63j170k143J205Q08J388j263
745118d550j760j558Q11L594J58N06k57k70o03k339P83j683j387N162J14l683
746407f962p2L034K087J84m29k490j204J255J130J0j570j833j355J264K187L079
747697a685J098N38J32l336O37K950k764L350J287j720l893j137p48n59K295o19
$$ y = [-5206, -5450, -8010, -7204, -7346, -6763, -1791, 1268, -1522, -1782, -2165, -351, -3370, -3289, -2554, -5835, -10160, -7792, -4810, -3033, -4670, -2526, -4430, -5865, -4115, -2103, -3046, -2344, -3798, -1670, -1375, -1912, -5326, -7346, -7609, -8163, -6483, -7522, -7218, -6789, -3615, -559, -2108, -2660, -4057, -4395, -5382, -4378, -1124, -3645, -3882, -4578, -2793, -4777, -6179, -5599, -5571, -4370, -2154, -3981, -2782, -2655, -3226, -4442, -4051, -3012, -4063, -2866, -2874, -4990, -6883, -6119, -4303, -4338, -3375, -4545, -6688, -5483, -4675, -3287, -4550, -6310, -7868, -7057, -3463, -3305, -2799, -3056, -3326, -3929, -6268, -5485, -7168, -8555, -3393, -3279, -6962, -7034, -4000, -1913, -1729, -2158, -4648, -5852, -4597, -3467, -3457, -5027, -6860, -8215, -6951, -4764, -1685, -587, -49, 83, -3253, -2616, 334, -2430, 920, 2207, 487, -3406, -4543, -5291, -5850, -3555, -4174]
748985d174k005o13J832P77J080j415R92k305o06J150j292J755jj697L807n39
750273c254n81Nj621O25J32J414K544J140j028q76L184l242n000J317J114m5m2
751643d214r1M11L04q49j93J975J27L68k510j645K17Q68l98N85m40n82L507r89
753094c549L06k108K05j955p23K178q73r51J940J97N8j83j951j841k64K476N70
754463f468l901j243J704k500n58K305L417J602J157M85R42l4j851J551K632J441
755752F81L46o55K61j08k881k490j137j296r28k541J885K67J097J890j152r49
757040g710O27K442Q14k325o09p4J216n81j602j39k0j462L461K580M45M46J562
758410i29J084j657k879k654j932K45J319O34j436J873j181K33J934j14k228n55
$$ y = [-4174, -6179, -6792, -4960, -4183, -3103, -4518, -3526, -5831, -6437, -5287, -6579, -4824, -4825, -6522, -2715, -3254, -3835, -3830, -5451, -4826, -4694, -3280, -736, 404, -624, -1500, 1684, -1558, -6558, -5241, -4127, -4172, -4214, -4305, -3894, -3590, -4439, -4632, -2657, -2530, -2162, -4672, -6317, -6100, -5232, -5630, -5045, -5485, -6067, -2560, -3549, -3243, -5351, -5146, -7101, -7824, -5646, -6519, -7470, -5530, -5333, -5275, -5458, -7409, -9250, -9514, -7038, -6468, -10369, -11612, -9908, -12408, -12966, -10661, -7244, -5642, -4485, -4000, -3058, -3092, -4943, -3392, -760, 681, 1027, 372, 633, 525, -2356, -4846, -5983, -7279, -8207, -10748, -8863, -8596, -7499, -5609, -6761, -7710, -7083, -4641, -3827, -6152, -6761, -6835, -5619, -6200, -7802, -7941, -7961, -9423, -5962, -3382, -2937, -2491, -929, 155, -1502, -4381, -7035, -8967, -8722, -7403, -6769, -8205, -6332, -7513, -7280, -5346, -5460, -7688, -8243]
759699h243J639p35r38m96M26M017J168O17O23j670k345J169J734p98O12m58m120
761069g798k845j52K81J885L30n53J310O98J986n17l711K183J815O43m040j838
762357a0323J743M794O027N871M277J1063J2137K0722L3760N4965J05258J99113
763323D49407L02380K21994j02250k21057j62954j10984p4387n4894m5721l4054
764129A67480k1700j8604j7625j0888r422p814o762r772q573l332n453n038n903
765176C6594m053m951j908l000m522P82k26q65k293n56j467n43j300r00l089j278
766466F425M836J743J043L960J350M691N452R773J6667K4348M2597P2151J44893
767512C39929K57980L13143P5982k04522k02719j34229r1464p0803n2309l9292
$$ y = [-8243, -6604, -7339, -8277, -8773, -8347, -4330, -3162, -2545, -1922, -3592, -5937, -4768, -3034, -3832, -3220, -3678, -7798, -10643, -10795, -10514, -8629, -8299, -8852, -7542, -6844, -4858, -5375, -9086, -6903, -5088, -4445, -8485, -10323, -8580, -3786, 2241, 8112, 12389, 23452, 35589, 56311, 90071, 145036, 250294, 449407, 751787, 973781, 871531, 650474, 487520, 376536, 302149, 247255, 201534, 167480, 145780, 127176, 109551, 98663, 89241, 81427, 74665, 64893, 56320, 52988, 47535, 42497, 36594, 32541, 27590, 25682, 22682, 18160, 18942, 18716, 17851, 15558, 15002, 13535, 12992, 11692, 10792, 7703, 6425, 11261, 13004, 14047, 18007, 19357, 24048, 29500, 39273, 55940, 80288, 122885, 195036, 339929, 597909, 911052, 987034, 782512, 579793, 445564, 354100, 283297, 230988, 191696]
768318A91696l1021j6472j5775j0466r158j1908j1449q883j0302o448m384m396
769285E1034o699k954k557k431k398l502l527r66k513R03m311k519j518O33J189
770493A7864m33m003j226L335L247K70N041M021O061P835J2522K0258K9673N3984
771621A58449J04475J91049K97540K33990q3932k19058j66422j11890q1528o0130
772426B62543m6347l3000k5018k0395j3804j1114j0485p913p695q380n558o505
773393F6329o239q038n719k563l289k177l84l739j239L43k351n023j35n39m57
774602B4780k212k374j723P39J915j458j989j479J48k22l90q68k622j508K044
775809A2781J582P56J052j707l208m195M39J938N79p40R11J506J333o41m512m12
$$ y = [191696, 160675, 144203, 128428, 117962, 108804, 96896, 85447, 76564, 66262, 59814, 55430, 51034, 44335, 41381, 38824, 36393, 33995, 30493, 26966, 26000, 23487, 24390, 20079, 17560, 16042, 16675, 17864, 17431, 13428, 12202, 15537, 18784, 19054, 24095, 28116, 34177, 42012, 54534, 74792, 104465, 158449, 262924, 453973, 751513, 985503, 901571, 682513, 516091, 404201, 322673, 262543, 216196, 183196, 158178, 137783, 123979, 112865, 102380, 94467, 86772, 78392, 72834, 66329, 60090, 52052, 46333, 43770, 40481, 38304, 37920, 34181, 32942, 33285, 30934, 25911, 25776, 25237, 24780, 22568, 20194, 18471, 19210, 21125, 19667, 17678, 16199, 16347, 16125, 15735, 14867, 12245, 10737, 12781, 14363, 15119, 16171, 14464, 11256, 7061, 7500, 9438, 10017, 9277, 10188, 11694, 13027, 12386, 7874, 7462]
777099G462K741K95l054K15Q11j905n93R76O67K115J47l325l541K548J736q27
778387F468Q11J564j409j499P37K576j428P94J072j433j600Q56k322J194j003
779596E378n81J504L257k62m698j932q22J05J693n76j170J50J759l43K444j0j576
780965D320r19k010J689J733K078J838o74k188j70m4nk189k578J534J354J288
782254E057K441P19j771j635K138k953k426k423l192N88P12J760K725K129N427
783462I296L646p82l177k854j863m087R5j018O32P53K971m1j896K912j777R60
784752C770K669l30J89p44k715O48n43j189J92J495q50J794j221L23P84j509k672
786120I1K9K961j134j45N10O35r41J566N514K13l784j001j83N43p62K92k004m80
$$ y = [7462, 10203, 10498, 7444, 7659, 8470, 6565, 5972, 6948, 7615, 9730, 9877, 6552, 3011, 5559, 7295, 6468, 7279, 8843, 7434, 5935, 6672, 9248, 7820, 8614, 9686, 8253, 6653, 7509, 5187, 6381, 5378, 4797, 6301, 9558, 9296, 4598, 2666, 1844, 1949, 3642, 3066, 1896, 2046, 3805, 3462, 5906, 5896, 4320, 3401, 1391, 3080, 4813, 6891, 8729, 8055, 5867, 5697, 5653, 5648, 3459, 881, 2415, 3769, 5057, 7498, 8217, 6446, 4811, 6949, 3996, 1570, -853, -4045, -3457, -2745, -985, 1740, 3869, 9296, 12942, 12160, 8983, 6129, 4266, 179, 274, -744, -112, 641, 3612, 3571, 1675, 4587, 2810, 3770, 6439, 6109, 6298, 5554, 2839, 3487, 2944, 1755, 1947, 3442, 2592, 4386, 3165, 3488, 4272, 2763, 91, 120, 3081, 1947, 1802, 2312, 2947, 2006, 3572, 9086, 9299, 5515, 4514, 4331, 4874, 4112, 4404, 2400, 1920]
787571A920Q84Q04J9q41L035k288J96o30l55p35q4k076J753m53j718K668J291
788940C390J13o84j714l774K219J718J558j461n99O27J259Q2k858j673L985K11
790229B399P7J24j899r37J127P08N51J545j013j78p75o50k234N0J681O19j476
791598b81n30J5K607J427j310k33j114J167n48m057K029P55j338J794J822r85
792887A220k541J819R0Q13j497M06r4J263M20j517q61j425J255j56l66L74Q72
794256G5J608k698j888K122K379k30l305j453J406M411J823L031k982l266R89
795465B022J143J63j967m355K343L196j407Q41q21m432Q8J162O24j323k82J697
796754a308J546m2N83J236O12j843j513L57K320Q0r61k595L238j8P19N13L63k428
$$ y = [1920, 2804, 3608, 3627, 2786, 5821, 3533, 3729, 3099, 2744, 2009, 1925, -151, 1602, 1149, -569, 2099, 3390, 3503, 2819, 1105, -2669, -450, 1268, 2826, 1365, 766, 1393, 2652, 2734, -124, -1797, 2188, 2399, 2476, 2600, 701, -236, 891, 1599, 2150, 3695, 2682, 2504, 1729, 1079, -1155, -1105, 576, 1195, -281, -811, -796, 1811, 3238, 1928, 1695, 581, 1748, 1200, -2857, -828, -73, -1411, 383, 2205, 1220, -1321, 498, 588, 1401, -96, 310, 216, 1479, 1899, 382, -479, -1904, -649, -805, -1171, -797, 75, 1683, -1015, -2903, -781, 1598, 1368, -1937, -3390, -1984, 2427, 4250, 7281, 4299, 1033, 2022, 3165, 3328, 1361, -2994, -651, 2545, 1138, 1979, 1158, -3274, -3186, -2024, -1400, -2723, -3005, -1308, 238, 196, 779, 2015, 2627, 784, -729, -372, 1948, 2028, 1067, -1528, 1710, 1692, 2411, 2924, 3287, 859]
798204H59k740J70J787K849R78L84l182j035j643K41K443k186j231r66K777q95
799492a390j169j245J094K059P21j504J183k40M4j102k041K77J976J035K072j116
800782F54Q66J602k362J050M46J042j730j402j550N73M019l3k341n483K286K581
802070B18k260j89K970J331p81k493J46N66J093l06K0L258p94o04j642J410o31
803440A312k466l88J150K689k64j820J067O52k33k437j492J465K506l26Q37k274
804728b2n36o98J066J654J94N73q00l290p44j91J865J65J07J230k06J14k112k059
806179c690n53M396L04L12k145m05L202M395l29m227k591m83K763J456j885R17
807467A437J117k258l84j44j958n95K571r83J384j590J657O28K136nj419k39j
$$ y = [859, -1881, -1711, 76, 2925, 3903, 4287, 1105, 70, -1573, -1332, 1111, -1075, -2306, -3272, -495, -1390, -2559, -3804, -2710, -651, 70, -1434, -251, -491, -447, -1549, -3590, -3313, -1337, -302, 1770, 654, 1520, 3122, 760, 1810, 2256, 3298, 1568, 166, -1384, -811, 3208, 3175, 834, -4649, -2363, 218, -2042, -2231, 739, 2070, 1289, -1204, -1058, -492, 601, 295, 315, 3573, 2779, 2175, 533, 1943, 1312, -1154, -1542, -392, 2297, 2033, 213, 1280, 1932, 1699, -738, -2230, -765, 1741, 1415, 2252, -22, -558, -1256, -190, 1464, 1658, 2231, 1431, -1859, -2603, -2794, -929, -764, -657, 573, 367, 481, -1631, -3690, -4243, 153, 457, 769, -1376, -1781, 1421, 5816, 5487, 1260, -1331, -1814, 949, 2405, 520, 1437, 2554, 296, -88, -232, -2190, -2785, -214, -1197, 187, -1403, 254, 882, 3018, 3013, 1594, 1355, 1354]
808837A354k75M92K608J928l423k458M17K349K10j971J887J285j781j516l31j284
810125e09P43L71Q04P63O7K089l14j24n90k768M93K93n34o01J935J117l075k350
811576b190J031K398l44k9M95j160j832J670m72J564k115j661J015j740l56J711
812864b015j854J352L62K150L054L601l268j616l645q53M064P10j064j056k68
814073c46J027k706J188R63m241J85L627L685q95k136Q12J812j212o99j690N87
815361c9q79J72m368P88K471K793J198J073M08J445J005k440m46P9j549o3k656
816731a008j262K535K493j637k235j5o47L141L12n91j959j748k181k61K974K154
818020F5J558r83p73k354j088J180L005n06K120k872k783P59M747j129l069j318
$$ y = [1354, 1079, 1571, 4179, 6107, 2684, 226, 643, 2992, 3202, 1231, 3118, 4403, 2622, 1106, 775, -509, 234, 605, 1409, 2172, 2239, 4328, 4014, 3890, 3300, 532, 1025, 1318, 784, 183, 2118, 3235, 160, -2190, -1159, 1239, 895, 866, 1361, 201, -1631, 39, -433, 1131, -984, -2645, -1630, -3370, -3726, -2015, -3869, -2517, -2155, -5, 3049, 6650, 3382, 1766, -1879, -2732, 1332, 2042, 978, -78, -346, 681, -2025, -837, 126, -4115, -3930, -303, 3382, 2487, 351, 1163, 2975, 1763, 1064, -626, -39, -918, -746, -5114, -4326, -1855, 938, 2136, 3209, 3617, 5062, 6067, 3627, 3181, 3260, 1711, 1648, -1008, -2270, 265, 2758, 1121, -1114, -1129, -1776, 1365, 1677, 1086, -873, -2621, -4802, -5063, -2089, 65, 1623, 640, -133, -2487, -3575, -2395, 610, 104, 2224, -648, -3431, -2672, 2075, 946, -2123, -3441]
819309c441j387R72J095K82j502K009j029J710K907k578r47j155K174L156k166
820517A00J451R23J9q36m94J683N98k210j006O27L97J64l55j147K28n71Q63P36
821967A170J394L179k344l165j769r04K52L462K606n24j285k036L00L96J871P28
823256C331k05j340K930K276n993m33M56j15L294J441m032k923k203J375K542
824464D01p04k372j892K415M636j846K51j45J54J104J91l26n95Q7m05j99J071
825834A826J26k621L19Q20K58J572k412K63j325k066O37L247K437l975j188K823
827123G41J006J122l86j436o7k889J311J598j724j331L0K046o46L06j801j604
828411c724k381J030p31J225J082J902j344J188r32r78K130J129J30R10j743k870
$$ y = [-3441, -4828, -3856, -2761, -2479, -3981, -1972, -3001, -1291, 1616, -962, -1909, -3064, -890, 2266, 100, 1551, 2474, 2493, 1657, 1163, 2846, 3444, 1234, 228, 855, 1252, 1416, 1061, -86, 142, -429, 434, 1170, 2564, 5743, 3399, 234, -1535, -2439, -2187, 1275, 3881, 3357, 2072, 36, 336, 732, 2603, 3331, 3126, 1786, 4716, 6992, 999, 566, 1022, 907, 4201, 5642, 1610, -1313, -3516, -2141, 401, -303, -2675, -4567, -2152, 2484, 638, 889, 744, 898, 2002, 2193, 1867, 1272, 1359, 954, 755, 1826, 1952, -669, -350, 470, 728, 2300, -112, 151, -1174, -3240, -2603, 644, 3081, -894, -2082, 741, 1747, 2869, 2483, 1047, 980, -1909, -598, 1000, -724, -2055, -2025, 21, -625, -319, -2120, -3724, -6105, -5075, -5806, -4581, -3499, -1597, -2941, -1753, -2685, -3663, -1533, -404, -274, 636, -1107, -3977]
829701c977J79k193L754J745P44j671j629J433j023J634k63k688o68K244K947
830908E68J451J859j538p30k334j400n9k37Q77K204K50k33K9M82J14k898J179
832278d16M65j510j65K478o76l255L89k036K363N81j491J35j553J058j749J142
833567d240O17k857K354J881J350n34J521m5n87o78j68O95L33k546J817N26j558
834937b119l868k701L235J316l12K993K114q78l18J262k443R79J65l824r0Q99
836225c590r12k493K775J580M82k27J217N53l671O10J495k216O38K358n74J9p77
837595b733R14O09l82K44j46l350J088l84J840n83J209K102N12L99r38l174m98
838964c271N878K078J75j02j915l853K032J032m894m32K204q04M96J275l20P80
$$ y = [-3977, -3798, -5991, -2237, -492, 252, -1419, -3048, -1615, -2638, -1004, -1267, -3955, -4623, -2379, 568, 2019, 3878, 2340, 1610, -724, -2124, -2183, -2420, -1543, 661, 911, 678, 707, 1189, 1303, -1595, -416, 49, -1461, -1626, 852, 176, -3079, -2690, -4726, -2363, -1782, -3273, -3138, -4691, -3633, -5382, -4240, -3623, -6480, -4126, -2245, -895, -1429, 92, 47, -540, -1218, -1386, -691, -358, -2904, -1087, -561, -2119, -5987, -8688, -5453, -4137, -4449, -1456, 658, -220, -538, 724, -1719, -740, -575, -4399, -4489, -3590, -4502, -6995, -4220, -2640, -2158, -2385, -1168, -615, -4286, -3676, -2181, -4397, -3759, -1401, -1975, -1956, -2733, -1819, -1210, -1592, -1348, -1494, -4844, -3756, -4140, -2300, -2883, -1674, 428, 940, 1339, 401, -2773, -3271, 2607, 4685, 4860, 4758, 2843, -1010, 1022, 2054, -2840, -3272, -1068, -1872, -1376, -101, -421, 359]
840253C59L82k37j90j545k76M102j387L39J293j518K16J236L68K78k489J601m33
841622B099m220j848J387N80K083J731k396p54l15J661J508j160J82L46J604k68
842911B220j066j927j075k80J43r19n37J085k53l53K966p08K821j018l40M73l715
844280b483J701r48j561J510K152J462J144n66k453j75p77j073j437N76M284k718
845570a362J91J680R37j395r7J429K75J33J927k395j849q10J306J820j282Q31
846858A339O09P53p39l00m97l075j62p96j585J126J129l342J016J103L383J127
848147A089K7j918K42n43O51L066j975j322k037k449K924L619J878q63k736r76
849436a323J276j626k45J636Q56k425j2l52Kn69j872J631j472r14Q07R79L768
$$ y = [359, 741, 504, 314, -1231, -1507, 2595, 1208, 1547, 2840, 1322, 1538, 2774, 3142, 3420, 931, 2532, 2099, -2121, -3969, -2582, -2002, 81, 1812, -584, -1338, -1653, 8, 1516, 356, 538, 884, 2488, 2220, 1154, -773, -1848, -2128, -1985, -2904, -3441, -2356, -2609, -2962, 4, -704, 2117, 1099, 759, 1232, -2483, -782, -1730, -3291, -1781, 371, 1833, 2977, 2411, -42, -217, -994, -2067, -3504, -2928, 1356, -1362, -1171, 509, 1446, 51, -46, 1383, 1658, 1791, 3718, 1323, -526, -1336, -30, 1790, 508, 1339, 1948, 2701, 1962, 1662, 1165, -1910, -2072, -2868, -4453, -3327, -2198, -5540, -4524, -3421, -38, 1089, 1116, -802, -560, -1103, -452, 2614, 639, -683, -2720, -5169, -2245, 1374, 3252, 2389, -347, -1323, -47, -1673, -1918, -282, 574, -1851, -1863, -2215, -2213, -2782, -4654, -3023, -4495, -5409, -4602, -3623, 145]
850806A45J873l316k948K125J303J726j690J44Q5k116l63J889j134k86J893J161
852094D91L44n2j780J22L054P94j078m241J229o89q03L738R2k167Q36j21L410
853464C179n94j192P51j126l242J396J389k524l070J633O44l37L089L586j211
854672B371o444j929M792r7n36j804k081M79J858K927K228k338o38R8J075K103
855961B064j523j042K155r17j457p57k707k802K418J528k40J304M71p32K096M01
857250B60P64p27k485N09j26o48K238J508L650m91j199k470j056P08L46o74p91
858620f84K456j877k190L33O4O38J625M58k842K52R35O45k48O36k897k400k84
859988e380n05J997J087R66N18J382J517k79Q10p53k11J707J63k724L455J436
$$ y = [145, 2018, -1298, -4246, -2121, -818, 908, -782, -638, -553, -2669, -3032, -1143, -2277, -2563, -670, 491, 835, 783, -997, -875, 2179, 2973, 1895, -2346, -1117, -1806, -2609, 1129, 1221, -946, -110, -231, 3179, 2585, 1393, 2144, 1018, -2224, -828, 561, -1963, -5033, -3400, -2756, -3093, -4, 3582, 2371, -4073, -6002, -1210, -1307, -1843, -3647, -5728, -5249, -3391, -464, 1764, -574, -1212, -1114, -39, 2064, 541, -501, 1654, 737, -720, -1477, -4184, -6986, -4568, -3040, -3280, -1976, -1505, -2237, -141, 260, 1024, 297, -2188, -1679, -1805, -2453, -215, 1293, 4943, 4452, 3253, 783, -273, 435, 781, 107, -684, 1772, -105, -2295, -1962, -1898, -1260, 365, 823, -2019, -1767, -832, -187, -435, 201, -2696, -5096, -5380, -5885, -3888, -2801, -1835, -1317, 65, 1582, 1303, 2113, 1360, 1149, 2856, 3019, 295, 3750, 5186]
861278E186m36k592j396j837k969k18k17p84j615J427L56J301O58L482J691q69
862566A168O16l243q0J608O88j239l217O08L066K03L79J142k615k554K367Q20
863856b83L99J129j88L41l391k828J931L287J525j726q25o85O18N63j547j329
865144c009j980R1J72J13j81Q1l38L250k188j971N62Q60L57K442Q73K372K938
866514D444j398l253q16K602q71j356o33J195K462j453L45m336l80J592K034j195
867802a017L11O5L61j226q64j068j393L400M156k17m41j353k007P81q47j352O43
869172b068n8j088K42O088J205j131J733j654l427o79l60J475J958j634P69o08
870460G63o29p04l413m99L868L226k445j298j804n77P61R64O82j084K270K43m6
$$ y = [5186, 4750, 2158, 762, -1075, -4044, -4262, -4479, -5263, -6878, -5451, -5095, -3794, -3136, 346, 2037, 1168, 1784, -1459, -1539, 69, 757, -482, -3699, -3091, -25, 178, 557, 1699, -916, -3470, -1103, -283, 116, 1245, 1057, 1398, -1993, -4821, -2890, 397, 1922, 196, -629, -1314, -696, -133, -1680, -3009, -4989, -4898, -4726, -4613, -4794, -4713, -5051, -1801, -3989, -5960, -5398, -4538, -4181, -1739, -866, 1506, 4444, 3046, -207, -1023, 1579, 708, -648, -1281, -86, 2376, 923, 1268, -3068, -3448, -1856, 178, -1017, -706, -641, -280, -1506, -2370, -3438, -4831, -1431, 2725, 2508, 2067, 714, -1293, -512, -1359, -2711, -2068, -2126, -3214, -2972, 3116, 4321, 3190, 4923, 3269, -158, -837, -1197, 278, 2236, 602, 1371, 763, 134, -570, -3983, -4482, -614, 2612, 167, -1131, -2935, -3512, -2751, -1787, -1105, -2189, 81, 324, 278]
871830B78J813K16M00l29k056k147J644J064j027j031q63k405j566K220N269K0
873119A500k451p39K35J31J620l653j407J698o84l48K310j279J035J225R49J560
874408A702K279l26k837k96J478L08o54n71n80n5l805r13r23M158K533J070Q02
875777C370n909j797J012J144P27OK517j240j225O68j834j909q15n31J580K126
877066b110M13P10J144n60k225p20n14j71P3J171J778j866Q60O22O64K626q50
878435A045j751R1q3k612k463M623M98J695K024q44l165r57J273l188J130J208
879725a476R66K567R23p75L48O7K39l005l325M62j062j019P9J588K036J779K592
881094B984J567k406m084J583O39p48L54M694K173n774k207j018J796k25j187
$$ y = [278, 2091, 2307, 2707, 2378, 322, -1825, -181, 883, -144, -1175, -2038, -4443, -6009, -3789, 1480, 1500, -951, -1690, -1455, -1324, 296, -3357, -4764, -3066, -3750, -4098, -1788, -3067, -2032, -807, 142, 1702, 3981, 3655, 818, 522, 2000, 2308, 1654, 1083, 503, 448, -3357, -4270, -5193, -1035, 1498, 2568, 3370, -2539, -4336, -3324, -2180, -1453, -1447, 1070, -170, -1395, -727, -2561, -4470, -5285, -5816, -4236, -2110, -1697, -987, 157, -403, -2628, -3348, -3862, -4033, -3960, -2789, -1011, -2877, -2017, -1395, -731, 1895, 1045, -706, -615, -698, -3310, -5773, -1150, -652, 1043, 3067, 2223, -942, -1899, -626, -3814, -2684, -1476, -510, 2057, 2980, 2205, 2553, 2620, 2859, -146, -3471, -3009, -4071, -5090, -5011, -3423, -1387, 392, 2984, 4551, 2145, -1939, -356, 283, -465, -111, 4583, 6756, 982, -1225, -2243, -447, -672, -1859]
882302a859l609L612L362K65j783k761J321J362P51j491r89J16J212n36j129k219
883591d375P94L768K144m22r20m80K33m89j935k762J503K480J92K641j791j801
884880a220J647k601K61J858j534L76j907P44j133J087l00N57P06j888M59N07
886169b381J619p35N5r1l06O69J567l103j864j062L094N84J350l270l569L413
887458d030L977J319j552O62k049K109L119O70r04l848r30K668j774j133O75j501
888746b522k139L91K27P88k502o83M69k63J67J488J16P36k794L42L259J360N39
890116a021L194l943q32J671k405j685O56L993K699j390l201j53j924j360O7M70
891405e164L632J948p79J95J009l006j856K926k707l956J630N207M078K364k321
$$ y = [-1859, -5468, -1856, 1506, 1771, -12, -2773, -1452, -90, 661, -830, -1819, -1703, -491, -1027, -2156, -4375, -3581, 187, 2331, 1909, 989, 509, 742, 253, -1682, -4444, -2941, -461, -269, 2372, 581, -1220, 427, -2174, -1913, -55, -1589, -1213, -3120, -2376, -3509, -2422, -2722, -2165, -1459, -3347, -2888, -2381, -762, -1497, -1442, -1533, -1839, -1170, 397, -2706, -4570, -5632, -2538, -1954, -604, -3874, -7443, -4030, -53, 1266, -286, 376, -1673, 436, 3555, 4225, 3321, -527, -1457, 1211, -563, -1696, -1021, -2522, -4661, -4270, -4043, -3255, -5757, -6440, -5971, -6234, -6067, -4579, -4463, -3727, -6521, -6179, -2920, -1560, -1021, 2173, -1770, -2602, -931, -3336, -5021, -4365, -372, 2327, 937, -2264, -2417, -4341, -5701, -5634, -5164, -1532, 416, -363, -168, 841, -2165, -4021, -1095, -3802, -7758, -6128, -921, 3157, 5521, 3200]
892613C200p14K35j307k070J605j608l044K317L537J077k129k008j950N75k14
893821b498L148P62k631n20m29L65J395J673O92j75j424J255Q13m05k319p01M98
895191e01J242J290k221j593p55R74N31q2K053J839k143k377N8K752j378l01J657
896560A045j637r65J027j327J675K066J831M33m470j230k096J110J866k015J893
897769g94J362j390J05K69N6J107m70J448K42l96m245r75J156j17j637L179K794
899138A694j479R48J965k75l002j904O68J255p20J249J639q85k384J476N31q7
900427F89j589m03K460K187M89j829m88l230J698R25r75m22j803l51N400N3j668
901796A143k90m32k369r70l47P03j367J41K567l78j59K189k745p47j571J921K761
$$ y = [3200, 2486, 2721, 1414, -656, 949, -659, -3703, -1386, 2151, 3228, 1099, -909, -2859, -2284, -2498, 650, 1412, -1219, -1739, -2168, -1803, -408, 1265, 1957, 1782, 358, 1613, 2426, 2021, -298, -999, -501, 741, 2031, -190, -1783, -2538, -1564, -1033, -1115, 938, 2777, 634, -1743, -1685, 1067, -311, -612, 1045, -592, -1557, -530, -1857, -182, 1884, 3715, 4148, -322, -1552, -3648, -2538, -672, -2687, -794, 568, -822, -717, -448, -392, 715, 245, 1693, 1935, 1539, -2706, -3681, -2525, -2642, -4279, -1100, 1694, 215, 1163, 3128, 2853, -149, -2053, -1385, -130, -850, 399, 2038, 1153, -1231, 245, 776, 689, -900, -1303, 1157, 3344, 3833, 2004, 1516, -1714, -16, 909, -66, -488, -2291, -2642, 2758, 2811, 1143, 853, 421, -1948, -2918, -3265, -2562, -3929, -3788, -1221, -1599, -1758, 431, -2314, -3061, -4632, -2711, 50]
903166E0J550q59J782m91l17J75k162j229j179k821q74k86J832N24q60n96O52
904535e109q03P02L063o14R79L673Q87P43j828j868j145m44K728p56M28J604J061
905905C301j597J04O8p85j958J043l113k071K639L92k346N12l64j245M357q7p7
907274a227R62j759R06j543j007p36J573J422j106k52J575l80p87j368J481N81
908563a665O68j469J61J257J913R21J409n88k035l12j912Q01k05r77r0K008k838
909932b953r45M789Q80O49k603j878J929l01l861m22K806m66k829K240O67J218
911221a080j440q74J88N63L669q58J45k6P36J355P69j423k32k744l98K074K098
912590B522J21k053j451k725j180M67J437J938L70L65J66l701o34K805J32r33
$$ y = [50, 1600, 741, 2523, 2032, 1715, 1890, -272, -1501, -2680, -5501, -6375, -6661, -4829, -4305, -5165, -5761, -5109, -5912, -5210, -2147, -2761, -1782, 1891, 2778, 3521, 1693, -175, -1320, -1764, 964, 208, 636, 2240, 3301, 1704, 1808, 1876, 1091, -867, 176, -2937, -5008, -2369, -1977, -4323, -3811, -4175, -5420, -1063, -1150, -1227, -265, -2024, -1118, -2661, -3668, -4404, -2831, -1409, -2515, -2767, -1192, -1572, -2359, -3727, -2246, -1665, -997, -2466, -2305, -1048, 865, 1786, 3195, 2607, 572, 260, -1652, -851, -1056, -2033, -2123, -115, -2953, -3898, 891, 1771, 2420, -183, -2061, -132, -433, -4294, -4716, -1910, -2376, -5205, -2965, -2298, -1080, -2520, -3394, -3206, -2643, 1026, 168, 313, 287, 1023, 2378, 3147, 1724, 1492, -1252, -1650, 424, 2522, 2643, 590, -861, -3586, -4766, -4299, -2862, -924, -554, -189, -23, -3724, -4358, -1553, -1421, -2354]
913879b354K392j382J645K600o46l829k935j391n0N05J279j103j267J04J481K005
915168b946K088k525j768L86J540m33P66j508J458K260l208l401J920O051J595
916377B275m14R12K20j779k668j820Q50L293J826k171l954k119L533q89k19K79
917665b845k439N56L551J816j909l41k94R74J884j625M04J283J042L40m486M73
918955a616J422j165p44k175K709O69m424R28J946l662J366J127J008J882m34
920162a163p38j346K374l54j231m83L390j96j209j339K719M059K835m388n256
921371b326J303J744O60o49j627K045K49k62r6M1j352M60L329j273m488M30r12
922740b724k496J255J295J448M81n4r47N57l6J572J515r29m16R62J772j075m470
$$ y = [-2354, 38, -1344, 301, 2901, 2255, -1574, -4509, -5900, -5950, -5445, -4166, -5269, -6536, -6432, -4951, -2946, -858, -3383, -5151, -4765, -3225, -3658, -2892, -4400, -2942, -682, -3890, -7291, -5371, 680, 2275, 1861, 2773, 2993, 1214, -1454, -3274, -2424, 869, 2695, 524, -3430, -5549, -2016, -2905, -3124, -2845, -5284, -4728, -1177, 639, -1270, -1611, -1905, -931, 953, -672, -268, 1015, 2057, 2397, -2089, -1616, -194, -1359, -2103, -4278, -1569, -900, -5324, -4396, -2450, -6112, -4746, -3619, -2611, -729, -1163, -1901, -3247, -873, -1227, -2458, -2941, 449, 253, -956, -2295, 424, 4483, 7318, 2930, -2326, -1023, 721, 1381, 732, -895, 1150, 1399, 1137, 1041, 1082, -270, 190, 3519, 2246, -2242, -1812, -2724, -5220, -3965, -2670, -1222, -741, -795, -1742, -1185, -1221, 351, 1866, 937, 521, 1483, 3255, 2180, -2290]
924110b290k420p73K012L587P81m12p23k080o41O44K91L589K593K89k669j974
925398a96L84J002Pp66O59K60j944k599J973R70M14O50l11m259m343R14N42P33
926849e910q00N48K114K517o94o67m80j053k50J268L025J068j366N54j848J006
928137i68J136k196k225p94L226K196l40k784p52j691J103L056K783r32j059P3
929427a68p70k177l08j601K149M644L43k324j873j189P54K261O41R46K674K695
930715F697j345o094j400j869J226R14J905Q51k364p35l117J475L606O75l272
931924b847l169r03L749M31J170j865N47K788R17j110J1J300K88j257p32M13j332
933293a601K75K231J456m623J281N294j188n22j858k455J842J460J77p74J265
$$ y = [-2290, -4710, -5483, -3471, 116, 897, 485, -238, -2318, -2959, -2315, -2024, 1565, 4158, 4447, 1778, -196, 188, 1190, 1197, 431, 1090, 1350, -594, -3193, -1220, -250, 164, 814, 503, -3756, -8099, -7185, -6643, -5910, -6710, -6162, -4048, -1531, -2225, -2892, -3372, -4425, -4675, -3407, -382, 686, -680, -126, -1974, -968, 168, -2028, -4253, -5047, -1821, 375, 35, -2749, -3501, -5192, -4089, -1033, 1750, 818, -241, -168, -938, -3115, -3423, -5024, -2875, 1769, 2112, -212, -2085, -3274, -2520, -259, 382, 1328, 4002, 6697, 5352, -742, -2142, -4011, -2785, -1871, 34, 885, -1479, -2214, -5331, -3856, -250, 425, -2847, -6016, -6919, -3170, -2739, -1569, -3434, -2887, -99, 818, -292, -281, 1019, 1307, 50, -682, -269, -1601, -1326, 905, 2361, -2262, -981, 4313, 3125, 2603, 745, -1710, 132, 1592, 1769, 995, 2260]
934502B260j507k735J52j514j18K537K424J748m207m47p83p67J552l51r78J687
935790a047n13Q21K3rJ812m2R02J568k055l258l41k602J323L55L38J478L753M65
937240B971j658k732j450L984Q08n515Q65N55Q2j74j33k057K333J83k539j28L074
938609a531J855N46j16k182r44p38O40l00J483M11j937k551j092K310L219J559
939899F32Q57P3j258k004j729J955J354j727q55J349K467k445k671j376j441k642
941187i461j106K828K774P13M019J965k365p8r3J62p64j606J007j059L31J123
942476a610J001P79j062n50J780l37l41k383m59K017p3K381M34j491l95k356j498
943845d163j034j51L42j162K761L93O52K043K658k390q58K565k823k066j821O72
$$ y = [2260, 753, -1982, -1830, -3344, -3462, -925, 1499, 3247, -960, -1407, -2190, -2957, -1405, -1756, -2734, -1047, -1560, -739, -716, -725, 1087, 1045, 1947, 3515, 1460, -1798, -2139, -4741, -3418, -3063, -2725, -1247, 2506, 2971, 1313, -1419, -2869, 1115, 1923, -3592, -2727, -2172, -2090, -2264, -2397, -4454, -2121, -1938, -4477, -4605, -1531, 324, 870, 754, -1428, -2372, -3110, -2470, -2770, -1287, -876, -2813, -5364, -6456, -4146, -927, 632, 1489, 1562, 304, -1700, -3429, -1474, -120, -1847, -2702, -1353, 1114, -1331, -4002, -5378, -6819, -9461, -10567, -7739, -4965, -4252, -233, 1732, -633, -711, -804, -642, -1406, -3012, -2005, -3064, -2733, -1610, -609, 170, -892, -1442, 338, 1, -340, -2723, -3182, -1165, -1238, 1143, 1577, 86, -309, -2665, -4163, -5197, -5348, -5006, -6168, -3407, -3014, -2362, -319, 2339, -51, -909, 1656, -1167, -3233, -5054, -4382]
945135d382J036K451L75O04Q07k620l73j257L863J257P35q93k944o65j080k240
946423e326j986j076L42L041N90K315J285K808l330K48K77q0K284N1j947k114
947712b618J002J048l032J51K181N56j920J199k388k408j720L405K099P27K198
948920D80K74J78p51n34k192J298K848j29Q43r54q13m2R95q41M74r75m59K234
950371A934k77l575j222J256J973j427J57j738k124j064N06K243k03o91j534p53
951659f539J740N02L312J493J251K579M03m292J850k511l489k313Q63q54j928
952868g933L354L084r31M24P82j233P55k097r67M748J444k979Q98j52q74j984
954156c661L6j457J154J711J561J000O77L16r13k96j887n13K084k017o34J267
$$ y = [-4382, -3346, -895, -520, 84, 891, -1729, -2102, -3359, 504, 1761, 2496, 1603, -1341, -2006, -3086, -5326, -7312, -8388, -8046, -5005, -4415, -2100, -815, 1993, -1337, -1089, -812, -892, 1392, 1443, -504, -2618, -1616, -568, -3600, -3449, -1268, -712, -2632, -1433, -3821, -6229, -7949, -4544, -2445, -1718, 480, 754, 932, 181, -353, -2545, -1247, 1601, 1472, 2315, 1361, 548, 506, 1501, 660, 1134, 159, -300, 1934, 1657, -1918, -3140, -1884, 89, -1338, -1181, -2919, -5043, -6107, -5601, -3358, -3561, -4252, -5786, -6539, -4799, -4297, -985, 508, 1759, 4338, 4741, 449, 2299, -212, -3701, -6014, -5151, -6005, -7933, -4579, -1495, -2426, -2002, -1220, -2453, -1698, -3795, -4762, -14, 1430, -1549, -651, -803, -1677, -3661, -3625, -5082, -3928, -2217, -656, 344, 1021, 1337, 424, 128, -1759, -2272, -188, -2205, -2839, -1572]
955446a572K166j833L32q5M077L352l127k530j602J65q97Q0K823J399k96l780
956734a328K439K946n20k848j744J295Q27J582J322l997L02J751J208l001j358
957943a124j183P47K428j61k270k404J719J36j714J239l50m40M54j774J244J878
959231a575J382k67O95N43J008j016j545J854k435l12m62M65k537j035K378L598
960521G39J456L53k38l353k077J31J654j529P20j81p79j977J563K694J637M23
961809A236k512l809M680M04k56j60l60j847k639O39K948j522p20K836R11j653
963098a824J647m042k200J625q38M256M10j605J860k552j854K191L965p95k229
964306a985J871R1j487k254P08j57L310n94J18r47l86n1Q94J14q57K179j635R19
$$ y = [-1572, 594, -1239, -907, -992, 3085, 6437, 3310, 780, -822, -657, -1554, -1474, 1349, 2748, 2452, -1328, 1111, 4057, 3537, 689, -1055, 240, 1067, 2649, 3971, -26, 276, 2027, 3235, 234, -1124, -2307, -1560, 868, 707, -1563, -3967, -2248, -2112, -3826, -2587, -2937, -3377, -2923, -4697, -3453, -1575, -193, -460, 235, 778, 1786, 770, -775, 1079, -1356, -1668, -2130, -1665, -4202, -5237, -2859, 739, 2195, 2548, 2310, -1043, -3120, -2989, -1335, -2864, -2144, -2325, -3104, -5081, -3518, -824, 813, 1236, -1276, -5085, -405, -1, -257, -417, -777, -2624, -5263, -4624, -1676, -3198, -3918, -1082, -171, -1824, -177, -4219, -6419, -4794, -5632, -1376, -966, -2571, -711, -3263, -5117, -2926, 1039, 244, -1985, -114, -23, -1510, -3764, -3056, -3213, 97, -497, -379, -1326, -1712, -1763, -869, -755, -1612, 567, -1068, -149]
965757a49J25k254K123j368n73k50J661M36M35k523N74R4k802l1O179j641j124
967126a088N71QK208k46k827P99N351J17m208k718N42M221J839j067j938k241
968415f77P88p56r88J881Q33j333J273j262J41J588m145j982J324K520R2J205
969703E02L56k787K075k064k755L52J782K081q61K086K21kj237J057q0k240j451
971073b965l92L62n9L44J341N60l14m232J227K499J350Q54K82K604m8L57K6j127
972523B669k800m654L06J593j080K599j497K025R36j56K145K423j861k945k211
973732b508R75j122j710m6J651K494j168l536K395R06p40J107M65L23r62l98j255
975100c129P67q21J060K232P13j97k921j822O19n74j315N22J136n11O5M476j802
$$ y = [-149, -24, -2278, -155, -1523, -2096, -2346, -685, -249, 186, -2337, -1763, -1669, -4471, -4502, 1677, 36, -1088, -517, -509, 1699, 1453, -1374, -575, 4776, 4893, 685, -2033, -1491, 2730, 4569, 3502, 1564, -677, 111, -645, -1633, 248, 1081, -252, 1021, -241, -100, 1488, -2657, -4639, -3315, -795, -703, 502, 858, -1929, 146, -1918, -4673, -4321, -2539, -458, -1319, 767, 988, 986, -251, 806, 726, -1514, -2965, -3357, -2995, -3054, -2710, -1369, -809, -1123, -5355, -4128, -1629, -279, 575, 857, 3461, 3413, 3770, 3796, 2669, -131, -4785, -4479, -2886, -3966, -1367, -2864, -839, 97, -59, 2086, 4509, 2648, -297, -2508, -1533, -2655, -4365, -4411, -2760, -266, -1434, -4970, -2575, -1669, -2409, -1302, -837, -514, -1476, -1874, -3129, -2362, -3183, -2123, 109, 822, 625, -2296, -4118, -3499, -4073, -5388, -4866, -3730, -4241, -4176, 300, -1502]
976470a502l800J174K009k91r09K052j338J308k981N91k652M42J220J595l945
977678g027L643J596K444J226J483k316j657R10P22q98j039L314k573j134k06
978887a512j3K366j219K19K570m170j785K85j629k019K388L003j35l192p60K819
980175b784K716r43j174J310J303L22o13j590J623J179j201p98j165m92J815j848
981465b340l27N97J24j128J033K898J380k655j869Q07j81j803j54J960j433J089
982753b002j236Q00L63j415L182R74k95K311m75K41l714k807J648q32k56K047
984042a466K841n70N27K009j281l168K480k60o32j607N40j389P3K594j291L0J276
985411G06j311O64K419r68p93p80o95k94m754k60K45l77L369L264J215k224k486
$$ y = [-1502, -5302, -4128, -2119, -2410, -3319, -1267, -2605, -1297, -4278, -3687, -6339, -5897, -4677, -3082, -7027, -3384, -1788, 656, 1882, 3365, 1049, -608, 302, 1024, 126, -913, 2401, -172, -1306, -1512, -1525, 841, -378, -159, 2411, -1759, -3544, -3259, -4888, -6907, -4519, -1516, -1651, -4843, -5603, -2784, -68, -1011, -2185, -875, 428, 750, 137, -1453, 170, 1349, 148, -650, -1815, -2307, -492, -2340, -2667, -2070, -1946, -3074, -2041, 857, 2237, -418, -2287, -1480, -1661, -3464, -3618, -1658, -3091, -2002, -3238, -2438, -2075, -3490, -308, 666, 371, 2682, 2207, 2448, -1266, -4073, -2425, -3257, -3513, -1466, 1375, 805, 1332, 3341, 2060, -1108, 1372, 1112, 480, -1127, -587, -1976, -1903, 691, -600, -570, 706, -605, 59, 2478, 1510, 717, -63, -758, -1052, -5806, -6066, -5821, -6198, -2829, 435, 1650, -574, -3060]
986781c060J671K43q94K627m45k788N93L02k42J553K360M91k005k423k104K693
988070a428K657N58j998j205J128k597n66M738J880j914j765j937J017K072J709
989278B349j035k774j025R66N17j158N25J176K281K24n37j817p52K282Q00k692
990567f70k76K242j03j225J96j372k552k11m08J673N90k71m1K377K704j072j008
991937E73k208Q9J869j276k454J210O50j601j959J022Q09J807J352M21k96J063
993225A071j318k253J380J954K160j465p7J67n402k014J983J313m83L50K299m426
994515d761j187l635r74L936l53J604K365o39N73K193P03J137j359J057J642k353
995803e1J736k916j931p80J450L146k871o59K086q88j993Q33K712m04j591p59
$$ y = [-3060, -1389, -1146, -2040, 587, 142, -2646, -2053, -1751, -1993, -440, 1920, 2411, 406, -2017, -4121, -1428, 1229, 1787, -211, -1416, -288, -2885, -3451, 1287, 3167, 1253, -512, -2449, -1432, 640, 2349, 1314, -1460, -2485, -1519, -1002, -2160, -1635, -459, 1822, 2046, 1509, -308, -1060, 1222, 2022, -670, -946, 1296, 1193, -32, 164, -1208, -3760, -3971, -4379, -2706, -2116, -2387, -2428, -51, 2653, 1581, 573, -1635, -1546, 323, -953, -3407, -2197, -1547, -3148, -5107, -4085, -3276, -1469, -117, 304, 8, 1071, -247, -2500, -1120, 834, 2994, 1529, 1452, 1619, -3783, -5797, -3814, -2501, -2984, -2634, -335, -4761, -5948, -9583, -10557, -6621, -6974, -5370, -3005, -3644, -3071, -878, -175, 962, -397, 660, 2302, -51, 1685, -1231, -3162, -3942, -2492, 654, -2217, -2876, -790, -1678, -3671, -2838, -126, -530, -2121, -2880]
997092b880J998L936k793j28m25k723M46N12q66m75M058j02R50K378K274P82l71
998461F571m763l467k851M41M12J257K297K037M71l024r03K91j871J703P83QM67
999831a41J576l077j698L01K258J987j848j640K171K060J066m91j517J712k85
1001039B434j943n26k616m42O72q90j28r79Q51O88o12q85q91J501J480K097j47
1002409c36Q81r32L64J977
$$ y = [-2880, -882, 3054, 261, 133, -292, -3015, -2569, -2057, -2923, -3398, 660, 558, 1508, 3886, 6160, 6942, 6571, 1808, -1659, -4510, -4069, -3657, -2400, -103, 1934, 2405, -619, -1522, -1231, -3102, -1399, -616, -608, -141, 1435, -1642, -3340, -3039, -781, 1206, -642, -2282, -111, 1949, 3015, 2524, 1007, 2719, 2434, 491, -35, -2651, -3093, -2421, -3311, -3439, -4418, -3567, -2879, -3491, -4376, -5267, -3766, -2286, -189, -336, 545, -387, -23, 1954]
##END=
