##TITLE= PAMOIC ACID in DMSO
##JCAMP-DX= 5.00 $$From Command Line Converter 1.0
##DATA TYPE= NMR Spectrum
##DATA CLASS=  XYDATA

##ORIGIN= Exported from Command Line Converter 1.0
##OWNER= SVB
##$URL= http://wwwchem.uwimona.edu.jm:1104/software/jcampdx.html
##SPECTROMETER/DATA SYSTEM= NUTS EXPORT
##.OBSERVE FREQUENCY= 300.149506
##.OBSERVE NUCLEUS= ^1H
##INSTRUMENTAL PARAMETERS= 1H
##XUNITS= PPM
##YUNITS= ARBITRARY UNITS
##XFACTOR= 0.0000043007
##YFACTOR= 1.5165470000
##FIRSTX=   4.517287
##FIRSTY= 17730.000000
##LASTX=   8.817900
##NPOINTS= 5288
##MAXY= 1505971.000000
##MINY= -10576.000000
##DELTAX=   0.000813
##XYDATA= (X++(Y..Y))
1050360A1691j328K36k021j062J495o48k26R92j285J587j80j182J488k64J816k743
$$ 11691 10363 10599 8578 7516 9011 8363 8137 9129 7844 9431 9251 8069 9557 9293 11109 8366
1053377H366J593l87j633j058J052n23L142k476K139j059j403N28K320k30O67j891
$$ 8366 9959 9572 7939 6881 7933 7410 10552 8076 10215 9156 7753 8281 10601 10371 11038 9147
1056393I147N88l21O17K126l996L728k657m50J571k47o84k92J964j165j533J330
$$ 9147 9735 9414 10031 12157 8161 11889 9232 8782 10353 10106 9422 9130 11094 9929 8396 9726
1059429I726j092r9J482j563M16l80K115J427l764J735M96p9n16p77k14J1J195
$$ 9726 8634 8535 10017 8454 8870 8490 10605 12032 8268 10003 10499 10420 9904 9127 8913 8924 10119
1062634A0119j161K30Q96N16o11n79L153m467Q56J449j981L816l71n18j760j071
$$ 10119 8958 9188 10084 10600 9989 9410 12563 8096 8952 10401 8420 12236 11865 11347 9587 8516
1065674H516K599k8p96J373j284k76K343j671r33K415k940K247J875l134J776o0
$$ 8516 11115 11087 10291 11664 10380 10104 12447 10776 9843 12258 9318 11565 13440 10306 12082 12022
1068709A2022o57J395k62p76k03j435N08R42k72k425O4J576J777k420M09J529l043
$$ 12022 11365 12760 12498 11722 11519 10084 10592 11534 11262 8837 8901 10477 12254 9834 10243 11772 8729
1071915H729J597L328k594O14k619J907R87m626N441m31k036j471J838j540J112
$$ 8729 10326 13654 11060 11674 9055 10962 11949 7323 12764 12333 10297 8826 10664 9124 10236
1074742A0236o59K642Q9j121l63J699j233q36o84K120p82Q90p30P94n27r54K275
$$ 10236 9577 12219 12308 11187 10824 12523 11290 10454 9770 11890 11108 11998 11268 12062 11535 10581 12856
1077971A2856j635K022L6j17j73n92J795k024m75O781n335j558K2N59Q30k237M59
$$ 12856 11221 13243 13279 13162 12989 12397 14192 12168 11693 18474 13139 11581 11603 12162 12992 10755 11214
1081172A1214L572k666K93K3r60J798J232k867K92O46q56J675k315k20M91o02P28
$$ 11214 14786 12120 12413 12436 11476 13274 14506 11639 11931 12577 11721 13396 11081 10861 11352 10750 11478
1084401A1478r92n1J621j120J30J202j300n66Q81Ll5M78K58j344K359k289J754
$$ 11478 10486 10435 12056 10936 11066 12268 10968 10402 11283 11286 11251 11729 11987 10643 13002 10713 12467
1087607A2467q16q63J04K330j36j045K966k416j760K116j195J458m67O24J153l658
$$ 12467 11651 10788 10892 13222 13086 12041 15007 12591 10831 12947 11752 13210 12743 13367 14520 10862
1090647A0862J589K303q18O12k120J129L86M52J05J76L41j689R59j116R82J191
$$ 10862 12451 14754 13936 14548 12428 13557 13943 14395 14500 14676 15017 13328 14287 13171 14153 15344
1093659A5344P30l073K556l295L873j660J345K32J073k34O7j05j513J187J329j956
$$ 15344 16074 13001 15557 12262 16135 14475 15820 16052 17125 16891 16958 16853 15340 16527 17856 15900
1096698A5900J347j332J867j140J710K4r47K309m37n15P36O73j427J745j301j035
$$ 15900 17247 15915 17782 16642 18352 18376 17429 19738 19301 18786 19522 20195 18768 20513 19212 18177
1099715A8177N271k487N1k71K25o30j067L245l398J572n10M82l5j272n74K638L75
$$ 18177 23448 20961 21012 20741 20966 20336 19269 22514 19116 20688 20178 20660 20625 19353 18779 21417 21792
1102944B1792j018K03N33R07o12J177Q06n59J043j607j29J714J286J137j168K023
$$ 21792 20774 20977 21510 22417 21805 22982 23788 23229 24272 22665 22536 24250 25536 26673 25505 27528
1105956B7528P98j61K391q13K97J536K715j823L842m28J53J139j567j728K766m115
$$ 27528 28326 28165 30556 29743 30040 31576 34291 32468 36310 35882 36035 37174 35607 33879 36645 32530
1108996C2530J526J200j168J662J94J656j285K207j051J772j83J447q91J722M274
$$ 32530 34056 35256 34088 35750 35944 37600 36315 38522 37471 39243 39060 40507 39616 41338 45612
1111819D5612j557P00N84M594j167M802j138M154Q6O301J139N304L887K117M874
$$ 45612 44055 44755 45339 49933 48766 53568 52430 56584 56670 62971 64110 69414 73301 75418 80292
1114669H0292P243M990N152P000O685R178J0612J2860O849J6883J6266J7781J8430
$$ 80292 87535 92525 97677 104677 111362 120540 131152 144012 150861 167744 184010 201791 220221
1117114B20221K6596K9142L6570L8408M6731N0182N1647M7591L5506K0531o064
$$ 220221 246817 275959 312529 350937 397668 447850 499497 547088 582594 603125 597061
1119203E97061k8763m5440n6651o0089n3372m5065l9339l4890k6745j8934k0952
$$ 597061 568298 522858 466207 406118 352746 307681 268342 233452 206707 187773 166821
1121270A66821j5677j2493j1105r317p590r494n767k438m129l055k573m581j579
$$ 166821 151144 138651 127546 118229 110639 101145 95378 92940 88811 85756 83183 78602 77023
1123737G7023l903j058l798k568j031l242j433j475j540j238m067P94k541o37k26
$$ 77023 73120 72062 68264 65696 64665 61423 59990 58515 56975 55737 51670 52464 49923 49286 49060
1126584D9060k484l442O71j288m7k527l02k814j417q88p00m5n36l575J587o86l287
$$ 49060 46576 43134 43805 42517 42470 39943 39641 36827 35410 34522 33822 33777 33241 29666 31253 30567 27280
1129789B7280K411k991O2j203L76j051o05J70K1j379L77j268k841K907j376N16
$$ 27280 29691 26700 26762 25559 25935 24884 24279 24449 24470 23091 23468 22200 19359 22266 20890 21406
1132829B1406j164O82r88O93k578J197Q19j268J5m41j913J474l057M129j509l84
$$ 21406 20242 20924 19936 20629 18051 19248 20067 18799 18814 18373 16460 17934 14877 19006 17497 17113
1135845A7113k16o96q2J925q04p97P09p06J500J66K97r5q54j696M24j71R14K68
$$ 17113 16897 16201 16119 18044 17240 16443 17152 16446 17946 18112 18409 18314 17460 15764 16188 16017 16931 17199
1139240A7199l284K737j104j518J625J311k285p0K32n3Q47k879J751k22j201j881
$$ 17199 13915 16652 15548 14030 15655 16966 14681 14611 14843 14790 15637 12758 14509 14287 13086 11205
1142276A1205J150J622k441o14K838K033l918J051k205K784m358J156K679k798
$$ 11205 12355 13977 11536 10922 13760 15793 11875 12926 10721 13505 9147 10303 12982 10184
1144914A0184K349n15j103J676j059p35K299k316K98Q97k873N41J395l50J046l348
$$ 10184 12533 12018 10915 12591 11532 10797 13096 10780 11078 11975 9102 9643 11038 10688 11734 8386
1147949H386L107l130K987j936K242P26m65m56J3J150r08M97j564jQ69j778l56
$$ 8386 11493 8363 11350 9414 11656 12382 11917 11461 11474 12624 11716 12213 10649 10648 11517 9739 9383
1151155I383M43k223J830j139m25J820r32L94l326J038l75R15Q04m34J571J55k801
$$ 9383 9826 7603 9433 8294 7869 9689 8757 9151 5825 6863 6488 7403 8207 7773 9344 9499 6698
1154384F698J362L10o46L1j376R62q56l72N57J525m21m38Q9j211m33K531j358O5
$$ 6698 8060 8370 7724 7755 6379 7341 6485 6113 6670 8195 7774 7336 7425 6214 5781 8312 6954 7019
1157778G019k764K283l007L502J07Q42q49j5l218L032j208j117K348j453K55j630
$$ 7019 4255 6538 3531 7033 7140 7982 7133 7118 3900 6932 5724 4607 6955 5502 5757 4127
1160818D127K658O84j665j61j203O03J624k889K421k078O41J60M32q58L224k978
$$ 4127 6785 7469 5804 5643 4440 5043 6667 3778 6199 4121 4762 4922 5354 4496 7720 4742
1163830D742o53R75P88j387k18M36R44Q71k181K028j120j884M942k506Q81J86j292
$$ 4742 4089 5064 5852 4465 4247 4683 5627 6498 4317 6345 5225 3341 8283 5777 6658 6844 5552
1167059E552J101j148J99n31Q18L75k89J49J020j882J639j761k36r52R93M52M5
$$ 5552 6653 5505 5704 5173 5991 6366 6077 6226 7246 5364 7003 5242 5006 4054 5047 5499 5544
1170265E544Q01m19j754j445J660P24r28j148l208N147L514L183j972m050J064
$$ 5544 6345 5926 4172 2727 4387 5111 4183 3035 -173 4974 8488 11671 9699 5649 6713
1173111F713j366Q3k21j340j05r9m41k017L019k027K476j956j89K985j913p35R31
$$ 6713 5347 5430 5209 3869 3764 3665 3224 1207 4226 2199 4675 2719 2530 5515 3602 2867 3798
1176317C798n64J052j277J92k838M011p01j465J823k503L002k513K240M53j777
$$ 3798 3234 4286 3009 3201 363 4374 3673 2208 4031 1528 4530 2017 4257 4710 2933
1179167B933J053j480J214k324K184j981j213J810N6n89L21P03j501j479K854j184
$$ 2933 3986 2506 3720 1396 3580 1599 386 2196 2252 1663 1984 2687 1186 -293 2561 1377
1182179A377M97K625j636j053q56p0K07O00Q57j090J546O25l329K536k515J55l62
$$ 1377 1874 4499 2863 1810 954 884 1091 1691 2548 1458 3004 3629 300 2836 321 476 114
1185408A14J189p92K576p17N84j854K450o68j292j160K366j497L48m43R50j747
$$ 114 1303 511 3087 2370 2954 1100 3550 2882 1590 430 2796 1299 1647 1204 2154 407
1188425D07m8J566k776J445m08r9J628Q83K94j457J146k942L189p65j324J404p84
$$ 407 359 1925 -851 594 186 87 1715 2598 2892 1435 2581 -361 2828 2063 739 2143 1359
1191630A359p71K1K15K048m01p8o92m06J60j852J322r68N59J09k50K229k617L610
$$ 1359 588 609 824 2872 2471 2393 1701 1295 1455 -397 925 -43 516 625 375 2604 -13 3597
1195048C597m729J493O90j007K423J17q69J385k507O1Q52K875k459j764o4K399
$$ 3597 -1132 361 1051 44 2467 2584 1715 3100 593 654 1506 4381 1922 158 94 2493
1198060B493q42n67R57o61R03p36j518j70N32k58J07K78R60l87J056j211j881J567
$$ 2493 1651 1084 2041 1380 2283 1547 29 -141 391 133 240 518 1478 1091 2147 936 -945 622
1201478F22m60M51J276k742K596p16O51j080m09J612k277M29O1N28r11p9J174J86
$$ 622 162 613 1889 -853 1743 1027 1678 598 189 1801 -476 -47 14 542 -369 -448 726 912
1204873I12j419n16K763j508N05J604k093J061n82J20N34o81j090K041j719J91
$$ 912 -507 -1023 1740 232 737 2341 248 1309 727 847 1381 700 -390 1651 -68 123
1207913A23n22K231q37k409J959K70k043J080J13J996k014j74J419o92Q8m41k60
$$ 123 -399 1832 995 -1414 545 815 -1228 -148 -35 1961 -53 -227 1192 500 588 147 -113
1211119a13n37k746L119K75M69o24N25l52L22l73n29K316j983L89j447J918J33
$$ -113 -650 -3396 -277 -2 467 -157 368 16 338 -35 -564 1752 -231 158 -1289 629 762
1214347G62j125k50p79L691j523J34o97j17r85J384o26l74K311q08j622J593k437
$$ 762 -363 -613 -1392 2299 776 910 213 96 -889 495 -131 -505 1806 998 -624 969 -1468
1217553a468K217L56J20K38j051R31l062L360j441j372K914k695K280r5j182K002
$$ -1468 749 1105 1225 1463 412 1343 -1719 1641 200 -1172 1742 -953 1327 1232 50 2052
1220588B052k39j712J461j230k22q75J169j375K281j660k41O71j150j466K303j99
$$ 2052 1813 101 1562 332 110 -765 404 -971 1310 -350 -591 80 -1070 -2536 -233 -432
1223605d32l58J847r10M95l314L271j335o95J010M49K175j956j181L258l302j035
$$ -432 -790 1057 147 642 -2672 599 -736 -1431 -421 28 2203 247 -934 2324 -978 -2013
1226621b013M34J119O49j27k403L136j599J589l409J503M41J032j506k289L126
$$ -2013 -1579 -460 189 62 -2341 795 -804 785 -2624 -1121 -680 352 -1154 -3443 -317
1229468c17L67J032j774m00L35k47Q87k066L79R81J390o61k507K228o90J463m62
$$ -317 50 1082 -692 -1092 -757 -1004 -117 -2183 -1804 -823 567 -94 -2601 -373 -1063 400 -62
1232696f2L59j904J521J392j687J337j622P90k688Q45L58J030k191K090j605K75
$$ -62 297 -1607 -86 1306 -381 956 -666 124 -2564 -1719 -1361 -331 -2522 -432 -2037 -1762
1235713a762J043m49J442j138P82K7o83K57j466J554j331m39Q05K015j952N01N36
$$ -1762 -719 -1168 274 -864 -82 -55 -738 -481 -1947 -393 -1724 -2163 -1358 657 -1295 -794 -258
1238937b58J2R78K01q99M90j090m17J21K158p23p39Q40J02j640n50r29J913k77
$$ -258 -246 732 933 34 524 -566 -983 -862 1296 573 -166 674 776 -864 -1414 -2343 -430 -707
1242332g07n29K037j359j521J939N83R95j839j082J730Q1l71N55l0l191L234l260
$$ -707 -1236 801 -558 -2079 -140 443 1438 -401 -1483 247 328 -43 512 482 -2709 525 -2735
1245538b735J604R76r16K203j105J93Q4r38J191j063j264N97J615m39k253K692
$$ -2735 -1131 -155 -1071 1132 27 220 304 -634 557 -506 -1770 -1173 442 3 -2250 442
1248578D42j236q66J865j016J06J188j575j56J148j311l36J165R34j288m15j520
$$ 442 -794 -1660 205 -811 -705 483 -1092 -1248 -100 -1411 -1747 -582 352 -936 -1351 -2871
1251594b871J589M66K17k576K951k332K416j317j1J204J766j153M97j392l98J714
$$ -2871 -1282 -816 -599 -3175 -224 -2556 -140 -1457 -1468 -264 1502 349 846 -546 -944 770
1254629G70j714m13p9J25O54M25j850J917J224k21j211M96k580K715j414K34R55
$$ 770 -944 -1357 -1436 -1311 -657 -232 -2082 -165 1059 838 -373 123 -2457 258 -1156 -922 33
1257835C3j168J397q61j006J344n16m86k66J086r8o67l84J530J523k354j61P38
$$ 33 -1135 262 -599 -1605 -261 -777 -1263 -1529 -443 -541 -1208 -1592 -62 1461 -893 -1054 -316
1261064c16m10j230K860k106J186j137n12O15J257k053J316J322l81k040K492j60
$$ -316 -726 -1956 904 -1202 -16 -1153 -1665 -1050 207 -1846 -530 792 411 -1629 863 703
1264080G03k099K229o38j123m11o46n3j735K167L0k89K514j974n32K267j423j185
$$ 703 -1396 833 195 -928 -1339 -1985 -2038 -3773 -1606 -1576 -1865 649 -1325 -1857 410 -1013 -2198
1267305b198l54M82N56J768p68J656k888L416j960j281R45J06N3L66j020k11R10
$$ -2198 -2552 -2070 -1514 254 -514 1142 -1746 1670 -290 -1571 -626 -520 -467 -101 -1121 -1332 -422
1270510d22O94n94o64j825J723n51M5k168N214l452R33j19l87J872o09j408K836
$$ -422 272 -322 -986 -2811 -1088 -1639 -1594 -3762 1452 -2000 -1067 -1186 -1573 299 -310 -1718 1118
1273739A118k43Q9P58l213J170L19k101J826P33j191o58J690M15j411q41J670j59
$$ 1118 875 964 1722 -1491 -321 -2 -2103 -277 456 -735 -1393 297 712 -699 -1540 130 -29
1276945b9M60n80q50K51O41O25q30k252J537K75J062j931O53J086m08r86k72J271
$$ -29 431 -149 -999 -748 -107 518 -312 -2564 -1027 -752 310 -1621 -968 118 -290 -1276 -1548 -277
1280340b77j499K046j116j17p68l06K110l50n25n72J279j42k561K544j747l04L215
$$ -277 -1776 270 -846 -963 -1731 -2037 73 -277 -802 -1374 -95 -237 -2798 -254 -2001 -2305 910
1283569I10j923M00J238j512Q61n63k38l86k137M081r89j253J546k00q9j169O06
$$ 910 -1013 -613 625 -887 -26 -589 -827 -1213 -3350 731 -258 -1511 35 -165 -254 -1423 -817
1286774h17m61j082m05K040Q17k965R44M9K576M86k019J304J69j450J0J063j126
$$ -817 -1278 -2360 -2765 -725 92 -2873 -1929 -1880 696 1182 -837 467 636 -814 -804 259 -867
1289999h67N82Q01p8j150J060o11q61J108j49j01m80K348l895J489Kk952K896P55
$$ -867 -285 516 438 -712 348 -263 -1124 -16 -165 -266 -746 1602 -2293 -804 -802 -3754 -858 -103
1293394a03J134l25j947P92k07P32j101M41J091O44p12k624J422L45Q38j926J411
$$ -103 1031 706 -1241 -449 -656 76 -1025 -584 507 1151 439 -2185 -763 -418 420 -1506 -95
1296623i5r74L46Q20O25l007K859j646M04p75l02L50l37j170J173R65J185k946
$$ -95 -1069 -723 97 722 -2285 574 -1072 -668 -1443 -1745 -1395 -1732 -2902 -1729 -764 421 -2525
1299828b525J162J514j102n83m51L13N43J068k489Q27J432j41L49j036m1j51p92
$$ -2525 -1363 151 -951 -1534 -1985 -1672 -1129 -61 -2550 -1723 -291 -432 -83 -1119 -1160 -1311 -2103
1303057b103J717j227J810k56j097m51J070r08O39m00J915j550q32K032m42O7j851
$$ -2103 -386 -1613 197 -59 -1156 -1607 -537 -1445 -806 -1206 709 -841 -1673 359 -83 -16 -1867
1306263a867J874p30j256K433k106R43N23j402N63n42k4J13n36J187k19m78N21
$$ -1867 7 -723 -1979 454 -1652 -709 -186 -1588 -1025 -1567 -1591 -1478 -2014 -827 -1046 -1524 -1003
1309468a003j849J991k35n91P39j501k78R89L40N62J743l812K246J38j69j681K00
$$ -1003 -2852 -861 -1096 -1687 -948 -2449 -2727 -1738 -1398 -836 907 -2905 -659 -521 -690 -2371 -2171
1312693b171P03OK01J211j379P72K03Q2J227j843J799q23j607l65K158j592M59
$$ -2171 -1468 -1462 -1261 -50 -1429 -657 -454 -372 855 -988 811 -12 -1619 -1984 174 -1418 -959
1315898i59L35P22O30j437J87j295R82N73j88P9J32j289K52K499k788J463K00K56
$$ -959 -624 98 728 -709 -522 -1817 -835 -262 -450 -371 -239 -1528 -1276 1223 -1565 -102 98 354
1319316C54o34j268R07j108J061k616R15R36K44m60l08j28K85p81P71L10J71J077
$$ 354 -280 -1548 -641 -1749 -688 -3304 -2389 -1453 -1209 -1669 -1977 -2105 -1820 -2601 -1830 -1520 -1349 -272
1322711b72p58L81j557J772L183l113O0M6j731q0K671K56j496q59R17l23L43J590
$$ -272 -1030 -649 -2206 -434 2749 -364 -304 -258 -1989 -2069 602 858 -638 -1497 -580 -903 -560 1030
1326129A030l06l117J837O63j726J038o69p88J358l330J876R5J008L66k439K189
$$ 1030 724 -2393 -556 107 -1619 -581 -1250 -2038 -680 -4010 -2134 -2039 -1031 -665 -3104 -915
1329146i15Q38N00n44N5K81o22j605J403j854M11k92J326j689K269p0P4J436k54
$$ -915 -77 423 -121 -66 215 -407 -2012 -609 -2463 -2052 -2344 -1018 -2707 -438 -508 -434 1002 748
1332564G48k988K454q80P15k258K607j256k7q04k194J741Q11l40J639k026P41O3
$$ 748 -2240 214 -666 49 -2209 398 -858 -885 -1689 -3883 -2142 -1331 -1671 -32 -2058 -1317 -1254
1335770a254l28R70K59K17j256J151k202L42J303o97mJ33J331k25j77k547K075
$$ -1254 -1582 -612 -353 -136 -1392 -241 -2443 -2101 -798 -1495 -1499 -1366 -35 -260 -437 -2984 -909
1338975i09N31j598k379K847L250m28o24o54q76J038k924j15J740J75Q55j577O68
$$ -909 -378 -1976 -4355 -1508 1742 1314 690 36 -840 198 -2726 -2841 -1101 -926 -71 -1648 -980
1342200i80m34J663m63r4q46K475j873J239j274j111R12q37K01n29J203j070K737
$$ -980 -1414 249 -214 -308 -1154 1321 -552 687 -587 -1698 -786 -1623 -1422 -1951 -748 -1818 919
1345405I19l554M94J687k576K274k91J029m29j135J229Q59k509L53n69K947m751
$$ 919 -2635 -2141 -454 -3030 -756 -1047 -18 -447 -1582 -353 506 -2003 -1650 -2219 728 -4023
1348445d023O73L255j876q38J619K4n79K78J324j869J528J662l016L344m978K829
$$ -4023 -3350 -95 -1971 -2809 -1190 -1166 -1745 -1467 -143 -2012 -484 1178 -1838 1506 -3472 -643
1351462f43K42k495Q67o6J585j97j993J346j291K700P49k690p8J214L45m96j622
$$ -643 -401 -2896 -2029 -2095 -510 -707 -2700 -1354 -2645 55 804 -1886 -1964 -750 -405 -901 -2523
1354686b523M82m79j08m00K394j122l77m7J082m8O36o30m69j952K238K254j659
$$ -2523 -2041 -2520 -2628 -3028 -634 -1756 -2133 -2180 -1098 -1146 -510 -1140 -1609 -3561 -1323 931 -728
1357892g28o88p93J120o69J443k40j589J811q41l36j40K278K17j122j862j993K324
$$ -728 -1416 -2209 -1089 -1758 -315 -555 -2144 -333 -1174 -1510 -1650 628 845 -277 -2139 -4132 -1808
1361121a808J1J109M70j569L13q38J256j668J836j170J143Q93J6r95k209K100j873
$$ -1808 -1797 -688 -218 -1787 -1474 -2312 -1056 -2724 -888 -2058 -915 -22 -6 -1001 -3210 -1110 -2983
1364326b983N37J179J07q79J685J206k616J173K52j992Q67j235K137r62l72J4R87
$$ -2983 -2446 -1267 -1160 -2039 -354 852 -1764 -591 -339 -2331 -1464 -2699 -562 -1524 -1896 -1882 -895
1367555h95j363L08P84J13J192l239J347R85q22J709k96J80J535j353K55k287q44
$$ -895 -2258 -1950 -1166 -1053 139 -3100 -1753 -768 -1590 119 -177 3 1538 185 440 -1847 -2691
1370761b691Q49q3j184k50L314k310K666k027j57q5K036k258J716m87N11m49J601
$$ -2691 -1842 -1925 -3109 -3359 -45 -2355 311 -1716 -1873 -1958 78 -2180 -464 -951 -440 -889 712
1373985G12o49j839j243K128m89o50Q86q10K317l173N85p32L453p89L60j703m02
$$ 712 63 -1776 -3019 -891 -1380 -2030 -1144 -1954 363 -2810 -2225 -2957 496 -293 67 -1636 -2038
1377191b038J755l99L33n39j157Q77O64j700M40K106j984J107J75l64j361J533
$$ -2038 -283 -682 -349 -888 -2045 -1168 -504 -2204 -1764 342 -1642 -535 -360 -724 -2085 -552
1380207e52J9j477J208j08n15J510k147J632j616K112k304J649j869J101N50n12
$$ -552 -533 -2010 -802 -910 -1425 85 -2062 -430 -2046 66 -2238 -589 -2458 -1357 -807 -1319
1383247a319j668J125J885L04O5r44r47R17o79j125j04J781j150k024L4K894Q27
$$ -1319 -2987 -1862 23 327 392 -552 -1499 -582 -1261 -2386 -2490 -709 -1859 -3883 -3849 -955 -128
1386448a28J41l55j246J746k9l150J178J044j908J426J09o85R36k127K484J82j237
$$ -128 13 -342 -1588 158 129 -3021 -1843 -799 -2707 -1281 -1172 -1857 -921 -3048 -564 -382 -1619
1389677a619K642k144J736k056r53L899k900J153n00R47k508J333j598R15N49j
$$ -1619 1023 -1121 615 -1441 -2394 1505 -1395 -242 -742 205 -2303 -970 -2568 -1653 -1104 -1105
1392694a105L07k95r81l09J217J554q94r52P73M83k929L230p52P11k415K67j40
$$ -1105 -798 -1093 -2074 -2383 -1166 388 -506 -1458 -685 -202 -3131 99 -653 58 -2357 -2090 -2230
1395923b230k134L854M41j414J722k44j794j704L546k018O35p26O72L73l15J413
$$ -2230 -4364 -510 -69 -1483 239 -5 -1799 -3503 43 -1975 -1340 -2066 -1394 -1021 -1336 77
1398935G7q00J92j367J489n2p69j356L319m070L071q07k112K823r9L39k298K346
$$ 77 -723 -531 -1898 -409 -461 -1230 -2586 733 -3337 -266 -1073 -3185 -362 -461 -122 -2420 -74
1402163g4p98k29J116k242j338L754m511L641j679K447l586J222j013K285K83k235
$$ -74 -872 -1101 15 -2227 -3565 189 -4322 -681 -2360 87 -3499 -2277 -3290 -1005 -722 -2957
1405180b957K409j567m48J754j482O02K4K324k189o0J355k32R9j928K917r00q48
$$ -2957 -548 -2115 -2563 -809 -2291 -1689 -1665 659 -1530 -1590 -235 -467 -368 -2296 621 -279 -1127
1408409a127O19j214K60q57n24Q13O24j115P21L4j464L655j728j872J493K312k054
$$ -1127 -508 -1722 -1462 -2319 -2843 -2030 -1406 -2521 -1800 -1766 -3230 425 -1303 -3175 -1682 630 -1424
1411615a424J050r22P60j381R87o43N20R50k160R85j096K28J016O95p72j146J539
$$ -1424 -374 -1296 -536 -1917 -930 -1573 -1053 -103 -2263 -1278 -2374 -2146 -1130 -435 -1207 -2353 -814
1414839h14k42j98k1j080J161o39J676j754O95k39j095K306k051q32R20J312o46
$$ -814 -1056 -1254 -1275 -2355 -1194 -1833 -157 -1911 -1216 -1455 -2550 -244 -2295 -3127 -2207 -895 -1541
1418045a541j752J095p49K360Q71l581K390R43n97J160j140j260j280K220k32K83
$$ -1541 -3293 -2198 -2947 -587 284 -3297 -907 36 -561 599 -541 -1801 -3081 -861 -1093 -810
1421061h10n50j162J4K10J55P46J028q09l89j565M51J833J217j272j033p59M02
$$ -810 -1360 -2522 -2508 -2298 -2143 -1397 -369 -1178 -1567 -3132 -2681 -848 369 -903 -1936 -2695 -2293
1424290b293l73J967J96j63J254j660K47j250P64N55K45r41q05Q99J912j262j76
$$ -2293 -2666 -699 -503 -666 588 -1072 -825 -2075 -1311 -756 -511 -1452 -2257 -1358 554 -708 -884
1427496h84q97J633q81j178M20q60J762m75P68k771J901N8j4m04K66J901r50o65
$$ -884 -1781 -148 -1029 -2207 -1787 -2647 -885 -1360 -592 -3363 -1462 -1404 -1418 -1822 -1556 345 -605 -1270
1430914a270K92K86j122k7j72P85J25J40j577j20J043P34j184P09N79r02P13o59
$$ -1270 -978 -692 -1814 -1841 -2013 -1228 -1103 -963 -2540 -2660 -1617 -883 -2067 -1358 -779 -1681 -968 -1627
1434309a627N29m55J19j611K359j818m61J041l26N2O93q92J078p5j085L402l932
$$ -1627 -1098 -1553 -1434 -3045 -686 -2504 -2965 -1924 -2250 -2198 -1505 -2397 -1319 -1394 -2479 923 -3009
1437533c009K855j542r11P40J818k843J095Q56n95j00j02J254L18j663K593j955
$$ -3009 -154 -1696 -2607 -1867 -49 -2892 -1797 -941 -1536 -1636 -1738 -484 -166 -1829 764 -1191
1440549a191j624J134L89M96j516J870J257j783K31l21j377J457k564J933j098
$$ -1191 -2815 -1681 -1292 -796 -2312 -442 815 -968 -737 -1058 -2435 -978 -3542 -1609 -2707
1443400b707K433j889Q41m13K050k151O72J246q61j495K011l332L006j260j136
$$ -2707 -274 -2163 -1322 -1735 315 -1836 -1164 82 -779 -2274 -263 -3595 -589 -1849 -2985
1446223b985M011k966K172j431J161j558N13l81J049l68p76R78O48j294m9L4K52
$$ -2985 1026 -1940 232 -1199 -38 -1596 -1083 -1464 -415 -783 -1559 -581 67 -1227 -1276 -1242 -990
1449452i90l40L06p19J830J02j446j434J958j802P7Q94J363j310J141j241l0j27
$$ -990 -1330 -1024 -1743 87 189 -1257 -2691 -733 -2535 -2458 -1564 -201 -1511 -370 -1611 -1641 -1768
1452657a768J119j319R12J25o27J58l93O1n91J928K45j752Q87J397j286j52K269
$$ -1768 -649 -1968 -1056 -931 -1558 -1400 -1793 -1732 -2323 -395 -150 -1902 -1015 382 -904 -1056 1213
1455863A213k886J893k318K97K104j298p04J174m21J036K017k386m81k86K176k535
$$ 1213 -1673 220 -2098 -1801 303 -995 -1699 -525 -946 90 2107 -279 -760 -1046 1130 -1405
1458898a405m37J303l711K726J603j875m58L273j876j165J598K67m04Mn76l59J76
$$ -1405 -1842 -539 -4250 -1524 79 -1796 -2254 1019 -857 -2022 -424 -157 -561 -557 -1133 -1492 -1316
1462104a316O54M4R9q76O36P64k170K720q94r12N78m68M28L02K302k980j67j242
$$ -1316 -662 -618 -519 -1395 -759 5 -2165 555 -339 -1251 -673 -1141 -713 -411 1891 -1089 -1256 -2498
1465522b498J007N13L48m83j625J030o3n67k43R9L31P8j108J390L236k339l86L43
$$ -2498 -1491 -978 -630 -1113 -2738 -1708 -1771 -2338 -2581 -2482 -2151 -2073 -3181 -1791 1445 -894 -1280 -937
1468917i37p95O42k174K388p85j224J542n73q88L474j228j132L4J051q3n21O53
$$ -937 -1732 -1090 -3264 -876 -1661 -2885 -1343 -1916 -2804 670 -558 -1690 -1656 -605 -688 -1209 -556
1472146e56j843J088J662p41K10j063P55p20j090o39J67L034o32k378K292j115
$$ -556 -2399 -1311 351 -390 -180 -1243 -488 -1208 -2298 -2937 -2770 264 -368 -2746 -454 -1569
1475162a569j599J232J299L13r56Q23r7k831J758J473j144P5k12p12J711M90k600
$$ -1569 -3168 -1936 -637 -324 -1280 -457 -554 -3385 -1627 -154 -1298 -1223 -1435 -2147 -436 54 -2546
1478387b546P63R59o15j295K493j449J980j396J405j405K9J74m93n48J028k62L32
$$ -2546 -1783 -824 -1439 -2734 -241 -1690 290 -1106 299 -1106 -1077 -903 -1396 -1944 -916 -1178 -846
1481592h46j86N01j681O14L3L27P55j200P55J315k057L95j765Q46J56m08P75J542
$$ -846 -1032 -531 -2212 -1598 -1565 -1238 -483 -1683 -928 387 -1670 -1275 -3040 -2194 -2038 -2446 -1671 -129
1485010a29j474l1j587K352K30Q94j336K004k915K563j077j322j243J695J543k20
$$ -129 -1603 -1634 -3221 -869 -639 255 -1081 923 -1992 571 -506 -1828 -3071 -1376 167 -53
1488027e3p61o1Ml92K46j537K446j842J310j736K150n61j235J02R50L00K94j63
$$ -53 -814 -875 -871 -1263 -1017 -2554 -108 -1950 -640 -2376 -226 -787 -2022 -1920 -970 -670 -376 -539
1491422e39j586J792o51J207o00n1j88k70j653K788m313K974o28o8J320p55K35
$$ -539 -2125 -333 -984 223 -377 -428 -616 -886 -2539 249 -4064 -1090 -1718 -1786 -466 -1221 -986
1494651i86r41J179P31R83j29k449N71J933j489J057m294L138j115K380j280k207
$$ -986 -1927 -748 -17 966 837 -1612 -1041 892 -597 460 -3834 -696 -1811 569 -711 -2918
1497663b918K379j053O56J241j970m96J886l5n80j137j052M20J8K121J010k89j210
$$ -2918 -539 -1592 -936 305 -1665 -2161 -275 -310 -890 -2027 -3079 -2659 -2641 -520 490 201 -1009
1500892a009q3J296k39p21Q95k483P99M53Q32O90k157J350Q52j622N5J752m4p19
$$ -1009 -1092 204 -35 -756 139 -2344 -1545 -1092 -260 430 -1727 -377 475 -1147 -1092 660 616 -103
1504286a03k290K102m37j954K02J581N37l03P19j505L038l140J516j862K61j65
$$ -103 -2393 -291 -728 -2682 -2480 -899 -362 -665 54 -1451 1587 -1553 -37 -1899 -1638 -1803
1507326a803J702L51m83l64m80L0k18K95j515p17J854j398J896m14J051j123Q36
$$ -1803 -101 250 -233 -597 -1077 -1047 -1265 -970 -2485 -3202 -1348 -2746 -850 -1264 -213 -1336 -500
1510532e00Q92j235J08Q17o09o40N7L48L16j31N07n76j137J00M40J751p43O85k778
$$ -500 392 -843 -735 82 -527 -1167 -1110 -762 -446 -577 -70 -646 -1783 -1683 -1243 508 -235 450 -2328
1514139b328J667J040j404j99J133L46q38j217L095k422L10R95J035j78m84l69
$$ -2328 -661 379 -1025 -1224 -91 255 -583 -1800 1295 -1127 -817 178 1213 1035 551 182
1517155A82l749K867J052k389J752j883Q71J921j149N65j972K579l195J049J640
$$ 182 -3567 -700 352 -2037 -285 -2168 -1297 624 -525 40 -1932 647 -2548 -1499 141
1520002A41p37L16r77J100R82j710J389j892n14O36l37k97L35n90L200k405l72
$$ 141 -596 -280 -1257 -157 825 -885 504 -1388 -1902 -1266 -1603 -1900 -1565 -2155 1045 -1360 -1732
1523207a732K239k66m45j841J96J897l055K590J676k074K91j705J055l24J430Q66
$$ -1732 507 241 -204 -2045 -1849 48 -3007 -417 1259 -815 -524 -2229 -1174 -1498 -68 798
1526224G98k305o9J552k010M75L324l136o48K165k248J157J743o14j029J017j2
$$ 798 -1507 -1576 -24 -2034 -1559 1765 -1371 -2019 146 -2102 -945 798 184 -845 172 160
1529259A60q87L74k87n99o18n7N48o67J743j025j16J368m38j228n64J243J029J14
$$ 160 -727 -353 -640 -1239 -1857 -1914 -1366 -2033 -290 -1315 -1431 -63 -501 -1729 -2293 -1050 -21 93
1532654I3j910m27L86K00J845k65j223J351l78k201K557q30j392J198k92O4m53
$$ 93 -1817 -2244 -1858 -1658 187 -78 -1301 50 -328 -2529 28 -802 -2194 -996 -1288 -1224 -1677
1535883a677K01J446l50O48l27k87o63R34K68O89p63j459J922k449J088P63n87
$$ -1677 -1476 -30 -380 268 -59 -346 -1009 -75 193 882 119 -1340 582 -1867 -779 -16 -603
1539088f03p35R21j171Q87J08R95j663J03p00K222m60j590J966k253K720j005L17
$$ -603 -1338 -417 -1588 -701 -593 402 -1261 -1158 -1858 364 -96 -1686 280 -1973 747 -258 59
1542317E9j755J715J263j863P43r41J651k250m17L47j2K748j509J266q81j725N21
$$ 59 -1696 19 1282 -581 162 -779 872 -1378 -1795 -1448 -1460 1288 -221 1045 164 -1561 -1040
1545523a040j725K825o37P79k93o60O09K836k437M07k66o99J491j372O23k115R81
$$ -1040 -2765 60 -577 202 -91 -751 -142 2694 257 664 398 -301 1190 -182 441 -1674 -693
1548747f93m59n66J348P27n74q68J5K727j401k242K742k76j12j576p57L83l97K989
$$ -693 -1152 -1718 -370 357 -217 -1085 -1070 1657 256 -1986 756 480 368 -1208 -1965 -1582 -1979 1010
1552142A010k693j35K067j066N27j134K72J468J000j572J735k107n08M73M0k503
$$ 1010 -1683 -1818 249 -817 -290 -1424 -1152 316 1316 -256 1479 -628 -1136 -663 -623 -3126
1555182c126J221N59J142J154l440L007n02j54j131Q09J099j483N27n75J739n23
$$ -3126 -1905 -1346 -204 950 -2490 517 15 -139 -1270 -461 638 -845 -318 -893 846 323
1558198C23j495J783J72j214N87j116m01J601j149J131Q6p71p20J631q11j66J312
$$ 323 -1172 611 783 -431 156 -960 -1361 240 -909 222 308 -463 -1183 448 -363 -529 783
1561404G83j835P85p77j59M347l559k51k81J077r81J104j382R61j997J640q35J838
$$ 783 -1052 -267 -1044 -1203 3144 -415 -666 -947 130 -851 253 -1129 -168 -2165 -525 -1360 478
1564629D78m50R24p17J125k328J336l86P51j490r09O01j394J461J948m45L61l75
$$ 478 28 952 235 1360 -968 368 -18 733 -757 -1666 -1065 -2459 -998 950 505 866 491
1567857D91J65j208J583j860Q7M08M94o12J86j411P65L175l818m17J011P80Q49
$$ 491 656 -552 1031 -829 -742 -334 160 -452 -266 -1677 -912 2263 -1555 -1972 -961 -181 668
1571063F68M08j515J348M40L04l860J790j369K311j201R81j727P50N87j244L050
$$ 668 1076 -439 909 1349 1653 -2207 -417 -1786 525 -676 305 -1422 -672 -85 -1329 1721
1574080A721j663r78m00K824k030j79j700K434M83j219r5R33Q67p87J552k817J135
$$ 1721 58 -920 -1320 1504 -526 -705 -2405 29 512 -707 -802 131 998 211 1763 -1054 81
1577308H1n62K256k313J53J699j892L97k41m29J14O19Q00k67j96N30o85l22K115
$$ 81 -481 1775 -538 -385 1314 -578 -181 -422 -851 -737 -118 682 415 219 749 64 -258 1857
1580703A857k172N86J351j062j186j255L798m033J690R09p49J365q69M17q44l33
$$ 1857 -315 271 1622 560 -626 -1881 1917 -2116 -426 483 -266 1099 230 647 -197 -530
1583739e30J287k450J230K097q98O67l065M86J754j285j176J953Q4M9J38j750K24
$$ -530 757 -1693 -463 1634 736 1403 -1662 -1176 578 -707 -1883 70 154 203 341 -1409 -1185
1586944a185L254j256O63k344K494j038j80R61l940Q55K982k047J782j669J920
$$ -1185 2069 813 1476 -868 1626 588 408 1369 -2571 -1716 1266 -781 1001 -668 1252
1589795A252m09k621K934j19m52n24K85n8r9Q02J300j797n32j496K012j722J450
$$ 1252 843 -1778 1156 1037 585 61 346 288 189 991 2291 494 -38 -1534 478 -1244 206
1592996B06j336R31L39p3J017P58j306n13Q54r13l55M60j57J675q03j284j049J955
$$ 206 -1130 -199 140 67 1084 1842 536 23 877 -36 -391 69 -88 1587 784 -500 -1549 406
1596414D06o78J060j101q01J282Q3M11k25J601k112L56J180O15k640J748N05L23
$$ 406 -272 788 -313 -1114 168 251 662 437 2038 -74 282 1462 2077 -563 1185 1690 2013
1599620B013n75k435K903l391J424P01K471j91k824O97M26q59J612p92j867q60
$$ 2013 1438 -997 1906 -1485 -61 640 3111 2920 96 793 1219 360 1972 1180 -687 -1547
1602659a547J434O87O97N7N07j452M59J139q52O07K21J808l693K900l031n4J631
$$ -1547 -113 574 1271 1328 1835 383 842 1981 1129 1736 1957 3765 72 2972 -59 -113 1518
1605865A518l00j253L096r85k630M94j28J285l50M07J409j032J641p20j500J51
$$ 1518 1218 -35 3061 2076 -554 -60 -188 1097 747 1154 2563 1531 3172 2452 952 1103
1608900A103J53J947p06m47j845L44j692J115k73J176l7K69o92J568k146J930K90
$$ 1103 1256 3203 2497 2050 205 549 -1143 -28 -301 875 838 1107 415 1983 -163 1767 2057
1612106B057L18o9k506j37K677j162J435n1J749j106m93j014M84p50J539j949J945
$$ 2057 2375 2306 -200 -337 2340 1178 2613 2562 4311 3205 2712 1698 2182 1432 2971 1022 2967
1615312B967k517L328j029K37m91N79P41j583J717j411l62j149j176K367l5o92
$$ 2967 450 3778 2749 2986 2495 3074 3815 2232 3949 2538 2176 1027 -149 2218 2183 1491
1618351A491K050j629p44J464J582k1R60n216J729J466k050J833Q60j534P30N34
$$ 1491 3541 1912 1168 2632 4214 4193 5153 -63 1666 3132 1082 2915 3775 2241 2971 3505
1621363C505l12k001R82k9K848p89n07K85l156L41L250j523k215K349k31m7k58
$$ 3505 3193 1192 2174 2145 4993 4204 3697 3982 826 1167 4417 2894 679 3028 2797 2750 2492
1624592B492o55R44Q18j811O5k27k89O52R38j158J327J571k306n75N21l52J008
$$ 2492 1837 2781 3599 1788 1853 1626 1337 1989 2927 1769 3096 4667 2361 1786 2307 1955 2963
1627798B963M20j392J154J036n45P70k595K73M89J719k037l27Q50k144P68P12o55
$$ 2963 3383 1991 3145 4181 3636 4406 1811 2084 2573 4292 2255 1928 2778 634 1402 2114 1459
1631027A459J369n58R83k251L450k906K420K424l411J45P38j251J955k600j273
$$ 1459 2828 2270 3253 1002 4452 1546 3966 6390 2979 3124 3862 2611 4566 1966 693
1633850F93N237k343O72M48j807P37m88J152J942m613K206r21J481J686n865L800
$$ 693 5930 3587 4259 4707 2900 3637 3149 4301 6243 1630 3836 2915 4396 6082 217 4017
1636890D017M28r1L58k469J322J205j069J568m32k233J538r02K300k3j921n7m4
$$ 4017 4445 4354 4712 2243 3565 4770 3701 5269 4837 2604 4142 3240 5540 5517 3596 3539 3495
1640095C495K351j880J544j684M24m27J690j624j005M079j699l1L6j781L289r8
$$ 3495 5846 3966 5510 3826 4250 3823 5513 3889 2884 6963 5264 5233 5269 3488 6777 6679
1643135F679k906q7J471j30M33R61r79K193r06j723L43j787K216l057N071k122
$$ 6679 3773 3686 5157 5027 5460 6421 5442 7635 6729 5006 5349 3562 5778 2721 7792 5670
1646147E670J04l95o67K031J91k303J389N71j307O89J246m30J248r27k369K43J490
$$ 5670 5774 5379 4712 6743 6934 4631 6020 6591 5284 5973 7219 6789 8037 7110 4741 4984 6474
1649376F474J563l484J968N35N69M36J008r96r53Q09N02k222N87N33J044j233j15
$$ 6474 8037 4553 6521 7056 7625 8061 9069 8073 7120 7929 8431 6209 6796 7329 8373 7140 7025
1652582G025J657j708K315M56l33j473m86q96L206j402k38o25M02k61K33J694p5
$$ 7025 8682 6974 9289 9745 9412 7939 7453 6557 9763 8361 8123 7498 7900 7639 7872 9566 9491
1655787I491J059J540J131l054L79K414k079O80O64l99K91k107l52l72M01O26J700
$$ 9491 10550 12090 13221 10167 10546 12960 10881 11561 12225 11826 12117 10010 9658 9286 9687 10313 12013
1659016A2013j568L83J344p49N42N10q96l81R73p8O2l32PJ823m4K142l4j197P19
$$ 12013 10445 10828 12172 11423 11965 12475 11579 11198 12171 12093 12155 11823 11830 13653 13609 15751 15717 14520 15239
1662600A5239p54J201J881k111O61j598p30m72J435k82j12j056J428m39l77M80
$$ 15239 14485 15686 17567 15456 16117 14519 13789 13317 14752 14470 14358 13302 14730 14291 13914 14394
1665635A4394J408O74l674J352J157j737K772l092Q94K4J373r08J253n40J309J001
$$ 14394 15802 16476 12802 14154 15311 13574 16346 13254 14148 14172 15545 14637 15890 15350 16659 17660
1668652A7660J58M57k319K817j57r37J644l97o22R13J898K65j634j12J838j343
$$ 17660 17818 18275 15956 18773 18616 17679 19323 18926 18304 19217 21115 21380 19746 19634 21472 20129
1671692B0129K756M01R68l05L380J742k63Q37O87K372j120J622K233J583L378p56
$$ 20129 22885 23286 24254 23949 27329 29071 28808 29645 30332 32704 31584 33206 35439 37022 40400 39644
1674704C9644K081L571K899N001L496J0757J2738J7499K5556L1357L8165K5462
$$ 39644 41725 45296 48195 53196 56692 67449 80187 97686 123242 154599 192764 218226
1676982B18226k765j2766m88P424k0035m2667l8533j8048r949n673m121J29M5K471
$$ 218226 215461 202695 202207 209631 189596 146929 108396 90348 80399 74726 70605 70734 70779 73250
1679621G3250l94N267K133M915L112J0168R270J2997K0097K8007L7743M6880N7823
$$ 73250 72856 78123 80256 85171 88283 98451 107721 120718 140815 168822 206565 253445 311268
1682088C11268L4352J617m4K1869K1349m783m0177m3353k4738q928k1431l8405
$$ 311268 345620 347237 347193 369062 390411 385628 345451 302098 277360 268432 247001 208596
1684367B08596n0519l0378j7332j2206n857m042j695k270K078k341R94J986M966
$$ 208596 158077 127699 110367 98161 92304 88262 86567 84297 86375 84034 85028 87014 91980
1686812I1980K032R646J1026J4390J9886L2171L9640M6061L5618O354j6425r464
$$ 91980 94012 103658 114684 129074 148960 181131 220771 266832 302450 308804 292379 282915
1689090B82915n041k6895n3025m9920l5849k0318j4558r346m897m422l879k925
$$ 282915 277874 250979 197954 148034 112185 91867 77309 67963 63066 58644 54765 51840
1691346E1840N97m030j434j440k030k636L208j946m08N09j293n65k507j939J423
$$ 51840 52437 48407 46973 45533 43503 40867 44075 42129 41721 42230 40937 40372 37865 35926 37349
1694196C7349K1J090j967N79O01m016J267j992r72p74q3k4k505K243j736O86j230
$$ 37349 37370 38460 36493 37072 37673 33657 34924 32932 31960 31186 31103 31079 28574 30817 29081 29767 28537
1697398B8537J233o38j337q41J72l43QJ140O05k733K200k405J896K38M90j931l13
$$ 28537 29770 29132 27795 26954 27126 26783 26791 27931 28536 25803 28003 25598 27494 27732 28222 26291 25978
1700627B5978r95J606k131J177n65Q19N6j071Q88J288n58J350O17q6Q14m09K254
$$ 25978 24983 26589 24458 25635 25070 25889 25945 24874 25762 27050 26492 27842 28459 28373 29187 28778 31032
1703832C1032j966l69n15K163j257R17k711J183q75q51R63P9J393N97k714K756
$$ 31032 29066 28697 28182 30345 29088 30005 27294 28477 27602 26751 27714 27793 29186 29783 27069 29825
1706872B9825k200P99p97L639n01K22J668J43k15j07R23L013L53K479o15L717M26
$$ 29825 27625 28424 27627 31266 30765 30987 32655 32798 32583 32476 33399 36412 36765 39244 38629 42346 42772
1710078D2772Q44K797J815K112J60L526K497R97J2069N770J1724J6067K0226L2408
$$ 42772 43616 46413 48228 50340 50500 54026 56523 57520 69589 75359 87083 103150 123376 155784
1712735A55784L9214M7840J9956k5250k3562P40J6540K1246j0779n2189m9435k8955
$$ 155784 194998 242838 262794 237544 213982 214722 231262 252508 241729 189540 140105 111150
1714990A11150j5932j1448m146k307j710J579l50K513L780J842P256J0458P863
$$ 111150 95218 83770 79624 77317 75607 77186 76836 79349 83129 84971 92227 102685 110548
1717458A10548J6013K0114K3707L5408L3833J3324j0941o165J5350K9383L9801
$$ 110548 126561 146675 170382 205790 239623 252947 242006 235841 251191 280574 320375
1719547C20375K4021Q50j8575l7923k6402j768R689Q389l2200n9504m0937k6853
$$ 320375 344396 345246 326671 288748 262346 260578 270267 278656 246456 186952 146015 119162
1721803A19162j5494j0210n653o431m034J053J686q48K205R65M903O898J1522J5552
$$ 119162 103668 93458 87805 81374 77340 78393 80079 79231 81436 82401 87304 94202 105724 121276
1724460A21276J9832K5087L3782K9208p285k6777j4412J529J2518Q063l3999m6602
$$ 121276 141108 166195 199977 229185 221900 195123 180711 182240 194758 202821 168822 122220
1726715A22220l0186j6785j2257o007o795k780j883k478l590j301N16k654J453
$$ 122220 92034 75249 62992 56985 50190 47410 45527 43049 39459 38158 38674 36020 37473
1729183C7473k188K76j311j57k010r44L64k867j195K346J96j897l010K258l233
$$ 37473 35285 35561 34250 34093 32083 31139 31503 28636 27441 29787 29983 28086 25076 27334 24101
1732010B4101J797j524k156r9j311J763j539k66M65p8r03l55J69J589j043j009
$$ 24101 25898 24374 22218 22119 20808 22571 21032 20766 21231 21153 20250 19895 20064 21653 20610 19601
1735050A9601r62J41M72k018J330o48k17j292p36J93L57j23k906J126j217J970
$$ 19601 18639 18780 19252 17234 18564 17916 17699 16407 15671 15864 16221 16098 13192 14318 13101 15071
1738086A5071p75K910m282L435m56N2j839O21R34l64m44M41Q43j241k210J27j006
$$ 15071 14296 17206 12924 16359 15903 15955 14116 14737 15671 15307 14863 15304 16147 14906 12696 12823 11817
1741291A1817M33m4J170q1k154K182j845o24m25J039J01o84l7K663j261j061P98
$$ 11817 12250 12206 13376 13295 11141 13323 11478 10854 10429 11468 11569 10885 10848 13511 12250 11189 11987
1744497A1987R93N56p44m3M16m80j00j629J443R07L90j585m17q89J288j247M60
$$ 11987 12980 13536 12792 12749 13165 12685 12585 10956 12399 13306 13696 12111 11694 10805 12093 10846 11306
1747726A1306j222J691k932Q18q11K557j627j655K538j243r94R17L09m45j706L658
$$ 11306 10084 11775 8843 9661 8850 11407 9780 8125 10663 9420 8426 9343 9652 9207 7501 11159
1750738A1159l222Q40M25J72M60J301k752N26j26N36j518K503j244j216Q56r16
$$ 11159 7937 8777 9202 9374 9834 11135 8383 8909 8783 9319 7801 10304 9060 7844 8700 7784
1753778G784N52m29O28k672Q02K304j446m44J336q79J32k75r26o29J932l920K955
$$ 7784 8336 7907 8535 5863 6665 8969 7523 7079 8415 7536 7668 7393 6467 5838 7770 3850 6805
1756983F805m87j323K628j941m31M69N79j823K384o99j180j47k58K017l318P65
$$ 6805 6318 4995 7623 5682 5251 5720 6299 4476 6860 6161 4981 4834 4576 6593 3275 4040
1760023D040P08R0L39j83j54J531k890J246l61P02r80J458j353o20J1L09j93p8
$$ 4040 4748 4838 5177 4994 4840 6371 3481 4727 4366 5068 4088 5546 4193 3573 3584 3893 3700 3622
1763418C622Q48R76k026k14L21L651k919o89K356j945K702k810j186R10l9k114
$$ 3622 4470 5446 3420 3206 3527 7178 4259 3570 5926 3981 6683 3873 2687 3597 3558 1444
1766453A444L00K451j567K755j757K53K524k953P64J357k555K86J210p97K075J768
$$ 1444 1744 4195 2628 5383 3626 3879 6403 3450 4214 5571 3016 3302 4512 3715 5790 7558
1769470G558j484j737K707K506k238R9J462j531p70M55p76k182J672O90j910J561
$$ 7558 6074 4337 7044 9550 7312 7411 8873 7342 6572 7027 6251 4069 5741 6431 4521 6082
1772509F082j003J67j042j315K10K515J525q37k483K083r3o67N01o35J411k598
$$ 6082 5079 5246 4204 2889 3099 5614 7139 6302 3819 5902 5809 5142 5643 5008 6419 3821
1775521C821J624l27N22j831K373J300j0l66o48J948j603N87l80j082r98J747k627
$$ 3821 5445 5118 5640 3809 6182 7482 7472 7106 6458 8406 6803 7390 7010 5928 4930 6677 4050
1778750D050J699M33j02R53m86j199J867l16n68k20q97p25N26J23j280J983l600
$$ 4050 5749 6182 6080 7033 6547 5348 7215 6899 6331 6111 5214 4489 5015 5138 3858 5841 2241
1781956B241L559j591K33J251l518J250K346k419j866J686N29j592r2J913J126
$$ 2241 5800 4209 4442 5693 2175 3425 5771 3352 1486 3172 3701 2109 2017 3930 5056
1784802E056k258J40J332J331j396J042j42j904J356M07O74j112j345m8L95J147
$$ 5056 2798 2938 4270 5601 4205 5247 5105 3201 4557 4964 5638 4526 3181 3133 3528 4675
1787818D675p41k07k323J540J332m282K085l61J631j888J593j015J543M83j158
$$ 4675 3934 3727 1404 2944 4276 -6 2079 1718 3349 1461 3054 2039 3582 4065 2907
1790646B907p09J813j960o31p3J719N10j386L000l183N46J438J9j249K117O62n19
$$ 2907 2198 4011 2051 1420 1347 3066 3576 2190 5190 2007 2553 3991 4010 2761 4878 5540 5021
1793870E021k821L317j424K74R29J221l195J835k326q04J371j697J958n31J981
$$ 5021 2200 5517 4093 4367 5296 6517 3322 5157 2831 2027 3398 1701 3659 3128 5109
1796698E109j015J70R51l89k027l98J267O45o71k758K765J186n88j162j31P41M53
$$ 5109 4094 4264 5215 4826 2799 2401 3668 4313 3642 884 3649 4835 4247 3085 2954 3695 4148
1799927D148P29o98O22N67j073n41K91k880K854o82O54L66j253om32R34O25j177
$$ 4148 4877 4179 4801 5368 4295 3754 4045 1165 4019 3337 3991 4357 3104 3098 2666 3600 4225 3048
1803321C048J39P10L082j129l56M6O13k089k78J804k50n41k043K763j284J391p85
$$ 3048 3187 3897 6979 5850 5494 5540 6153 4064 3786 5590 5340 4799 2756 5519 4235 5626 4841
1806550D841k841K614J759k312o48k91K19m03P40J89o86J941l126J822J726k563
$$ 4841 2000 4614 6373 4061 3413 3122 3341 2938 3678 3867 3181 5122 1996 3818 5544 2981
1809562B981K816n7M13R09j511L6K403j140J349k479J484j712R17k40P14j258l72
$$ 2981 5797 5740 6153 7062 5551 5587 7990 6850 8199 5720 7204 5492 6409 6169 6883 5625 5253
1812791E253L858O88j27j007r59M11M58m00J126r21N61K66r86O53j046J768j465
$$ 5253 9111 9799 9672 8665 7706 8117 8575 8175 9301 8380 8941 9207 8221 8874 7828 9596 8131
1815997H131k345K705J627j17o93J37K18K008K29k306J692k424L557m043K439l04
$$ 8131 5786 8491 10118 10001 9308 9445 9663 11671 11900 9594 11286 8862 12419 8376 10815 10511
1819037A0511j389L728n13K06o51J634j055J456l526L358j82j395K172k118K508
$$ 10511 9122 12850 12337 12543 11892 13526 12471 13927 10401 13759 13577 12182 14354 12236 14744
1821859A4744k500k57qP89M06l18n79J023m42J134J316p04l30l98K747j503j153
$$ 14744 12244 11987 11979 12768 13174 12856 12277 13300 12858 13992 15308 14604 14274 13876 16623 15120 13967
1825088A3967oJ392P16J838q56j16J641k289J565Q51M1L03J228R47j01J041N95
$$ 13967 13961 15353 16069 17907 17051 16935 18576 16287 17852 18703 18744 19047 20275 21222 21121 22162 22757
1828294B2757L296M59q9R82K980R59R63O42N530J236K182K332J369N431L566M923
$$ 22757 26053 26512 26423 27405 30385 31344 32307 32949 38479 39715 41897 44229 45598 51029 54595 59518
1831329E9518L080N911P906J0914J0326J9790K7623L1283M8979N4684M5309L8850
$$ 59518 62598 68509 76415 87329 97655 117445 145068 176351 225330 280014 325323 364173
1833585C64173K6943J76J912O989j1770k1324l1899n8450n4861m5693l7268k5307
$$ 364173 391116 391292 393204 400193 388423 367099 335200 276750 221889 176196 138928 113621
1835863A13621j5682q511l158k456l469q07Q82j098L565K558K463M211R712R551
$$ 113621 97939 89428 86270 83814 80345 79538 80420 79322 82887 85445 87908 92119 101831 111382
1838502A11382J6445J4528K5552L2347M1974N2246M3704L6618O652j665o579k1076
$$ 111382 127827 142355 167907 200254 242228 294474 338178 374796 381448 379783 373204 352128
1840780C52128j0431j7488l9721m2567m9529m9048l2317j8898j4469o651p440n664
$$ 352128 341697 324209 284488 241921 192392 143344 111027 92129 77660 71009 63569 57905
1843059E7905l488k241k45l580l268r3j287j979j50j448J37k097K85j235j293j042
$$ 57905 54417 52176 51931 48351 45083 44990 43703 41724 41574 40126 40263 38166 38451 37216 35923 34881
1846071C4881l105K63j98p89m14j766j706R05j48l04j335J07k72q32r82j019J530
$$ 34881 31776 32039 31841 31052 30638 28872 27166 28071 27923 27619 26284 26391 26119 25287 24305 23286 24816
1849300B4816j663Ko68k693N32J846j785k293J803N02L6K21l5k718R16q9k39J77
$$ 24816 23153 23155 22487 19794 20326 22172 20387 18094 19897 20399 20435 20656 20621 17903 18819 18730 18491 18668
1852695A8668j363p26N09r87K13M35O35p04j151J880n44j694J145j863J452q84
$$ 18668 17305 16579 17088 16101 16314 16749 17384 16680 15529 17409 16865 15171 16316 14453 15905 15021
1855711A5021J355j034k740M77j078Q72j231J965J8L008k501J68J063j878J977
$$ 15021 16376 15342 12602 13079 12001 12873 11642 13607 13625 16633 14132 14300 15363 13485 15462
1858557A5462o39J136j408k272N443k653o05j96N05m90Q21q06L33j742O65J617
$$ 15462 14823 15959 14551 12279 17722 15069 14464 14268 14773 14283 15104 14298 14631 12889 13554 15171
1861574A5171j388P22j114m23j914J14K418r96j384r85j72K193j888J940l50J858
$$ 15171 13783 14505 13391 12968 11054 11168 13586 12590 11206 10221 10049 12242 10354 12294 11944 13802
1864614A3802j957L196n71m09R50K615l068j022r55K911J582l756N56N08p87o86
$$ 13802 11845 15041 14470 14061 15011 17626 14558 13536 12581 15492 17074 13318 13874 14382 13595 12909
1867626A2909K650j346p84K501m116K554J062r23l624R26J424j800K190K30l58
$$ 12909 15559 14213 13429 15930 11814 14368 15430 14507 10883 11809 13233 11433 13623 13853 13495
1870476A3495j006K710J393l324K610k991J594O09j069K95q5m93K36P99j468J76
$$ 13495 12489 15199 16592 13268 15878 12887 14481 15090 14021 14316 14231 13738 13974 14773 13305 13481
1873493A3481K903j323k078K043m08l6N90k627K171J562k034p99J810j29j569N09
$$ 13481 16384 15061 12983 15026 14618 14582 15172 12545 14716 16278 14244 13445 15255 15126 13557 14066
1876528A4066l02K749n57k998J766J933k556J208O12R36k179k56K142j580M001
$$ 14066 13764 16513 15956 12958 14724 16657 14101 15309 15921 16857 14678 14422 16564 14984 18985
1879355A8985j976K5J444j570K895o57J913j21M38j7K76n96Q23J431N69j533J570
$$ 18985 17009 17034 18478 16908 19803 19146 21059 20938 21376 21359 21635 21039 21862 23293 23862 22329 23899
1882584B3899K185K5L407O97J486L437K619J975R96K898N310J033N187M668N074
$$ 23899 26084 26109 29516 30213 31699 35136 37755 39730 40726 43624 48934 49967 55154 59822 64896
1885407F4896O400R054J1804J7824K0669L2457L9330M1276M4405M2931M4872L3752
$$ 64896 71296 80350 92154 109978 130647 163104 202434 243710 288115 331046 375918 409670
1887686D09670L461j1297j1748j7809m4331n6441m6999m5158l5213l0085j5169
$$ 409670 413131 401834 390086 372277 327946 271505 224506 179348 144135 114050 98881
1889776I8881j0380m775o779o18r75k194L37L148n98L980K246K107L927Q010P307
$$ 98881 88501 83726 76947 76329 75354 73160 73497 76645 76047 80027 82273 84380 88307 96317 103624
1892598A03624J1772J5790K1603K7090L6420M1253L9960L7425L9005J9629p808
$$ 103624 115396 131186 152789 179879 216299 257552 297512 334937 373942 393571 385763
1894688C85763r768j3453k9806m6516n0483m0938l7955l2846k2828j4936j0874
$$ 385763 375995 362542 332736 286220 235737 194799 156844 123998 101170 86234 75360
1896754G5360p274o758l998k606m721k441j355j513k390k46r08o59p67k64l056
$$ 75360 68086 61328 57330 54724 50003 47562 46207 44694 42304 42058 41150 40491 39724 39460 36404
1899605C6404M22k287j298j35M11j995k758J203k150K38k517L97J729j946r87k440
$$ 36404 36826 34539 33241 33106 33517 31522 28764 29967 27817 28055 25538 25935 27664 25718 24731 22291
1902640B2291N1m69K159k474k269J198Q85k617j697J009j329J71O09m09O58o56
$$ 22291 22342 21873 24032 21558 19289 20487 21372 18755 17058 18067 16738 16909 17518 17109 17767 17111
1905657A7111k470j424K528M63j893K473k673K808j115r56K749k480Q77L72j832
$$ 17111 14641 13217 15745 16208 14315 16788 14115 16923 15808 14852 17601 15121 15998 16370 14538
1908503A4538o0p18j593m86r51j229L036k308L28K77j867L335p56j514n0K007j01
$$ 14538 14478 13760 12167 11681 10730 9501 12537 10229 10557 10834 8967 12302 11546 10032 9982 11989 11888
1911708A1888R68O05j608L406l067k043Q70m4O44j061k389K195J026J389o33q24
$$ 11888 12856 13461 11853 15259 12192 10149 11019 10975 11619 10558 8169 10364 11390 12779 12146 11322
1914725A1322N86J014k189M6o99j421J485j806J142q53j77n0j114K01k43q11J93
$$ 11322 11908 12922 10733 10779 10080 8659 10144 8338 9480 8627 8450 8400 7286 7487 7244 6433 6626
1917954F626j967M15R25P61K19p30m67L157k889J782k696O74K91k191L947j699
$$ 6626 4659 5074 5999 6760 6979 6249 5782 8939 6050 7832 5136 5810 6101 3910 7857 6158
1920966F158j320j28R13R83M9P97j005k99j731k9Q34r91K49k157J977k76O88M80
$$ 6158 4838 4710 5623 6606 6655 7452 6447 6148 4417 4388 5222 4231 4480 2323 4300 4024 4712 5192
1924384E192j094J374j521M62L75k099K592j31M61j597j600K621q17r3L70l560
$$ 5192 4098 5472 3951 4413 4788 2689 5281 5150 5611 4014 2414 5035 4218 4125 4495 935
1927400I35K32K463J059j924K12j314J355j572M7J515k058K377r32j244J629p86
$$ 935 1167 3630 4689 2765 2977 1663 3018 1446 1493 3008 950 3327 2395 1151 2780 1994
1930440A994k77J61L28J346k673K58K116L35j166q82n46m82J005j00q17J123K202
$$ 1994 1717 1878 2206 3552 879 1137 3253 3588 2422 1540 994 512 1517 1417 600 1723 3925
1933646C925j060M26j526J422j476J199K147r06p8J576M75K763m307j490L643j886
$$ 3925 2865 3291 1765 3187 1711 2910 5057 4151 4073 5649 6124 8887 4580 3090 6733 4847
1936681D847j68j172j775j177K288l03R1K65p60q55K215j259J73j507J569O64k086
$$ 4847 4679 3507 1732 555 2843 2540 2631 2896 2136 1281 3496 2237 2410 903 2472 3136 1050
1939887A050j294J591Q46L59m25o93O45j744K499q70o03k79J622M27k141J245J32
$$ 1050 -244 1347 2193 2552 2127 1434 2079 335 2834 1964 1361 1082 2704 3131 990 2235 2367
1943116B367j175m68J918k159K237j385N95m93k412K66K449M68k154K568P95N2
$$ 2367 1192 724 2642 483 2720 1335 1930 1437 -975 -709 1740 2208 54 2622 3417 3469
1946132C469J65o76k15J17J745Q8o48j463J127k074K846k592L823n80j882K138
$$ 3469 3634 2958 2743 2860 4605 4693 4045 2582 3709 1635 4481 1889 5712 5132 3250 5388
1949167E388j87o68J55j452K215j454J677n86j025j37Kj499N67K110M10k177k94
$$ 5388 5201 4533 4688 3236 5451 3997 5674 5088 4063 3926 3928 2429 2996 5106 5516 3339 3045
1952373C045M019j344m16P36L92k077o04P8N63j531J287K140K6Q51K503n43N08
$$ 3045 7064 5720 5304 6040 6432 4355 3751 3829 4392 2861 4148 6288 6314 7165 9668 9125 9633
1955579I633j222J485J46k32m27k920J258m13q77k333J248R51P78O24k52k13p84
$$ 9633 8411 9896 10042 9810 9383 6463 7721 7308 6431 4098 5346 6297 7075 7699 7447 7234 6450
1958808F450J127Kk031K174n4r1L244k394j878j92m50J639J829k326m95O51P94
$$ 6450 7577 7579 5548 7722 7668 7577 10821 8427 6549 6357 5907 7546 9375 7049 6554 7205 7999
1962013G999o11K283j913K14K153N49r95J41p74J136j359J582o03k88O78P59j397
$$ 7999 7388 9671 7758 7972 10125 10674 9679 9820 9046 10182 8823 10405 9802 9514 10192 10951 9554
1965238I554j84j23K120j37n84M25o39j000J389O9J201L14M37o99K083o61J611
$$ 9554 9370 9247 11367 11230 10646 11071 10432 9432 10821 10890 12091 12405 12842 12143 14226 13565 15176
1968443A5176M74L409l28R29J335P06o99J860j083L000J539K614P99M858K780P064
$$ 15176 15650 19059 18731 19660 20995 21701 21002 22862 21779 24779 26318 28932 29731 34589 37369 44433
1971483D4433L28N411O966N681L562O356M142O794K884R412Q736J2474J5443K7235
$$ 44433 44761 50172 57138 62819 66381 72737 76879 83673 86557 95969 104705 117179 132622 159857
1974117A59857L1015N0977P1506R5631J33624J55220J49372J06203L9621n1615
$$ 159857 190872 241849 313355 408986 542610 697830 847202 953405 993026 941411
1976017I41411j13907j51262j67697j58707j07944o5251l8527k4557j3268r610
$$ 941411 827504 676242 508545 349838 241894 176643 138116 113559 100291 90681
1977918I0681q548m106n813l195p935M19m068j100J361k554p65N94k155p49J362
$$ 90681 82133 78027 72214 69019 61084 61503 57435 56335 57696 55142 54377 54971 52816 52067 53429
1980741E3429n538q79k429q13j843j170o79M5k559k149q14j381j804k863j6l68
$$ 53429 47891 47012 44583 43770 41927 40757 40078 40123 37564 35415 34601 33220 31416 28553 28537 28169
1983780B8169k599J063K7k920J684k105M50m604J233L7k618J631j866k042J368
$$ 28169 25570 26633 26660 23740 25424 23319 23769 19165 20398 20435 17817 19448 17582 15540 16908
1986603A6908j777k106J668q38j491R99Q3j218J23K169k183J024r62n91K89r85
$$ 16908 15131 13025 14693 13855 12364 13363 13446 12228 12351 14520 12337 13361 12399 11808 12097 11112
1989643A1112j392J686k331l72k286L198m088L701k179q20P69j823J358J19M74
$$ 11112 9720 11406 9075 8703 6417 9615 5527 9228 7049 6229 6998 5175 6533 6652 7126
1992466G126k372N58P10J344p79l0L3j047r86L151P4k01j01J145j219q42j700K957
$$ 7126 4754 5312 6022 7366 6587 6557 6590 5543 4557 7708 7782 7581 7480 8625 7406 6564 4864 7821
1995884G821J666k253K59j601o69j291L540k611M62p51L531l415n23j217o15R89
$$ 7821 9487 7234 7493 5892 5223 3932 7472 4861 5323 4572 8103 4688 4165 2948 2333 3322
1998900C322k529R04Q36k276J604K481k135J268O2j985J576q63J789j532L3J440
$$ 3322 793 1697 2533 257 1861 4342 2207 3475 3537 1552 3128 2265 4054 2522 2555 3995
2001940C995k272j63J92J670n65k315M58J573M56k110J744k06o49K96k5J239k076
$$ 3995 1723 1560 1752 3422 2857 542 1000 2573 3029 919 2663 2457 1808 2104 2079 3318 1242
2005146A242J89j259J681r03K190o76K491k220J390j578l02n32k7j58P08j247j533
$$ 1242 1431 172 1853 950 3140 2464 4955 2735 4125 2547 2245 1713 1686 1528 2236 989 -544
2008370e44J556O85K552m041L47j252P68m43j76j334J969l06p15P58m0m99J30j273
$$ -544 1012 1697 4249 208 555 -697 71 -372 -548 -1882 87 -219 -934 -176 -216 -715 -585 -1858
2011765a858Q67j990N92J444J713L07j103k592n86K781l012L552j911K069j442
$$ -1858 -991 -2981 -2389 -945 768 1075 -28 -2620 -3206 -425 -3437 115 -1796 273 -1169
2014592a169l92L142m578Q72J186l613L932k30j313O1J732l390J693J077o87j469
$$ -1169 -1561 1581 -2997 -2125 -939 -4552 -620 -850 -2163 -2102 -370 -3760 -2067 -990 -1677 -3146
2017632c146n33K13k3K20N56j049R99P92m10Q18q35r03L84j462P35J682j756R73
$$ -3146 -3679 -3466 -3489 -3269 -2713 -3762 -2763 -1971 -2381 -1563 -2398 -3301 -2917 -4379 -3644 -1962 -3718 -2745
2021027b745j829J261k90n94J430m12Q32j587J406n18k139K285j170L57rJ46k58
$$ -2745 -4574 -3313 -3603 -4197 -2767 -3179 -2347 -3934 -2528 -3046 -5185 -2900 -4070 -3713 -3722 -3576 -3834
2024251c834l91j05J617m91P38k681N63L86N91j154O23j81K853j536J524m838K700
$$ -3834 -4225 -4330 -2713 -3204 -2466 -5147 -4584 -4198 -3607 -4761 -4138 -4319 -1466 -3002 -1478 -6316 -3616
2027457c616j8l29N4M59Pn17n13J027j182R17J791p40k638K519k73l3J248l736
$$ -3616 -3634 -3963 -3909 -3450 -3443 -3960 -4473 -3446 -4628 -3711 -1920 -2660 -5298 -2779 -3052 -3085 -1837 -5573
2030875e573J970J60j1o04j19N5M86n31J39N10j04r41J379N0j845Q75m38q01J446
$$ -5573 -3603 -3443 -3454 -4058 -4177 -4122 -3636 -4167 -4028 -3518 -3622 -4563 -3184 -3134 -4979 -4104 -4542 -5343 -3897
2034459c897j34l95k548L684j715Q54L17J261O47l363K51K434j863J4P87M73J76
$$ -3897 -4031 -4426 -6974 -3290 -5005 -4151 -3834 -2573 -1926 -5289 -5038 -2604 -4467 -4453 -3666 -3193 -3017
2037688c017J386j289m30J567j328K314j543K721k513Q02K196k245j556M39k004
$$ -3017 -1631 -2920 -3350 -1783 -3111 -797 -2340 381 -2132 -1330 866 -1379 -2935 -2496 -4500
2040515d500Q82j263K286k236L38j947Q23K423O19k250j216O62J677j847N95n43
$$ -4500 -3618 -4881 -2595 -4831 -4493 -6440 -5617 -3194 -2575 -4825 -6041 -5379 -3702 -5549 -4954 -5497
2043551e497j016J804O8K05p32M92m96Q83j969O24L10O35j186J342k397K001R41
$$ -5497 -6513 -4709 -4641 -4436 -5168 -4676 -5172 -4289 -6258 -5634 -5324 -4689 -5875 -4533 -6930 -4929 -3988
2046756c988p17M44n45j65m85K277k5j275q63K30j734J179N93j751K245n72K81
$$ -3988 -4705 -4261 -4806 -4971 -5456 -3179 -3204 -4479 -5342 -5112 -6846 -5667 -5074 -6825 -4580 -5152 -4871
2049962d871j383J553
$$ -4871 -6254 -4701
##END=
