##TITLE= strychnine - 1H at 500 MHz
##JCAMPDX= 5.0         $$ Bruker NMR JCAMP-DX V1.0
##DATA TYPE= NMR Spectrum
##DATA CLASS= XYDATA
##ORIGIN= UXNMR, Bruker Analytische Messtechnik GmbH
##OWNER= eng
$$ TOPSPIN		Version 1.2.b.17
$$ 2004-04-22 11:59:53.067 +0200  eng@ECHIDNA
##.OBSERVE FREQUENCY= 500.132343810869
##.OBSERVE NUCLEUS= ^1H
##.ACQUISITION MODE= SIMULTANEOUS (DQD)
##.AVERAGES= 1
##.DIGITISER RES= 18
##SPECTROMETER/DATA SYSTEM= drx500av
##.SHIFT REFERENCE= INTERNAL, CDCl3, 1, 9.85035
##XUNITS= HZ       
##YUNITS= ARBITRARY UNITS
##XFACTOR= 0.157636929111556
##YFACTOR= 1
##FIRSTX= 5165.28925619835
##LASTX= 0
##DELTAX= -0.157636929111556
##MAXY= 435392836
##MINY= -670883
##NPOINTS= 32768
##FIRSTY= 269484
##XYDATA=(X++(Y..Y))
$$ [...]
29948A6700L0337k3287j46769k04328J39535n8316J89124J15857j6111J83954
29938B26696l5024j80688j63418k8042K22251M8729O9792j07862k10542R5956
29928f2152j1533J2883p0933Q5087k0458M2015Q4507R6972j38401p8105J38010
29917G7892J7429j57447q119J36395j10800j5055M4673j2867J37720j41244O1944
29906C0521j46284L8715J69257j9674j27342N4479J28048j50981J38526O0599
29896A75864J4011r2457k1824r6413O436j01968K43902P5072M4296j47133n0584
29885D9202L2893M1190m1298P7906N7847l1706k5242M2456J85006k48280k01185
29874f1211J02701Q9451j915j26666r9696N3674L8110O8843M3650p5776m7215
$$ y = [16700, 47037, 23750, -123019, -327347, -187812, -246128, -57004, 58853, 42742, 226696, 191672, 10984, -152434, -180476, 41775, 90504, 160296, 52434, -158108, -62152, -73685, -60802, -131735, -46648, -67106, -25091, 59416, 156388, 17987, -60118, 77892, 95321, -62126, -70245, 66150, -44650, -59705, -15032, -27899, 109821, -31423, 30521, -115763, -77048, 92209, 72535, -54807, -328, 127720, -23261, 115265, 175864, 189875, 97418, 75594, -20819, -14383, -116351, 127551, 202623, 246919, 99786, 49202, 82095, 123285, 81987, 159893, 217740, 186034, 160792, 203248, 388254, 139974, -61211, 41490, 130941, 129026, 2360, -97336, -43662, -5552, 63291, 106941, 31165, -16050]
29863a6050k27868J16502P4394K1133P207o4902R830L0243n5399J3406N6007M1090
29851E593j35029N0000k0926J8690r3046j29157L7669J14781o1269K50982J10189
29840A48477J2763p3706j60164J0397K4057J17014l8236m325P222m0575j2031
29829i107j13083l3582J20816O3307L0908n2638P1236N333j0017k26054J72198
29818A9317q4168N3578O9956q856R5329N81j84831J7165k97214J89084J96930
29807F6871l0806P4372N246n7101k24693J19944J57474N9688j00555k5920o7199
29796b2679O7561n5596M0688J63446j13541l4564k6766o0842J40967L6206j86015
29785e1135j6328L8022k3833n7054P3081l9572j67952J51386l1454P8564J58668
$$ y = [-16050, -243918, -127416, -53022, -31889, -24682, -89584, -79754, -49511, -104910, -91504, -35497, 5593, -129436, -79436, -100362, -81672, -174718, -303875, -266206, -151425, -212694, 38288, 148477, 161240, 87534, -72630, -62233, -38176, 78838, 40602, 36277, 43499, 2924, -9107, -122190, -155772, -34956, 28351, 59259, 6621, 77857, 83190, 73173, -152881, 19317, -64851, -11273, 58683, 49827, 145156, 145737, -39094, -21929, -319143, -130059, 66871, 36065, 110437, 115683, 58582, -166111, -46167, 111307, 170995, 70440, 44520, -22679, 44882, -10714, 29974, 193420, 79879, 45315, 18549, -42293, 98674, 134880, -51135, -67463, -29441, -53274, -110328, -37247, -76819, -244771, -93385, -124839, -46275, 112393]
29774A12393j07313N7021k16106J11043Q7553j16937n7723J93575j5154k45291
29764a96939J54556r2856r2411J38351J81324r3588j02777M5954L3384L2534p6965
29753f9433n1642J43004j76276J70043p5639J32889L01255P8486l76944j70015
29743i4272O9619J94098j32152N1371j4736m1866j28042R0953k6725O1792J4795
29732D4835j58732P6147m3858k0321J34096j57478j81075J74481P2674J9802Q1950
29721D2521L6609J03777n0943l2441j2606k47579J83129q775M9628L4952M9946
29710A48218r2753J05815q1141J15727j0328j83613J11973p8307J68700j30805
29700G3486o4688n756N8300k9096p5984J73080k1501p3275M0651m7785j21470
$$ y = [112393, 5080, 62101, -154005, -42962, 44591, -72346, -130069, 63506, 48352, -196939, -42383, -135239, -227650, -89299, 92025, -1563, -104340, -58386, -25002, 7532, -69433, -121075, 21929, -154347, 15696, -59943, 72946, 374201, 452687, 75743, -94272, -24653, 169445, 37293, 88664, 73928, 32062, -95980, -5027, -31752, 30040, 44835, -113897, -37750, -81608, -101929, 32167, -125311, -306386, -131905, -59231, -39429, 42521, 79130, 182907, 131964, 99523, 86917, -160662, 22467, 13692, 63320, 98272, 148218, 55465, 161280, 80139, 195866, 185538, 1925, 113898, 35591, 204291, 73486, 8798, 3042, 61342, 32246, -43738, 129342, 107841, 34566, 75217, 27432, -94038]
29689i4038P2485j25990j21972J96793j15843O6690J07667Q611J27445J2474m1559
29678I2763p2887m9728j79507P738K73891K04331j34018l9852j08173o0586l05J65350
29666I9017l31583J05863Q9093M3413J20564R4611l12673O9003J33919j78843
29656f7616q8520J59101M6735k06012Q9696L8972l8404l951K56296j33273n9435
29645f411P5399J49953j43820j1802o6657j7362J63278P3767j87515j49452K8500
29634i2122j3109p0773J16433J27147K5444j58743J6536k9820O0792o614J75384
29623A50555R4293k33813l7141q0040j63453Q7432J0938K12282J8943J43488
29613B03484L253k65099K0769N9657k4866k9278q2162J35581O7607K3339P9683
$$ y = [-94038, -21553, -147543, -269515, -72722, -188565, -121875, -14208, -5597, 121848, 134322, 92763, 19876, -29852, -209359, -201621, 72270, 276601, 142583, 102731, -5442, -66028, -66333, 99017, -232566, -126703, -37610, 5803, 126367, 220978, -91695, -22692, 111227, -67616, -156136, 2965, 49700, -156312, -66616, -27644, -66048, -69999, 186297, 53024, -6411, 68988, 218941, 75121, 63319, -3338, -20700, 142578, 216345, 28830, -120622, -92122, -105231, -176004, -59571, 67576, 93020, -65723, -49187, -79007, -18215, -24829, 150555, 244848, 11035, -26106, -106146, -269599, -182167, -171229, 41053, 59996, 203484, 206737, -58362, -37593, 22064, -2802, -32080, -114242, 21339, 88946, 112285, 191968]
29602A91968q1296l9261j61896J69002j37519J06169k6967N9949J38054j00807
29592A17396j86853J17572J69773j56674k76324L2224J71103L4615m6400J22669
29582I9101r601j43955L4637J03500o30J04449j44026n7962J54193k04318Q7291
29571B2679Q4230j5986k91038L9024Q6374M4191j05707K3543M6907r4290Q5125
29560g4948j70386J32310M0563j43307K25847J32671j05551k4924P6433j68975
29550h0267r2085K34369m9506O623k11037L96069j37229j01853j55796n4859N9391
29539a86180O4847k2930q6912J44912J44617O442j5599P622j4266o051O2793J22654
29527B21949k42841K37371n6722n1114j05284r0727K61014l8121j47927m8557
$$ y = [191968, 110672, 71411, -90485, 78517, -59002, 47167, 20200, 80149, 218203, 117396, -69457, 48115, 217888, 61214, -215110, -182886, -11783, 22832, -23568, 99101, 89500, -54455, -19818, 83682, 83052, 187501, 43475, -14487, 139706, -64612, 22679, 106909, 90923, -200115, -161091, -74717, -30526, -136233, -112690, -65783, -160073, -74948, -245334, -113024, -72461, -215768, 10079, 142750, 37199, 12275, 88708, -80267, -172352, 62017, 12511, 19134, -191903, 204166, 66937, -34916, -190712, -245571, -186180, -121333, -144263, -231175, -86263, 58354, 64796, 49197, 56819, 42553, 36502, 99295, 221949, -20892, 216479, 159757, 108643, 3359, -87368, 173646, 135525, -12402, -60959]
29517f0959J4552K9268P7257p8395p6647M1359j08622n0925J63328K0037l7545
29506f7292L0612p2989n5313q0731K01926R7295N1613n0744j12707J0772k0561
29495f8119R8146p3428J3784j08141N2370P3088j28l915M4114o0610L6841j27135
29483a23133l1354M9976J05854R9210p271K4484N1825O7294l9839R3399o5735
29472B24710q9184l11437R2728J19136j80267P721P9048J58519k02322q5295Q844
29461a77799K30341j85841p7338J35449K5391o8015M6365J5626j38320J96235
29451B094O1069j81764J09371o0018J29394N277M3189r7819p388p1900J36734
29440F8239P733k253L7593J3333m9310r0722O9607M7801l4701J0870m3858j61168
$$ y = [-60959, -46407, -17139, 60118, -18277, -94924, -53565, -162187, -213112, -49784, -29747, -67292, -36680, -109669, -164982, -245713, -43787, 53508, 105121, 54377, -58330, -47558, -68119, 30027, -43401, -29617, -137758, -85388, -12300, -12428, -16343, 27771, -32839, 4002, -123133, -154487, -104511, 1343, 100553, 93282, 117766, 169591, 236885, 197046, 290445, 224710, 135526, -175911, -83183, 35953, -144314, -136593, -57545, 100974, -101348, -186643, -177799, 52542, -133299, -210637, -75188, -49797, -117812, -71447, -55821, -194141, 2094, 63163, -118601, -9230, -69248, 60146, 65423, 108612, 10793, 3405, -68495, 68239, 75972, 73719, 111312, 124645, 75335, -15387, 54220, 102021, 67320, 78190, 34332, -126836]
29428a26836J66439q9625j18022J80835R6243j10876R1190o2955J1261k38674
29418b01020j31143l9599K22709J16071m7936N9173J12060j86553j0106Q1653
29408b4691R1082j64059J04892k9205p7065l7722j05275J44101L4778j69532
29398b32696J42030k875N9362N184O4450L8934j28662n0758q5776J44402l1548
29387g7953L3263N2757J6706K1188k9033j43176p1257L1913J63629N4747k77282
29376b24498J23165p1952J14178l3278m6928L1647q3990o1924O3758M0811r9085
29365b48096J62498R3753m2321M1973j75995J10095L9137J2720j18816J79177
29355E4125q8739l0625k3994J00775P0316j1603n3439n1705Q0226j6230J5007
$$ y = [-126836, 39603, -50022, -168044, 12791, 109034, -1842, 89348, 26393, 37654, -201020, -332163, -371762, -149053, -32982, -80918, -21745, 90315, -96238, -106344, -24691, 66391, -97668, 7224, -21981, -99046, -136768, -242043, -97942, -63164, -232696, -90666, -93541, -34179, -28995, 35455, 74389, -54273, -105031, -190807, -46405, -77953, -44690, 8067, 24773, 45961, 16928, -126248, -197505, -165592, -1963, 52784, -224498, -101333, -173285, -59107, -92385, -139313, -107666, -191656, -253580, -189822, -149011, -248096, -85598, 8155, -34166, 7807, -168188, -58093, -18956, -6236, -125052, 54125, -34614, -65239, -89233, 11542, 81858, 70255, 16816, -34889, 45337, 29107, 44114]
29344D4114j21362r158N0213r2490J0711J12013K4357L9713Q4192J34811j63583
29333A13531J32631j08528l6578o9665j7522K1160q4230J50943j06093j39136
29323a43487L6617O9922L2911j5579j03797K02088J1478J4773P9173k03055n6546
29312g5502J50484r7089k8186L07j91456P7759n5774O4568R5066K0683K02720
29301A63580p0841j51594j75173m3784J36793P86j60590K44240K86220l8921L1590
29290B22306j60310j9984M8907N281J2972M2497k64073j46079K82515M4505j78906
29279a10369M925J14238j15892O9900J92464J32808k30580o741J91184r681k13541
29268A8715l4358j12273Q5124J20193j35255O5534Q4160j29378j10643M3585J5599
$$ y = [44114, -77248, -86406, -36193, -128683, -117972, -5959, 18398, 58111, 142303, 277114, 113531, 246162, 137634, 101056, 31391, 13869, 35029, -49201, 101742, -4351, -143487, -106870, -36948, -4037, -19616, -123413, 78675, 90153, 104926, 184099, -18956, -75502, 74982, -22107, -50293, -49986, -241442, -163683, -219457, -154889, -59823, -39140, 163580, 92739, -58855, -234028, -277812, -141019, -140233, -300823, -56583, 229637, 190716, 222306, 61996, 42012, 90919, 96200, 109172, 151669, -112404, -258483, 24032, 68537, -110369, -105444, 8794, -107098, -37198, 155266, 288074, 57494, 50753, 241937, 232256, 18715, -15643, -127916, -42792, 77401, -57854, 7680, 91840, -37538, -148181, -104596, -88997]
29257h8997j6066J5690J29223k9881r1652n405M6815M7784j7703j5058L0165r3977
29245h9062L7498j87302K3683N4190N640J09386j34775K7905R1396j647Q6010
29234B2922L5215m5789k42188j05683M1199K86035J04973q9416o4267j53362
29224b10361N036J30279o3178K5680K4228j17990P2590R2599p524J21348p593M506
29212F9620n2110j20090J63874L9554j1981q8474j6534J10661j01997N1471j01544
29201e7550M7679J48219j32250j1197j69652j08459J42835J93486k4844J9480
29191D7747O6196k18331K30574K3450n6171Q0419j83554q8762J62550p2448L6620
29180B8290J44240o9280j26833p2214K1391K46044Q0490k08584j56320M221K04245
$$ y = [-88997, -105063, -89373, 39850, 9969, -81683, -87088, -40273, 7511, -10192, -25250, 4915, -89062, -51564, -238866, -215183, -160993, -155353, -45967, -180742, -152837, -61441, -63088, 22922, 58137, 12348, -229840, -335523, -294324, -8289, 96684, 7268, -56999, -210361, -205325, -75046, -138224, -112544, -88316, -206306, -133716, -41117, -48641, 72707, 65114, 69620, 17510, -102580, 61294, 100848, 88867, 393, -16141, 94520, -7477, 43994, -57550, -9871, 138348, 6098, -5099, -174751, -283210, -140375, 53111, 28267, 47747, 113943, -104388, 126186, 149636, 93465, 173884, -9670, -98432, 64118, -8330, 28290, 172530, 103250, -23583, -95797, -74406, 171638, 252128, 43544, -112776, -108555, 95690]
29169I5690P0550q3695p7775k51289m0379M12772J27239l62455q4392J26796
29159f6938J89638L2793K4981j36826j7582j06474j2982P0409J46404N1276M5400
29148B20099j8379l4851j32145r4655j1659k0513o4077J52840J07771l7914o7546
29137a029l9919N3j24835J5548j4495K1241J37485q3281K024j449m6379O1599
29125g3437J6560N5655Q4378M4815j87595J48303o2630o0925o8505j33590P425
29114b29546J49441J73156j25661l5180J08856K5160q231p5088j56521J20383
29104e3231R3856J82894L1331j35092L1448p8845J5728P9128j94112J65710l8750
29093A00065r0979j0813m8926o0111J32180n1380j39869J79609j26345J76139
$$ y = [95690, 166240, 82545, 4770, -246519, -286898, 125874, 253113, -109342, -193734, -66938, 122700, 155493, 180474, 43648, 26066, -80408, -93390, -22981, 123423, 174699, 220099, 201720, 166869, 34724, -59931, -71590, -92103, -156180, -3340, 104431, 66517, -1029, -40948, -40895, -165730, -150182, -164677, -143436, -5951, -89232, -87208, -88657, -135036, -73437, -56877, -1222, 83156, 127971, -59624, 88679, 26049, -34876, -103381, -236971, -229546, -80105, 93051, -32610, -67790, 41066, 66226, 57995, -17093, -173614, -53231, 40625, 223519, 254850, 119758, 151206, 72361, 88089, 167217, -26895, 138815, 100065, 9086, -1727, -50653, -110764, 21416, -29964, -169833, 9776, -116569, 59570]
29083E9570j04636o8385m4193J17074K8176k4424J178j3512j00926K01521J63311
29072B14754k05761n7811k3969j05685J5054J27012o6946K14592j03565R693N1530
29061F8898k25098Q1116N0306J540p6748N6807M5529O035K03848k74247L7986
29050b4028J37707j6939Q2938j57846r758j96943P159J03911m0327Q4893n8776
29039h8009J49699l7518j53537O1846j01548J9987K04518k0099j82890J00640
29029d6911M3826j27984J7568J33541n7137n3393O4932J79705k07830k1877M1889
29018c3671J23311K7774l3992J4612k02148O0890j18118L5888J51703J14910
29008A41159O6948k30012P5544M691J9578j49950Q8538J19066m9910k9143l7182
$$ y = [59570, -45066, -113451, -157644, -40570, -12394, -36818, -35640, -49152, -150078, 51443, 214754, 8993, -48818, -72787, -178472, -163418, -36406, -103352, 111240, 7675, 17368, 68898, -156200, -75084, -24778, -23238, -99986, -43179, 2350, 8385, 212233, -62014, -24028, 113679, 96740, 179678, 21832, 12074, -184869, -177710, -73799, -114126, -29233, -88009, 61690, 24172, -129365, -67519, -169067, -149080, 55438, 35339, -147551, -46911, -3085, -131069, -113501, 20040, -37097, -90490, -25558, 154147, -53683, -75560, -33671, 89640, 117414, 83422, 98034, -104114, -43224, -161342, -125454, 26249, 141159, 208107, -21905, 53639, 58330, 77908, -72042, 16496, 135562, 85652, 56509, 19327]
28997A9327J74511j42802j76436k4476J61471j4445n4068n2971k4986j16513
28987b51388J61852K8174J0285P5010J03245J2546n0116r2490j0600Q9065k90862
28976b15279Q6684J15296j23909J1031K30841n2253k85684J65336K00823P152q794
28965A31244p5916r8038K0167j21142J0341J78420l21466K11639o534K35567
28955A64282K4051j35131j26404J39621j06544q4219k6623K24365J27116j02312
28945I8202l5159p5285M3165o9844O9051p1128n6936J07462J21352P8028p0801
28934A38107r1981O9380m1915k03168r2758K60927q7383k3077j80491J23973
28924a28386J81091p0003p2977J50919J45793N0394j31148l430J6236q9696J20775
$$ y = [19327, 193838, 51036, -125400, -149876, 11595, -2850, -56918, -109889, -134875, -251388, -89536, -61362, -51077, 23933, 127178, 139724, 89608, -2882, -13482, 75583, -215279, -128595, -13299, -137208, -126177, 104664, 52411, -233273, -67937, 132886, 140038, 131244, 55328, -42710, -22543, -143685, -133344, 45076, -276390, -64751, -71285, 164282, 188333, 53202, -73202, 66419, -40125, -124344, -150967, 73398, 200514, 98202, 63043, -12242, 30923, -38921, 30130, -40998, -97934, 9528, 130880, 208908, 138107, 46126, 115506, 73591, -129577, -222335, 38592, -48791, -71868, -252359, -128386, 52705, -17298, -90275, 60644, 206437, 256831, 125683, 122253, 138489, 48793, 169568]
28913A69568r8729p3996O0991j37788j02751Q1440j10851J10409L1747J35829
28903F5869k87495q867J95392m2499J55423M5270j51184K130J00210o8211j49402
28892a43364O7194O7146q8247Q156O7848O3350k0922n9910q2010j83839J36034
28881a68564q9299o6238J82742m6969J61606j6969Q3521P2837k39598J54579
28871B7648j03706j33411J20403K8268K2863N9666K09482j93428j29256J09203
28861A7732J28572p0645O2352Q1629Q176r8431L3310n5823j50726J870n0554P1854
28849b0684j331m4487P4783R3126j02310p3822L5381O4111L9078R8424J2977j24814
28837E0432L2750N4693j39756K3291K3337k396j24839J57809M1212r4437n7049
$$ y = [169568, 70839, -3157, 57834, -79954, -182705, -101265, -212116, -101707, -69960, 65869, -221626, -230493, -35101, -77600, 77823, 123093, -28091, -25961, 74249, 6038, -143364, -76170, -9024, -97271, -89115, -21267, 42083, 21161, -38749, -120759, -304598, -168564, -257863, -324101, -141359, -188328, -26722, -43691, 39830, 112667, -126931, 27648, -76058, -209469, -89066, -60798, -37935, 21731, 231213, 37785, -91471, 17732, 146304, 75659, 138011, 219640, 227816, 129385, 162695, 106872, -43854, -41984, -92538, -20684, -22015, -66502, 8281, 101407, -903, -74725, -39344, 24767, 63845, 162269, 175246, 50432, 83182, 137875, -1881, 21410, 44747, 42351, -82488, 75321, 116533, 22096, -34953]
28826c4953J45965q3907K7731N1619p9631L0531q1054L9987J25914j14325j18871
28815i0994J48441p7028l1798j42398j34306J25235K3901n0127P5467K218j01148
28804b52537k3869J48191q8302J57020O3371J22599O276l0672k08469K2970O4708
28793a8714k6533j63256L02993j24407J88446o8883p4180Q989p386j38890q690
28782a30511J52353k4381J63619J0084j30689J9414L0256J00983K1545j42150
28772G0523j67414k3055K36055J99537M4978j11274k07564j42410q3558Q8527
28762i5655Q9692m5360o1801O0394k8763l0468J82695R9847J4534m1793j33457
28751I865k05336J54253Q1752Q5988j06195k06734p0450R4592J67510l3030j13672
$$ y = [-34953, 111012, 27105, 54836, 106455, 26824, 57355, -23699, 16288, 142202, 27877, -90994, 57447, -19581, -51379, -193777, -328083, -202848, -178947, -229074, -153607, -151389, -252537, -276406, -128215, -216517, -59497, 3874, 126473, 132749, 102077, -106392, -83422, -18714, -45247, -208503, 94490, -29917, 158529, 89646, 15466, 24455, 17069, -121821, -130511, 21842, -2539, 161080, 171164, 40475, 59889, 90145, 191128, 212673, 70523, -96891, -119946, 116109, 315646, 360624, 249350, 41786, -100624, -184182, -95655, -5963, -51323, -113124, -52730, -81493, -111961, 70734, 170581, 185115, 143322, 9865, -195471, -41218, 40534, 126522, 20327, -186407, -256857, -162265, 5245, -27785, -141457]
28740a41457J88770q4470R1703K6877l1120R1907m1458j78398p4973P9601l9725
28729a12743r6921j54360k8761J21095J98235K5386j19880R0153j27777J467O1741
28718a42365J32018J870j73619J20786J58321m4999j68166k0645m5852J98279
28708A5628k3086r2151j81188J31787M8737j1173J5802o6024J40042k5887J93657
28697A46144J05227o1797j88703L3436j31139K2072j69J2837J69026P2549j32320
28686D7163n4041o8736J26909j0258j20310J68000j03457K18831k18355N6177
28676D1923l0158p5686J32658j18999J19993o6796j94014J92345l659k7169J9208
28665a0354j08250o5500R1611K41746q7425k4551q1614M721J29222R2380j07002
$$ y = [-141457, 47313, -37157, 54546, 81423, 50303, 142210, 100752, -77646, -152619, -73018, -112743, -209664, -364024, -392785, -271690, -73455, -48069, -167949, -77796, -205573, -204106, -142365, -10347, -8477, -182096, -61310, 97011, 52012, -116154, -136799, -182651, 15628, -7458, -99609, -280797, -149010, -100273, -111446, -95644, -161668, -21626, -47513, 146144, 251371, 189574, 871, 34307, -96832, -74760, -74929, -62092, 106934, 179483, 47163, -6878, -75614, 51295, 41037, -79273, 88727, -14730, 204101, -14254, 41923, 11765, -63921, 68737, -50262, 69731, 2935, -191079, 1266, -2393, -29562, -10354, -118604, -184104, -92493, 149253, 61828, 37277, -44337, -39616, 89606, 181986, 74984]
28654G4984j11742m2908O8924J40687K14414j67528k45493j32590n1524J5193
28644b37583M2002o7705J49080O4273J09590n3393N2447J18134j60823J02557
28634A18579M2635r3699o0896j07989j20205j60469L66433j45837K31434j5230
28624E4756k1308j46629l7002K9550o5968J00001p5318M7336l4555J05346p2767
28613a16558L0010J67959o3027r1123J6913l7528J08517N8583J7541j71593p6418
28602a56724r409k3049J85884R8114P2618j67042j51818r4048K00772J04662
28592E9960N0207J9963k89261J83568k14618O1315L6252l5081J69332N2092j70445
28581g6716P7469K7100q7505j46002J20314J0742n5419j2127O0479Q9851N5814
$$ y = [74984, -36758, -79666, -10742, 129945, 344359, 176831, -68662, -201252, -252776, -237583, -195581, -263286, -114206, -49933, 59657, 6264, 58711, 176845, 16022, 118579, 161214, 67515, 6619, -101370, -221575, -382044, -15611, -161448, 69986, 54756, 33448, -113181, -150183, -120633, -186601, -86600, -161918, -114582, -149137, -43791, -116558, -86548, 81411, 18384, -72739, -55826, -93354, 15163, 73746, 91287, -80306, -156724, -166133, -189182, -3298, 94816, 167434, 392, -151426, -245474, -44702, 59960, 110167, 130130, -159131, 24437, -190181, -128866, -92614, -127695, 41637, 93729, -76716, 753, 27853, -59652, -205654, -85340, -74598, -130017, -142144, -81665, 8186, 64000]
28570F4000n1053j7373J9326j50834l0083L9217p1849R6945O7148P8911m4648
28559b93o9839P712p6207Q3430N381r3116J12881M121j04216p4913K77306j41886
28547f9639l1436J58322P3783k91154o5655J11611n814J60843N4762j47217o2530
28536a14124L7152j8499K27548j33856q9444J05770J4183j186k9750j16000L0770
28525h7436M6058N8546J2098j49575K42090k61206m2787J27028m608l2468j857
28514i4117Q528J126Q1631j19459J4430M2257J40659q820j62578p7329J13358
28503f0314o5756j82164J67423K08078J1079n0102k86545n531J62153p8598Q0558
28492i9719J04039q3104J98410K4545p8613K6455n9450N0456J08934j29290l374
$$ y = [64000, 12947, -4426, 14900, -135934, -166017, -126800, -198649, -101704, -34556, 44355, -293, -70132, -62420, -138627, -55197, -49816, -142932, -30051, -25930, -130146, -205059, 72247, -69639, -101075, 57247, 131030, -160124, -225779, -114168, -119982, 40861, 95623, -51594, -114124, -76972, -95471, 132077, -1779, -91223, 14547, 28730, 27544, -2206, -118206, -87436, -41378, 17168, 29266, -120309, 121781, -139425, -182212, -55184, -59792, -92260, -94117, -85589, -84463, -2832, -122291, -107861, -65604, 75055, 66235, -96343, -173672, -60314, -126070, -308234, -140811, 67267, 78346, 28244, -258301, -263832, -101679, -180277, -99719, 4320, -78784, 119626, 144171, 65558, 92013, 32563, 83019, 191953, 62663, 59289]
28481E9289j37748J33818j95212j05287O0360J46076L8147j30507P7462L6727
28471a6875M7804N9490L1721m749j86104M1382Q5609J31103r8879j28773j23988
28460a62259J7221Q3874O1187P7216J64319Q8842j23216q8336r7300R4560k37038
28449a20930l6227J04880Q1996K3715j79382K8206Q6018j22605N689J26140M7708
28438D5208j34088r3074j0284Q5918P2636Q2885j76897J2963L7515L8817n8934
28427i7335l4711j4817q6000J70526J67169n1679j69854O7771j77496K38163
28417A1737J63386j69305q5959m0452o8967J48422Q8803k2939j91028J08182
28407e8120J35293j20260R0019L7482n9294j48429J54535J29026j15854J91119
$$ y = [59289, -78459, 55359, -139853, -245140, -184780, -38704, -557, -131064, -53602, -16875, 30929, 90419, 122140, 117391, -68713, -27331, 58278, 189381, 90502, -38271, -162259, -145038, -61164, 23, 77239, 241558, 330400, 207184, 118848, 21548, 116108, -120930, -157157, -52277, 29719, 53434, -125948, -97742, -11724, -134329, -128640, -2500, 45208, -88880, -181954, -192238, -106320, -33684, 49201, -127696, -114733, -77218, -38401, -97335, -132046, -146863, -232863, -62337, 104832, 53153, -116701, -48930, -226426, 11737, 175123, 5818, -80141, -120593, -189560, -41138, 47665, 24726, -166302, -58120, 77173, -43087, 46932, 84414, 25120, -123309, 31226, 160252, 44398, 235517]
28397B35517j49932k55765O2095M3770J19761k4467j50998L0620N5597Q5067l0829
28386B0436J13045k1329J4851k9172k02793j95532P4545M266K75606Q0747q4438
28375E0232J27042K6226k53661j6373J72926j64586P6331l4870l9780K4477K23891
28364A91855j3588k19996M1528R0507J139j28577n3347K5623J23K82107m5337
28353A72037k50268r4589K39293j00914j0068N0486L5676j61821m9786J72897
28343B943j41052l1388J41417p553J7879k0884p7083N4885O4453K07760K3942
28332B35319q8440j20543r7750K00684j1773j11380R5842K3861j40495Q4678M686
28321G4689J1758j7173j08036k28891J68927Q481j64868M3776j51192J01185
$$ y = [235517, 85585, -170180, -108085, -64315, 55446, 30979, -120019, -89399, -33802, 51265, 20436, 133481, 112152, 127003, 97831, -104962, -300494, -225949, -221683, 53923, 134670, 50232, 177274, 203500, -50161, -66534, 106392, -58194, 18137, -16733, -56513, -32036, 191855, 178267, -41729, -201, 90306, 91445, -37132, -90479, -64856, -64733, 217374, 172037, -78231, -172820, 66473, -34441, -44509, 5977, 41653, -120168, -169954, 2943, -138109, -169497, -28080, -35633, -17754, -38638, -115721, -60836, 3617, 211377, 235319, 146879, 26336, -71414, 129270, 117497, 6117, 101959, 125820, -14675, 70003, 74689, 86447, 69274, -38762, -267653, -98726, -90245, -255113, -211337, -362529, -261344]
28311b61344k2527M7563K1935L39536j37748k0221J24311O805j92816R7652J69044
28300A72190j18751o9676j40284J14342O5529N0356o2707K8257N6567l4886K8080
28289H9017j05951j05148J00790M7657n9650q0910j65625Q2599K0605J72583
28279d033J24005j56639P1279p7303K15143j12693n9399o6362N3210k9558P6105
28268C3755L2000J07418j37503k35002r2393J41110M7188m8295J73867J09631
28258A31776k05733n3682R5641M3189l9836m5008j11618j38709R4740J40827
28248h8413J74253J2769q66l2872j47939m0476p3227J69058O3756J35438q5041
28237H6440r0983Q932k37443J15763K32908N4666O330m1457p7240j22482J93431
$$ y = [-261344, -283871, -236308, -214373, 125163, -12585, -32806, 91505, 98310, -94506, 3146, 172190, 53439, -16237, -156521, -42179, 23350, 73706, 10999, 39256, 95823, 60937, 89017, -16934, -122082, -21292, 26365, -33285, -114195, -279820, -197221, -176616, -4033, 119972, -36667, 34612, -42691, 172452, 59759, 360, -66002, -12792, -42350, 33755, 65755, 173173, 35670, -199332, -291725, -150615, -103427, -151722, 22145, 131776, -73957, -127639, -31998, 11191, -28645, -73653, -185271, -323980, -229240, -88413, 85840, 98609, 97743, 64871, -83068, -123544, -196771, -27713, 36043, 171481, 86440, -4543, 4389, -233054, -117291, 115617, 170283, 176613, 135156, 57916, -64566, 128865]
28226A28865k59981K5194R4964j06158Q7963j40680l5801J01765J15768j24838
28216a12939j07051J11468L9932K73274o0901k09468o3659j61536Q2771K9331
28206a78778R2190j68769J07695j3578n8609M8862J57294K24248j44322j44541
28196g8308m1165J01683p0730p537l0710j74547L32851k0133n0754j12608r3743
28185b45701J83453K90784j04777o6140J94626j16198O1071j16113L9586J0559
28175A31150N0465j9334p2344j15173p5998J23002r900R2927j10794J5898j88836
28164a78937O9704J49505m7954m424n9087m0273j58330R9076r7169J4062K20962
28153c2865k8034L6395j08864P1846k2064K2881N4333J55788L562n721J04252
$$ y = [128865, -131116, -105922, -10958, -117116, -29153, -169833, -205634, -103869, 11899, -112939, -219990, -108522, -68590, 204684, 143783, -65685, -129344, -290880, -208109, -178778, -86588, -255357, -147662, -161240, -219849, -170987, -13693, 210555, 66233, -78308, -119473, -17790, -88520, -96057, -126767, -301314, 31537, 11404, -39350, -151958, -245701, -62248, 228536, 123759, 57619, 252245, 136047, 197118, 81005, 120591, 131150, 181615, 162281, 89937, -25236, -101234, 21768, 11868, 104795, -5999, 9899, -178937, -109233, 40272, -7682, -12106, -71193, -111466, -269796, -170720, -267889, -253827, -32865, -60899, -24504, -133368, -61522, -83586, -60705, -6372, 149416, 152978, 147257, 251509]
28142B51509j92853l38518M8110J48781K74412M53r2027J02323k14128k5873q7155
28131a24966m4789R8272R002K99107j77713R089J5054K6464O9727m2387q1591
28120E5269q2614n6891Q6880o8872P9242l7832n0331m9378K9659R8816P1938m9614
28108B6272P1342k2043l868P6773R5031p55j35584n9248j13586j75486O7278J52160
28096b1714q8681M1919L8441n6967J12423n5592L6175o3049L1641K41131j6287
28085A99440q2444j08171N0083k48092J67379K19563k08537J3150L6687l9577
28075e19o9120j51669P4076L5219Q3512J8365j1501K1150p2415o9128k2165J97974
28063C3779r4630j4430M6432P9932j31190p4206K51299N7092k21706N8942Q11L9490
$$ y = [251509, 58656, -279862, -231752, -82971, 191441, 191894, 99867, 202190, -11938, -37811, -124966, -169755, -71483, -62481, 236626, 58913, 68002, 83056, 109520, 179247, 136860, 55269, -27345, -84236, 2644, -66228, 13014, -24818, -75149, -124527, -94868, 3948, 75886, 26272, 97614, 75571, 71703, 148476, 243507, 242752, 107168, 47920, -65666, -241152, -173874, -21714, -110395, -68476, -30035, -87002, 25421, -30171, 6004, -57045, -25404, 215727, 199440, 116996, 8825, 58908, -189184, -21805, 197758, -10779, 2371, 39058, -519, -69639, -221308, -147232, -112013, -28501, -10136, -21637, -487, -72902, -142030, -164195, 33779, -60851, -75281, -28849, 51083, -80107, -154313, 96986, 154078, -67628, -8686, -7875, 31615]
28051C1615j4454j46727O7458N7559Q7101j10447j91766L9958j17484n6175K91547
28040f1815J31448j23156k2925J8672j3379m5632o9100p4085p5086R5048J62343
28029g7667J89290p0836j28582q8341R7130o1469J05970M6851j11308m9471Q7255
28018f1178p7326K19590O8665L3959p784r8250j93875Q9384L6091k5969K5237
28007H544l3181j23980R4660J79204K1051j37966L8533j91130M4123K34034J4149
27996A48041k78325J12680q2569J7557J83452J64048k80207j42515k0388q3571
27986b61797J62700J4926o4973J06460n0582R1960L0953k85275m529K04097M5360
27975a0700J08301k0962l9565r9483l7425k4541q6888J47388J26038R2209r6682
$$ y = [31615, 17161, -129566, -62108, -4549, 82552, -27895, -219661, -179703, -297187, -353362, -61815, 69633, -53523, -76448, -57776, -71155, -116787, -185887, -259972, -335058, -240010, -77667, 111623, 40787, -87795, -176136, -79006, -140475, -34505, 12346, -98962, -148433, -61178, -138504, 81086, 149751, 183710, 175926, 77676, -116199, -26815, 9276, -16693, 8544, -24637, -148617, -53957, 125247, 146298, 8332, 46865, -144265, -100142, 133892, 148041, -130284, -17604, -100173, -82616, 100836, 264884, -15323, -157838, -178226, -261797, -99097, -84171, -149144, -42684, -93266, -1306, 29647, -255628, -260157, -56060, -10700, 97601, 76639, 37074, -62409, -99834, -124375, -211263, -63875, 62163, 154372, 57690]
27964E7690j7251j28235N2039o3867J83296q3623j26956R0752j5182J10235J43458
27953B02356k82734O5088P6165j48141J77381j07518n017N4259j27333r1083N1952
27942a34625J60634j25563j2590J71935r4151k0958q1353J48294J04118o4024
27932E1717P8225J2728j80814j24310R784N5227K35863o1252k11409m0015p0301
27921b44557j11240J16881Q8796M0482J9597N8898Q5313p9483k7017l7687J50056
27910F0039L1797n3547J71324m0505j14636j49359J34982R290j27181J80555
27900A02759L0467j56233M8127R6909j69498p9292J07238o054K07344m1369n1538
27889H8860K6333j19625j54856J9320N7920n5102o2391J46817N4732K35808o0883
$$ y = [57690, 40439, -87796, -35757, -99624, 83672, 49, -126907, -36155, -51337, 58898, 202356, -80378, -15290, 60875, -87266, 90115, -17403, -22420, 31839, -95494, -186577, -134625, 26009, -99554, -112144, 59791, -34360, -55318, -136671, 11623, 115741, 51717, 129942, 142670, -38144, -162454, -152670, -97443, 138420, 77168, -134241, -174256, -244557, -355797, -238916, -150120, -109638, -90041, -31143, 54170, -25313, -52330, -90017, 60039, 91836, 38289, 209613, 169108, 54472, -94887, 40095, 49385, -77796, 102759, 133226, -23007, 25120, 122029, -47469, -126761, -19523, -25577, 181767, 140398, 88860, 115193, -4432, -159288, -139968, -82048, -137150, -199541, -52724, 2008, 237816, 176933]
27878A76933j96120j00017K7572J7333L8905J75830M3805q0689l2911n8920J67839
27867A79560J39356l1453M7210r5051l50553O4994L7260J9958J91558m5834j07046
27856D9959m0033J68672R2736K641l01944J35850l1471k0351n0148j9821O2616
27845D8706r2005R7909j11572Q4935J42987j14070K1246l1143j0346n6809k6406
27834d6568O4587k1174P4792J93804Q2163k5190M8274j58860o0995J91518J69225
27823E11576j15928P1990j22853r3203N1899J71077j43679J13263r6674J20434
27813D67902l3762N2027K09339J04565L16009R8376K1560J92971J53565J73495
27803A756047O6734K4005J41480r3110j14878J31531p9466k30456j63758j54729
$$ y = [176933, -19187, -119204, -91632, -74299, -35394, 140436, 184241, 103552, 70641, 11721, 179560, 318916, 287463, 334673, 239622, -110931, -45937, -8677, 11281, 202839, 157005, 49959, 9926, 178598, 271334, 273975, -27969, 107881, 76410, 56059, 5911, -13910, 48706, -43299, 54610, -56962, 27973, 170960, 56890, 78136, 46993, 36647, -20162, -46568, 18019, -3155, 71637, 265441, 347604, 322414, 370688, 211828, 150833, 342351, 511576, 395648, 467638, 344785, 251582, 303481, 474558, 330879, 444142, 347468, 467902, 434140, 486167, 695506, 800071, 1116080, 1214456, 1236016, 1428987, 1582552, 1756047, 1822781, 1846786, 1988266, 1895156, 1780278, 1911809, 1832343, 1601887, 1438129, 1283400]
27793A283400n2372j77231m3120j71095j27058M4353l1891j52540j08769n8183
27783D05494j91846q3103k8888j20066O691J73751P8486j03411k4725K12850
27773C25233j34070o1468j693J64872O7023K6131Q2073l7327J86793o6784l0943
27762E19840j23672J15278J75088J74405M7813K6264L86091K36590K3654R4934
27752A676285k16924K26987Q8613M4860j569J8604m6764j6170k76196m3355j19749
27741A334622j98135j86773l8727o9832m05592k1186O5594j92204j3859J9907
27731B93815J66420l00385R0297R914n0510J2963q5282M4059j82879K32569j49110
27720H1871j75477J94360r8549L6754J09292j00456j1527K25141J12550j23010
$$ y = [1283400, 1231028, 1053797, 1010677, 839582, 712524, 756877, 724986, 572446, 463677, 405494, 213648, 130545, 101657, -18409, -11718, 162033, 240519, 137108, 112383, 325233, 191163, 129695, 128002, 292874, 359897, 386028, 468101, 430774, 617567, 550783, 519840, 396168, 511446, 686534, 860939, 908752, 935016, 1321107, 1557697, 1581351, 1676285, 1459361, 1686348, 1774961, 1819821, 1818252, 1836856, 1790092, 1773922, 1497726, 1454371, 1334622, 1136487, 949714, 910987, 841155, 435563, 414377, 479971, 287767, 273908, 293815, 460235, 159850, 250147, 260061, 209551, 222514, 137232, 181291, -1588, 230981, 81871, -93606, 100754, 2205, 38959, 148251, 47795, 36268, 261409, 373959, 250949]
27710B50949j10208J079J111J03802l2397j41917O0160J7319n3466k3257O3215
27699A36390n0460p3458l7669M8539k1628J45987R849j86121J01960m226r7376
27688b8213O1445M6146j1520o7889R1470n3744L6656J1080p9278m8081P8638j58375
27676a21665K17066k9828Q4656j1869k47424j4244l0910k8484j354K33153k733
27665D6364r3908j7425M5608O7739N1734J42140j80661j04477L1019R1397L2430
27654A11960j12408q1565R4163O2579L8621P8243k9344p9959j13261K68281M4851
27643B82161l7469r0670k0253j46049P9940R808N417j5020R938l3715L9855J23136
27631B07079o3044j17387p8973J58005J14594j82174n6758J35028o0618j38640
$$ y = [250949, 140741, 141820, 142931, 246733, 214336, 72419, 132579, 149898, 96432, 73175, 136390, 85930, 12472, -25197, 23342, 1714, 147701, 157550, -28571, 73389, 69163, -28213, 33232, 79378, 67858, -31, 91439, 37695, 74351, 85431, 6153, -41928, 36710, -121665, 95401, 65573, 150229, 138360, -109064, -123308, -154218, -182702, -184056, 49097, 46364, -47544, -64969, -19361, 48378, 100112, 242252, 61591, -42886, -11867, 79530, 111960, -448, -82013, 12150, 74729, 113350, 191593, 162249, 82290, -30971, 237310, 282161, 244692, 154022, 133769, -12280, 67660, 77468, 82885, 67865, 77803, 44088, 83943, 207079, 144035, 26648, -52325, 105680, 220274, 38100, -18658, 116370, 55752, -82888]
27621h2888N0874l8451R901P4971k45830K38266J79048M2569L749J4253j35997
27610A10465L6956l6852P0008l1684J6871q5644j51344N0504K9073O9513J09106
27599A86972Q2281j90127j3641l4220J34913m0368j67165J29915j35120K0602
27589b5958O1113j17259J45358M8077O00M3846L4446P5083k7152p0057j45586
27578B2511j192J62854l7488p8808R3641R5409J23p2475j10999k08613N413J28640
27566i84P875K02799j09099n5881j2618n619j7482K47138K1343p3709n4115q0266
27554F9382K8633K4843P481J40904N4477J8846l19254o694L4534o5106r7714J11261
27542A593L2264p8489j35769R4379K00652J1620j346k30362J43623N2317j6758
$$ y = [-82888, -32014, -70465, -60564, 14407, -231423, 6843, 185891, 228460, 232209, 246462, 110465, 147421, 110569, 180577, 148893, 165764, 80120, -71224, -20720, 8353, 77866, 186972, 269253, 79126, 65485, 31265, 166178, 125810, -41355, 88560, -46560, -25958, 35155, -82104, 63254, 111331, 111931, 155777, 190223, 265306, 238154, 168097, 22511, 21319, 184173, 146685, 67877, 161518, 256927, 257050, 184575, 73576, -135037, -129624, -984, 6891, 209690, 100591, 44710, 32092, 26473, 8991, 256129, 277472, 203763, 149648, 69382, 98015, 122858, 130339, 271243, 325720, 344566, 25312, 18618, 53152, -11954, -109668, 1593, 33857, -44632, -180401, -86022, 114630, 126250, 124904, -105458, 38165, 90482, 73724]
27531G3724J56713j64416O7276K10148k84087r0681K03434j5357o5524J66766
27521B57996J05594q0219r081Q459j21647j21939Q7146O1447m7116n8930q4219
27510b509j23037K59320q0438J02738J81234j59027J7366J09890J40072l30925
27500A14684K5391r6590J89603L3861J13694k0012n4915O1590j84355q0101q3696
27489A9154Q8506R9235M7401l6499j1253R6743j68214o6326P5389J27289L6260
27478C07685j416J0165j39080L4818r8201R263O6071L0261j27453J49837J73840
27467D15790j53534k21897K4000K25951M9046J13353j70540l9757p3216K15358
27457C84554N3628q0190p455P738j36021m4359J08169N9099k2989J04036k5151
$$ y = [73724, 230437, 66021, 133297, 343445, 59358, -31323, 172111, 156754, 91230, 257996, 363590, 283371, 274290, 282749, 161102, 39163, 126309, 187756, 140640, 81710, -2509, -125546, 133774, 53336, 156074, 337308, 178281, 195647, 305537, 445609, 114684, 140075, 43485, 233088, 266949, 380643, 360631, 305716, 367306, 182951, 102850, 19154, 107660, 206895, 254296, 217797, 206544, 303287, 135073, 68747, 144136, 271425, 307685, 306269, 316434, 177354, 212172, 113971, 123234, 189305, 219566, 92113, 241950, 415790, 262256, 40359, 64359, 290310, 339356, 452709, 282169, 242412, 169196, 384554, 438182, 357992, 350537, 358275, 222254, 177895, 286064, 345163, 322174, 426210, 401059]
27446D01059Q2969j10994J31502o8301o6076l8216M8894r61Q3311j13807Q2682
27435D32062k2929r8505J83408J56721j77384n5645R8536l5776N3055O5163j98167
27424D00539p7712m3541J35436k6502j46773Q4705Q2260l2900K03433j08417
27414D70528j72161j79218L12631R6357k50519j6301K279R0419O8272Q4469M2796
27403E49552J95659j87359M4989M9651J42429O3093J39969J3352J33488j08474
27393A036349l5128q5433j4605l2204j9402J82366J18284J65049J15095k00561
27383A229810l988r729R7708j00314K60029J9353j31324J72352J64944k4064K14814
27372A889591P1855L87177R4683L13969N51588N46017K87514L51551O84589M69189
$$ y = [401059, 484028, 373034, 504536, 436235, 370159, 331943, 380837, 379876, 463187, 349380, 432062, 409133, 310628, 494036, 650757, 473373, 417728, 516264, 480488, 533543, 598706, 400539, 322827, 279286, 414722, 388220, 241447, 326152, 408412, 375512, 578945, 470528, 298367, 119149, 431780, 528137, 277618, 261317, 263596, 354015, 422287, 506756, 549552, 745211, 557852, 602841, 652492, 794921, 858014, 997983, 1011335, 1144823, 1036349, 1001221, 915788, 901183, 868979, 849577, 1031943, 1150227, 1315276, 1430371, 1229810, 1225822, 1216093, 1313801, 1213487, 1473516, 1492869, 1361545, 1533897, 1698841, 1674777, 1889591, 1961446, 2348623, 2443306, 2757275, 3308863, 3854880, 4142394, 4493945, 5178534, 5647723]
27362E647723K92704K03997J60631j588J74666J05440j52399j60979k46785k07406
27352E816004m05585n25554m63762l71541k87698j29952k31238n9380l44888
27343B996406j06926j1816N1468J58300o4205J75526J52401K03541R4140R0122
27333C738957n9546L02005J98818Q2528J44986K03674K14362J04390J71823L74837
27323E476834J17462K43688L61105N87710K90762L46968O21582Q06725N30921
27314I383757Q43830P99578M65524Q06689Q54754P94727L78219N33793N52295
27305A5413166O06928M13300J93934M99362M65964L44825N18515O50308R07357
27296B0013659R16683J060327J412677J742631J996033K363696L147948L399482
$$ y = [5647723, 5940427, 6144424, 6305055, 6303467, 6478133, 6583573, 6431174, 6270195, 6023410, 5816004, 5410419, 4884865, 4421103, 4049562, 3761864, 3631912, 3400674, 3341294, 2996406, 2889480, 2877664, 2929132, 3087432, 3023227, 3198753, 3351154, 3554695, 3648835, 3738957, 3679411, 3981416, 4180234, 4262762, 4407748, 4611422, 4825784, 4930174, 5101997, 5476834, 5594296, 5837984, 6199089, 6786799, 7077561, 7424529, 8046111, 8852836, 9383757, 10227587, 11027165, 11492689, 12299378, 13154132, 13948859, 14327078, 14860871, 15413166, 16020094, 16433394, 16627328, 17126690, 17592654, 17937479, 18455994, 19106302, 20013659, 20930342, 21990669, 23403346, 25145977, 27142010, 29505706, 32653654, 36053136]
27288C6053136M515424N096537O380960P977665R930564J2499172J6083379
27281I8536837J9940301K5197146L0565352L2182485L1171947L0801959L0312969
27274B98708996K6630413K1539699J5812676P331963j110072n859934j1153124
27267C51900617j8982255k6879559l1499731l3677984l3614146l1605910l0080206
27260A45560826k8309515k3982989j8528190j3267785r290351o509208m750985
27253D0921803k939924k199359j580229j094868j016503n77869p7556j97089
27245C1238406K67486N39091O18744J210889J323109J788698K430723L035089
27237D2452235L864810M720236N848410P374203R390329J2070238J5385340
$$ y = [36053136, 40568560, 45665097, 52046057, 60023722, 69954286, 82453458, 98536837, 118477138, 143674284, 174239636, 206422121, 237594068, 268396027, 298708996, 325339409, 346879108, 362691784, 370023747, 368913675, 363053741, 351900617, 332918362, 306038803, 274539072, 240861088, 207246942, 175641032, 145560826, 117251311, 93268322, 74740132, 61472347, 52181996, 45672788, 40921803, 37981879, 35782520, 34202291, 33107423, 32090920, 31513051, 31435495, 31238406, 31505892, 32044983, 32663727, 33874616, 35197725, 36986423, 39417146, 42452235, 46317045, 51037281, 56885691, 64259894, 73650223, 85720461, 101105801]
27230A01105801J9471119K5241623L0908075L3793022L2377092L1790153L1763584
27223C06450469K8689330K2490376J6229541P736692j436320o464036j1511037
27216C62185015j9092010k7636957l2401096l5087235l5291347l3001726l1685815
27209A47988829k9785225k6123243k0526762j5217767j0821292p622724n608950
27202C2282866l897121l106847k820690k296832j696261j466268j374157j333851
27194A4290839j223900j439212j095632q33890r31560p54186o41592o02820m04682
27185F363365o71984m14269n73047n69796m80902k69596j67253P1826j12583
27176C175761l74287j83228n6983j91456j86566L8396O0560k31628N247R23R3458
$$ y = [101105801, 120576920, 145818543, 176726618, 210519640, 242896732, 274686885, 306450469, 335139799, 357630175, 373859716, 381596408, 380160088, 373696052, 362185015, 343093005, 315456048, 283054952, 247967717, 212676370, 179674644, 147988829, 118203604, 92080361, 71553599, 56335832, 45514540, 37891816, 32282866, 28385745, 25278898, 22458208, 20161376, 18465115, 16998847, 15624690, 14290839, 13066939, 11627727, 10532095, 9698205, 8766645, 8012459, 7370867, 6768047, 6363365, 5691381, 5277112, 4704065, 4134269, 3653367, 3383771, 3216518, 3288344, 3175761, 2801474, 2618246, 2561263, 2369807, 2183241, 2221637, 2282197, 2050569, 2055816, 2056739, 2150197]
27165B150197k5653k38483k73250j09317k3873j71078o3161l3142j37250M1664
27155A116654L6326l4612j48797r1166l6644Q0028N9007J6544j09665q4715K8659
27144H31619R7744P462l4126J11371l2228j23199J6171R8324P8664j76597j07399
27133G67806k003J06754o7137p0165m0142l0734j08225K5337J75239j89366j90195
27122C77169m9491K41495J72209k13119j88472L3839q8357j6217J4911j19359
27112A64608p2356R6942O3105J7613k15078Q6803J7619N172l4337J67232j06745
27101A90578J18603j26164M43L1690J30679o765J2950Q6207j90117N5599r1336
27090B12367J20651J907o1858L2802n0465q5910K02289l2872j11770j10521q3786
$$ y = [2150197, 2124544, 1886061, 1612811, 1503494, 1479621, 1308543, 1245382, 1212240, 1074990, 1116654, 1152980, 1118368, 969571, 878405, 841761, 921789, 980796, 997340, 887675, 802960, 831619, 929363, 936825, 902699, 1014070, 981842, 858643, 874814, 973138, 1051802, 875205, 767806, 765803, 872557, 805420, 735255, 695113, 664379, 556154, 581491, 756730, 567364, 377169, 327678, 569173, 741382, 528263, 339791, 373630, 285273, 269056, 283967, 164608, 92252, 189194, 252299, 269912, 54834, 141637, 159256, 164428, 130091, 297323, 190578, 309181, 183017, 183460, 215150, 345829, 339064, 352014, 438221, 248104, 303703, 212367, 333018, 334925, 273067, 305869, 255404, 169494, 371783, 338911, 227141, 116620, 32834]
27079C2834Q3599K30926k25756L6935J04194q1370J46206l5129m2705J650O0547
27068C11931j18722j1847r2106l4153P219J60181j3512n0758r6770J1059R0031
27057A62553J12610j03484k29144J13836J0554k9559l9170J64517j04758Q2606
27047A40561k8216j01517j7247J25319m2019J45807q2022p1925m1392R7613j04420
27036B0542Q9112Q4383n6296O9559j35936q9597J04429J80566p7859M4784j54650
27025G9037j25322m1903M9314J75899k7544k56424m8752J16598N4727J7462J09393
27014A02485M445p339o0959K6294J6065M9819J5691L8736L2237m8861j40692
27003B7921p0457Q9594P052j5133q5536j08527K11115J80946p8306j05532O6578
$$ y = [32834, 116433, 347359, 121603, 158538, 262732, 181362, 327568, 292439, 249734, 251384, 311931, 193209, 181362, 89256, 55103, 62322, 222503, 208991, 158233, 61463, 72522, 162553, 275163, 171679, -57465, 56371, 66925, 37366, -1804, 162713, 57955, 140561, 112345, 10828, -6419, 118900, 76881, 222688, 140666, 68741, 27349, 124962, 20542, 109654, 194037, 137741, 207300, 71364, -18233, 86196, 266762, 188903, 233687, 79037, -46285, -88188, -38874, 137025, 109481, -146943, -195695, -79097, -24370, -6908, 102485, 106930, 99591, 38632, 64926, 80991, 130810, 146501, 185237, 217474, 168613, 27921, -42536, 47058, 54110, 38977, -46559, -155086, 56029, 236975, 158669, 53137, 119715]
26992A19715k48418j72014K14708J00528q0693j49181J89920K49406M5209l60294
26982i1114o5146m627j0513J71790N3749j61188R1412j69844J44657L8967R4946
26971I3089R2535q7880o5641j4456J80452l43966J92717J38509K2413r3630K0335
26960A34477J0759m308p8120L1480O113J18570K8661k91172M3211K70306m5859
26949B24118j45980k10953J95329J44544j17677j38873J36931o5313k68200N7653
26939a88421O8753j2355J54087q3189p958J26589p0261J33220J59678j70090
26929A10053Q8677L0207q7782M6168q9949j32512J34004j32171n9953q012o4050
26918a65320K85054r822j29138j19146K18038o8040j01517o3853L18725J52857
$$ y = [119715, -128703, -300717, -86009, 14519, -66174, -215355, -25435, 223971, 269180, -91114, -156260, -160887, -171400, 390, 54139, -107049, -15637, -185481, -40824, -1857, 93089, 185624, 97744, 32103, 17647, 198099, -145867, 46850, 185359, 207772, 114142, 134477, 145236, 140928, 62808, 94288, 100401, 218971, 247632, -43540, -329, 269977, 224118, 78138, -132815, 62514, 207058, 89381, -49492, 87439, 22126, -246074, -188421, -119668, -132023, 22064, -61125, -69083, 57506, -12755, 120465, 280143, 110053, 198730, 228937, 141155, 187323, 97374, -35138, 98866, -33305, -93258, -101270, -165320, 119734, 109912, -19226, -138372, 79666, 11626, -89891, -153744, 164981, 317838]
26908C17838j00606j4621n7836j60378K2851M6523j25621M504K8512J97215q1876
26897G6505j80404J67290l1381k2124O1082j55618r0162Q002j00172J56186J71157
26886F0361J9933Q4299L7590p0829p9016l0229K0964n0929j4788J5692P5992L1947
26874A00987L4942j74978K5312J56729P6128N6331k09236n4435q3998k4944n3298
26863a50460R8160J01925q727K954K9834j33913Q938J6549Q1390j4561j03172
26852g1083j07176K9572Q0107l040J98868M4392j46771m7656j3854n6668K20767
26841A27458Q0554j97268j02407j74365J60519K42609j38208N2098j03504J37836
26831H5322j98211J57935q1746k22791K96590J1516n2258p9394Q5488P2006N565
$$ y = [317838, 217232, 202611, 144775, -15603, 7248, 53771, -71850, -67346, -38834, 158381, 76505, -103899, 63391, 32010, 9886, 70968, -84650, -174812, -166810, -266982, -110796, 60361, 80294, 164593, 202183, 131354, 52338, 22109, 43073, -7856, -22644, -6952, 69040, 100987, 135929, -39049, -13737, 142992, 219120, 275451, 66215, 11780, -72218, -97162, -150460, -52300, 49625, 40898, 43852, 73686, -60227, -51289, -34740, 46650, 32089, -71083, -178259, -148687, -68580, -71620, 127248, 171640, 24869, -22787, -36641, -93309, 127458, 208012, 10744, -91663, -266028, -105509, 137100, -1108, 50990, -52514, 85322, -112889, 45046, -36700, -259491, 37099, 48615, -3643, -83037, 2451, 74457, 80022]
26820H0022n0176o0157O1977M9988R3358j63549m9368r3526K260N0510k43270
26809c21931J53266K2132Q6355N8322L4492M9967l17739k0511R9341m7169K78178
26798G4703N4022o0938j0677o3138m8596p4010Q509N965j01809J46740J16097
26787D6868L6674P319n4138K12120k21900m036l7200k4295J99269q9164r8361
26776b6844Q880K18589k60598P6938N8925j95634L7710K29783j12158O6178l8207
26765F3562M0693R1335k26284K37348K5316k07401N945j2221J26363Q4052n6695
26754A72013J04776n8528M859l3256N359n0149k423N2699N4023K45516m6464J9759
26742D68184J99817J70070K04071P7695L9498J67234M4445K12879j11037J41929
$$ y = [80022, 29846, -30311, 31666, 81654, 175012, 11463, -37905, -131431, -129171, -78661, -321931, -168665, -146533, -60178, -1856, 32636, 82603, -235136, -255647, -156306, -203475, 74703, 128725, 67787, 57110, -6028, -54624, -128634, -120125, -114160, -215969, -69229, 46868, 83542, 90861, 36723, 248843, 26943, 22907, -14293, -38588, 160681, 71517, -26844, -17964, 200625, -59973, 16965, 75890, -119744, -82034, 147749, 35591, 101769, 63562, 104255, 195590, -30694, 206654, 231970, 24569, 30514, 18293, 144656, 228708, 172013, 276789, 218261, 223120, 189864, 195223, 145074, 142651, 195350, 249373, 494889, 448425, 468184, 668001, 838071, 1042142, 1119837, 1159335, 1326569, 1371014, 1583893, 1472856, 1614785]
26732A614785N4449L2431j48250N1861n6109k54834L0551P562p782l65935k48424
26721G10305O642k05460k8583Q6450j23400J10192j73859k65596o3438J13698
26711A66951j53729J16998J08641j71171J24924j66823j7646R6403K6615J3828
26701A44991l3476J06818J10062k09277j00981L00373J81727p0903J12411n1473
26691D90272K47422J09458R0454J45494j30183L33803L57275Q9766q2950J20080
26681A770891L2921J02801J25580n0047r6268j36043j55506j05982m35186K5183
26671A078344k86994l41397N143K21079m08506J27879Q5536j51512j36489J26021
26661C19104M3915j95420R2359J72764l38713P4034J14766q8348R4026j18515
$$ y = [1614785, 1669234, 1701665, 1553415, 1605276, 1549167, 1294333, 1324884, 1332446, 1324664, 958729, 710305, 716947, 511487, 482904, 569354, 445954, 556146, 382287, 116691, 53253, 166951, 13222, 130220, 238861, 67690, 192614, 25791, 8145, 104548, 131163, 144991, 111515, 218333, 328395, 119118, 18137, 318510, 500237, 429334, 541745, 490272, 737694, 847152, 937606, 1083100, 952917, 1286720, 1643995, 1733761, 1650811, 1770891, 1803812, 1906613, 2032193, 1982146, 1885878, 1749835, 1594329, 1488347, 1053161, 1078344, 791350, 449953, 455096, 676175, 267669, 395548, 481084, 329572, 193083, 319104, 363019, 167599, 259958, 432722, 94009, 168043, 282809, 194461, 288487, 169972]
26651A69972j27010M0718L9749J93860l5119N8306J61253Q5693K77411J5342O9688
26640I49863J03331M25629K06011Q7185L29554N50373M10460M71669K36583K98589
26630D069247J15239K21469M4734J40074L3469j35003L5162j69651p4103r1621
26620D189016n15300n28078j84150l21518m64737m80690k87301j31338k74157
26611A001747k01981o2304j58678K1377m5621J63921Q2209r4778j38877j44426
26601D22589J28294J07185Q1643Q7518N0836r204j12818j03905O582L19303K10879
26590A188902J68952J22632M04757M90567M45419L49023J99448N84295M00802
26581D354797J45880R7041J20350O7940K22844j37895j30711l90801j31445l2118
$$ y = [169972, 42962, 83680, 123429, 317289, 282170, 340476, 501729, 587422, 864833, 880175, 949863, 1053194, 1478823, 1684834, 1772019, 2101573, 2651946, 3062406, 3534075, 3770658, 4069247, 4184486, 4405955, 4450689, 4590763, 4624232, 4489229, 4524391, 4354740, 4280637, 4189016, 3673716, 3145638, 2961488, 2639970, 2175233, 1694543, 1407242, 1275904, 1001747, 799766, 737462, 578784, 600161, 554540, 718461, 800670, 705892, 567015, 422589, 550883, 658068, 739711, 827229, 878065, 868861, 756043, 652138, 658720, 978023, 1188902, 1357854, 1480486, 1885243, 2375810, 2821229, 3170252, 3369700, 3953995, 4354797, 4500677, 4597718, 4718068, 4786008, 5008852, 4870957, 4740246, 4349445, 4218000, 4185882]
26571D185882k62240m58888p03524n12001k08042k88286m03979l54411j19615
26562H74896j52563k08217k1342O6108j04138p2431J10228j84705k76777J10602
26552A41661J71576l2261n4626K36697N3899k94051n1016j315m3146k2904L6537
26541A41051M9143k16009J34603J44632j33564K8820J73489r9995J18302J29986
26531D70458J57575N2885Q0336L0481l6778j78970N9859P4339L6862L0158j35131
26520F42074N9986q1093r5404j33517j25580m1906L987q83m5490p6113N4173p7023
26508H3211O3417N1850l0257J80201k24171j49236l3818q046o628L5831l3906
26497g1552J88461o1910L525J3083j07207J15554J47470k9415l9232K50009j67148
$$ y = [4185882, 3923642, 3464754, 2761230, 2249229, 2041187, 1752901, 1348922, 994511, 874896, 722333, 514116, 492774, 558882, 454744, 382313, 492541, 307836, 31059, 141661, 313237, 280976, 226350, 463047, 516946, 222895, 171879, 170564, 127418, 104514, 141051, 190194, -25815, 108788, 253420, 119856, 148676, 322165, 222170, 340472, 470458, 628033, 680918, 761254, 791735, 754957, 575987, 635846, 710185, 747047, 777205, 642074, 702060, 620967, 525563, 392046, 266466, 224560, 228547, 227664, 182174, 106061, 160234, 83211, 146628, 198478, 168221, 348422, 124251, -24985, -58803, -66849, -73477, -37646, -71552, 116909, 54999, 58524, 71607, -35600, 79954, 227424, 198009, 158777, 408786, 241638]
26486B41638K6151j67237J38243K31519Q9768j62476J73898K5258K9039k1313
26476F04488Q7079J14266n3532j9305q4676M9559o1980k39823O9276j71516l3496
26465B60340l5471l924J14177j90603k65065O7398p8500J04559N7194o5223J14866
26454G9748L6301j11306l6328O1752O796m9708M7297n3891L5470J37684p7448
26443G6367n1989M8882j38703P1411L2313K5364p4293O6744O9861l7833n1763
26432C6361J00876J65877j03645J52128r4445l9321j30161R6258M2887k74101
26422d7286J27910J20923j03002j16493J74530j33370J74811J51104j88873j00488
26412E9766J03620J30091J25645k27131j12019K25414k5908m1127k6294L4151
$$ y = [241638, 267789, 100552, 238795, 470314, 560082, 397606, 571504, 596762, 625801, 604488, 691567, 805833, 752301, 732996, 648320, 697879, 635899, 396076, 465352, 293836, 260340, 224869, 220945, 335122, 144519, -120546, -53148, -131648, -27089, 30105, -35118, 79748, 116049, 4743, -31585, 30167, 36963, -12745, 34552, -19339, 16131, 153815, 76367, 24378, 73260, -65443, 5968, 38281, 63645, -10648, 56096, 125957, 88124, 36361, 137237, 303114, 199469, 351597, 257152, 217831, 87670, 183928, 226815, -47286, 80624, 201547, 98545, -17948, 156582, 23212, 198023, 349127, 160254, 59766, 163386, 293477, 419122, 191991, 79972, 305386, 279478, 238351, 212057, 246208]
26402B46208j31520l3755N436O9745q791Q6140P3636O0714j62440P0396j00165
26391A75604p6858J41573J58629J29142n2449l33329N2840L06495L34276J06201
26381I42124J40367j09535Q207j2460k6837J45690J87384K59739P8673K30571
26371A843923M20666J76491M19216N96660P93747J065019J234038J410730J816696
26362I777186J715066J407018J133755L26228l05496n94403j061292j557029
26354A0841033j699307j657233j665555j521597j245176m42976n60164l99320
26346A649705j36406k56727m16546m3753L812j01945J55218p1288L0801k12127
26336F00744M6478l1770o7411j33500J29154q0852k55546j51435K2141K95897
$$ y = [246208, 114688, 80933, 86369, 156114, 147323, 233463, 307099, 367813, 205373, 275769, 175604, 98746, 240319, 398948, 528090, 475641, 142312, 195152, 501647, 835923, 942124, 1082491, 972956, 981163, 968703, 941866, 1087556, 1274940, 1534679, 1613352, 1843923, 2264589, 2441080, 2860296, 3456956, 4250703, 5315722, 6549760, 7960490, 9777186, 11492252, 12899270, 14033025, 14359253, 14053757, 13459354, 12398062, 10841033, 9141726, 7484493, 5818938, 4297341, 3052165, 2609189, 2049025, 1649705, 1513299, 1256572, 840026, 796273, 800085, 698140, 853358, 782070, 812871, 600744, 647222, 615452, 548041, 414541, 543695, 462843, 207297, 55862, 78003, 373900]
26326C73900k37860j64643K8888J37379M2946j92749o8044J4021m0447N5306Q3975
26315C2672j00866J9742M1151J20005j3344P748j61825p8696K0391J18475k12923
26304b07470p7823M45829j1891N0339L5491o8281K0175k49274n798K36172j10546
26293E6923m8787Q3675n8531j10659L3748L4886M2239o844Q2720N3247O3814j1197
26281B15234o3869J0966j6058m3999m9680m7048J58366N2337m5093j34957J12572
26270A48771O1276j40293P3158j05338j56287J79530j74887L0754J12561k2030
26260G215J4846K9349p7728j61292K73698p6881k54793R0155K45516p7984j26727
26249a14626k682j8273M2338M5273j0836Q0823j4756Q1094j90060J00234O6811
$$ y = [373900, 136040, -28603, 285, 137664, 180610, -12139, -80183, -66162, -106609, -51303, 32672, -68194, -48452, -7301, 112704, 99360, 107108, -54717, -133413, -113022, 5453, -207470, -285293, 160536, 148645, 198984, 234475, 166194, 186369, -62905, -68703, 167469, 56923, 8136, 91811, 33280, -77379, -43631, -8745, 33494, 26650, 109370, 162617, 226431, 215234, 151365, 162331, 146273, 102274, 52594, 5546, 163912, 216249, 171156, 36199, 148771, 210047, 69754, 142912, 37574, -118713, 60817, -114070, -83316, 29245, 7215, 22061, 51410, -26318, -187610, 86088, 9207, -245586, -155431, 90085, 12101, -114626, -117308, -135581, -93243, -47970, -58806, 22017, 7261, 88355, -101705, -1471, 65340]
26238F5340k03061q8400J81703R3570o2508o3501j50096M1607J26610M2302K01008
26227A84574M9233j60921j05755l1436m470p704J37548M1679k24951K09709k93742
26216b06236p6197J87413J04692Q6684j18468j23216j2042K63844j32318J44908
26206A19064l5762L0236R4183j81117k90011J46135R7842J15543k30193o7637
26196b01717J86968n9149J9922j08568m6645n8730n4222Q0923R1707K4859J9534
26185a05118J48839j11250j11017o5926m611R9929n4162J03715l6015j27220
26175b62836n2688M0825R6799L1968N0360r2776J20119k4544r485J05964J2781
26164A6487n2745r0546Q316K4686O4745L0909r629j45464J14416O1358J45637
$$ y = [65340, -137721, -226121, -44418, 49152, -13356, -76857, -226953, -185346, -58736, -16434, 184574, 233807, 72886, -32869, -64305, -68775, -76479, 61069, 102748, -122203, 87506, -206236, -282433, -95020, 9672, 96356, -22112, -145328, -157370, 106474, -25844, 119064, 83302, 113538, 207721, 26604, -263407, -117272, -19430, 96113, -134080, -201717, -14749, -73898, -53976, -162544, -209189, -267919, -322141, -241218, -149511, -124652, -105118, 43721, -67529, -178546, -244472, -249083, -149154, -203316, -99601, -135616, -262836, -315524, -274699, -177900, -145932, -95572, -188348, -68229, -92773, -102258, 3706, 16487, -36258, -126804, -118488, -93802, -29057, 1852, -7777, -153241, -38825, 22533, 168170]
26153A68170k75086R951J74139n9993j97813r1415P7111k0555J7024Q8300J29978
26142A9811l4757J70096q2208K6606Q2060q9051r8913L6182M6358o5819j30106
26131a19741j36674M2226Q9912m728k90839J50162l1466J53763m7912l07946
26121e03243L06911K16872q3678J07702k52961J24118P0552Q4080O0906j69766
26111c8507q2394J39520J26874l9216N6832o7595j57713j39907Q6959l4113q9601
26100b38861J12870K50234j22531J35993J6760k7561j17946J65197R7451r3761
26090A77845P293J19104O2439j49820R379J19208q9621K335m2874j20731J71275
26079B65832j92833K914k4161M7473J86011j07256K2899j06708j78447k42050
$$ y = [168170, -106916, -96965, 77174, 17181, -180632, -272047, -194936, -215491, -198467, -110167, 19811, -14946, 155150, 72942, 99548, 181608, 92557, -6356, 29826, 76184, 10365, -119741, -256415, -214189, -124277, -129005, -419844, -269682, -301148, -147385, -195297, -503243, -196332, 20540, -63138, 44564, -208397, -84279, -13727, 70353, 131259, -38507, -120901, 18619, 145493, 106277, 163109, 95514, -62199, -202106, -115147, -149260, -238861, -125991, 124243, 1712, 137705, 154465, 126904, 8958, 174155, 271606, 177845, 185138, 304242, 366681, 216861, 226240, 345448, 255827, 258162, 215288, 94557, 265832, 72999, 75913, 51752, 99225, 285236, 177980, 200879, 94171, -84276, -326326]
26069c26326N1612R8007J6193K03771j9327k02020J28004N5230k09572J72465
26059c1963J28464j95008J22092J28111q4088L6534J69219K5573k87164j28148
26049a16378n8308J14254J98781J22097k87423J01043J17981J06389j25954J61092
26039C33574o3197M9118j79544K98741p0960K5033j64799j13637K11683J63420
26029D89432l08587K2847J13890m8347k46377J0039J65439k38426L5606r6968
26019a01452K59402J6448J5851k0494N1732k67800J37306j65725j09967m1392
26009b26091j985J74097K4281J27812n0754j8048J24789r3290r8650j49164j90135
25998c77138L25131Q3228j82012J96258O488k2312j08536J9471N2924K27366
$$ y = [-326326, -274714, -176707, -160514, 43257, 23930, -178090, -50086, 5144, -204428, -31963, 96501, -98507, 23585, 151696, 67608, 104142, 273361, 298934, 11770, -116378, -174686, -60432, 138349, 260446, -26977, 74066, 192047, 298436, 172482, 333574, 270377, 319495, 139951, 438692, 367732, 392765, 227966, 114329, 326012, 489432, 180845, 203692, 317582, 269235, 22858, 32897, 198336, -40090, -4484, -101452, 157950, 174398, 190249, 169755, 221487, -46313, 90993, -74732, -184699, -226091, -228076, -53979, -29698, 98114, 47360, 29312, 154101, 60811, -37839, -187003, -377138, -52007, 31221, -150791, 45467, 51955, 29643, -78893, -59422, -6498, 220868]
25988B20868j87916n4299j35096k8731N6783j69585j69531K67499J50086J80820
25978A30898Q4544j18836k30834J46881L498o8269j7410J48399k6290l4728p0693
25967e2840j9827K0188N1129k7233J14295j90809o86j59040p4800K18757J53142
25956C2276r3851j38807k3025L1339J54208J41598j99899o5811n3753N2582J64426
25945A283j03136j30394r2333N9219J86550J26332j97671k998k57348O7194J90643
25934a52659K36448j52463j62459J19166J55855j8405j4560P9527r6038J7130
25924A1542m4890L07971j11595k80126P219l930K46488j97261M0312O3358n7400
25913a8312k3540j25582m0307J90437j50829J49385K925o1256J6060l4267K7531
$$ y = [220868, 32952, -21347, -156443, -185174, -128391, -297976, -467507, -200008, -49922, 130898, 215442, 96606, -134228, 12653, 16151, -52118, -69528, 78871, 52581, 17853, -52840, -72667, -52479, -1350, -28583, 85712, -105097, -105783, -264823, -339623, -120866, 32276, -61575, -200382, -223407, -192068, -37860, 103738, -96161, -161972, -215725, -163143, 1283, -101853, -232247, -324580, -265361, -78811, 47521, -150150, -153148, -410496, -343302, -152659, 83789, -68674, -231133, -111967, 43888, 25483, 10923, 90450, -5588, 11542, -33348, 274623, 163028, -117098, -109879, -113809, 132679, -64582, -24270, 39088, -18312, -41852, -167434, -207741, -17304, -168133, -18748, -15823, -77079, -61019, -95286, -67755]
25902f7755J26002j5019j63883j55549M9627J23603o5683J19242j62405k2454
25892b34274N8847Q523K10356p2254j97795K10829k49471N5574J57725L3944K2309
25881D313n7327K30823l15883P9634N6957l197K07311J895j26576l2247K540N0373
25869I8616j26659n4995k7968l8511M3978K8503k1268n1569N0246q5119J52435
25858c2311P3279j98425M9351M7061n264J44267j99461J24327j2406n8594q0011
25847a48187K3915P2529j40313J70511R9919j54524o5636k6741j6513K22477
25837C7437P6087j65849R8754r6731m4544P1531j26667L6716J05711p3136J62407
25826H1716J61298k35282q6986Q5706P6983k7683K7787K9897j02000q2990P8477
$$ y = [-67755, 58247, 43228, -120655, -276204, -226577, -102974, -168657, -49415, -211820, -234274, -175427, -166904, 43452, -28802, -226597, -15768, -265239, -209665, -51940, -17996, 4313, -53014, 177809, -138074, -58440, -1483, -4680, 202631, 204526, 77950, 45703, 48243, 98616, -28043, -83038, -111006, -149517, -105539, -77036, -98304, -149873, -99627, -184746, -32311, 40968, -157457, -108106, -61045, -66309, 77958, -121503, 2824, -9582, -68176, -148187, -124272, -51743, -192056, -21545, 78374, -76150, -141786, -168527, -185040, 37437, 113524, -52325, 46429, -50302, -94846, -23315, -149982, -113266, -7555, -80691, 81716, 243014, 7732, -79254, 6452, 83435, 55752, 83539, 113436, 11436, -71554, 6923]
25815F923l4087p5894J97246n6703r7127l2727m1482p2363j17586P3173k1486
25804b72113n6427N2478O610K31037k8367L6284o6601M7517J77389p9611n0866
25793b670r4996j83884L1251L80008K8525k75858k1581j71211N2506K75097J93778
25782B10965N3495j85169j64773j2839j11075q235M4678l4050M9716J091P9955
25771g6241Q0394n4162n4047r457p5836O2300L3058J06438j92289J85796J79712
25760A85666j6171r1416j63547K2763m4762Q7232j12193j67241K18542r7578K07521
25749B8816J2797j11335l1098j16979K38515k4812j16974J32973k33767Q0733
25739a41131Q663R549J14278j21246l9637J46893q2396p7008R3450J76578n1227
$$ y = [6923, -27164, -103058, 94188, 37485, -59642, -92369, -133851, -206214, -323800, -250627, -272113, -328540, -276062, -269452, -38415, -66782, -30498, -97099, -49582, 127807, 48196, -2670, -97666, -281550, -250299, 129709, 158234, -117624, -139205, -310416, -257910, 17187, 210965, 264460, 79291, -85482, -98321, -209396, -217631, -172953, -207003, -157287, -156196, -76241, 4153, -50009, -104056, -113513, -189349, -127049, -93991, 12447, -179842, 5954, 185666, 169495, 78079, -85468, -62705, -107467, -20235, -132428, -299669, -81127, -178705, 28816, 41613, -69722, -100820, -217799, 20716, -4096, -121070, 11903, -221864, -141131, -132468, -122919, -8641, -129887, -169524, -22631, -105027, -182035, -88585, 87993, 36766]
25728C6766j28923q4085J18400M5602j29068J26470K5708q2304o6691J84544
25718D6419j61461m9924J87541j27628l0439J33087J50500q5099q959N0343p7683
25707B6697k43675J39072R3264R8694j79057l2784m3990O2449m7283j01725J38606
25696h9732p6403m7015K62149K12126n7583j47926q8219R1760k928m7061J68723
25685A77891j54293j22119N3310K05902j87451p5374J33918n0076J66406l9501
25675A08613j44717m4663j99516J16556o8308L6004k37q736J40395j465J7611
25664d8463p7125J37997n2081j35680o1792J03585M940R8631N8411k63076J33587
25653a01066Q3555l5570j4101R0120J2919j84658Q6730M9945O545r5117J9799
$$ y = [36766, -92157, -176242, -57842, -12240, -141308, -14838, 10870, -71434, -138125, 46419, -115042, -164966, 22575, -105053, -135492, -2405, 148095, 62996, 54037, 104380, 26697, -216978, -77906, 15358, 114052, -65005, -97789, -141779, -79330, -126613, -228338, -89732, -166135, -213150, 48999, 261125, 203542, 55616, -32603, 59157, 56229, 9168, 177891, 23598, -98521, -45211, 160691, -26760, -102134, 31784, -18292, 148114, 108613, -36104, -80767, -280283, -163727, -232035, -196031, -196268, -205004, -64609, -66074, -48463, -125588, 12409, -39672, -175352, -237144, -133559, -128619, -29988, 28423, -234653, -101066, -17511, -53081, -67182, 22938, 35857, -148801, -62071, -12126, -5581, -100698, -80899]
25642h0899N268J56259o0466L4682l2767P4786o1219k49420P6903P2807q0081
25631a44147j51325J07299N5030N5517k0825j03034J28642O923l7241j45563
25621b48724r623n9553J13515Q4630P8117j86746r92K00149k0688m231J62402
25610A08256p9478l10226M4026K54296n0587j33711J00205J78708j27867n9066
25600g5444Q965q6945n4825K03556m2663j38748J27001P7511Q3483j47400L7061
25589h448l3562M5316J55958p9874O0373j10577j65931j32980J1960J43608J80026
25578F5869r2964o0460p0377k3721q8935K85091k3822N6849j97432j95694K8235
25567c17361M07008J6688k2152N5820k01890r7684m9644K8862M1195j457L0367
$$ y = [-80899, -75631, 80628, 20162, 54844, 22077, 96863, 35644, -213776, -136873, -64066, -144147, -295472, -188173, -133143, -77626, -98451, -201485, -72843, -65920, -103161, -248724, -258347, -317900, -204385, -119755, -41638, -228384, -229376, -29227, -49915, -54146, 108256, 28778, -281448, -237422, 16874, -33713, -167424, -67219, 111489, -16378, -75444, -66479, -153424, -208249, -4693, -47356, -186104, -59103, 18408, 101891, -45509, -8448, -42010, 3306, 159264, 79390, 139763, 29186, -136745, -269725, -257765, -114157, 65869, -27095, -87555, -157932, -181653, -270588, 14503, -9319, 47530, -149902, -345596, -317361, 89647, 106335, 84183, 140003, -61887, -159571, -209215, -180353, -139158, -140615, -110248]
25556a10248R4980O2886K9610J12898L6748l9946j55863q7051M4125k9667R7141
25545E5613N4502R238k21751J3220J03516J93491l48903N7212K36099o6241k2054
25534F3942j02371J20771Q3782o4264P629j05571o6387N1950j05328o7483M1767
25523a41563J13699j10247k0914J67454N0079K4350j38161m4365J02627J02570
25513A05529K9438j19677j17710L6995n0541J70745J01043r6370r1175j82637
25503b14360k2624J67677k7516j30738L1247K7735R9560k0031N3659J87685R8200
25492B50494j93548k55079K82007p1952K5478Q398j04074j02903j9122M0368o0982
25481b00915K41665K8359q7405j3756J1402L465N4878j9113q9701m4574N3084
$$ y = [-110248, -15268, 47618, 77228, 190126, 226874, 186928, 31065, -55986, -11861, -41528, 55613, 110115, 119353, -102398, -89178, 14338, 207829, -141074, -83862, 152237, 85996, 63942, -38429, 82342, 166124, 101860, 109489, 3918, -62469, -10519, -115847, -183330, -141563, -27864, -138111, -159025, 8429, 58508, 82858, -55303, -99668, 2959, 105529, 134967, 15290, -102420, -65425, -115966, 54779, 155822, 59452, -31723, -214360, -236984, -69307, -96823, -227561, -196314, -168579, -69019, -89050, -35391, 152294, 250494, 56946, -198133, 83874, 11922, 37400, 45798, -58276, -161179, -180301, -139933, -200915, 40750, 69109, -18296, -32052, -20650, -17185, 37693, 18580, -71121, -115695, -62611]
25470f2611j3073o392p3790n960R7118J54572o3966j11600L5618O3905k5622j6954
25458b8755j8182j81585K79766l9414R4586J6993o3956M5839p5568j52715n4083
25447a77074P9647N1796M4114J5202j91764j08688K0713L20856J6008r7295J90950
25436A64465o8857j91391k24150J57803J21131R2034j33630j3845J30686j962o7757
25425c5473K2456j03587n8310J08814l2859n163K34702p5403M2285j01750j03133
25414a07421j2585q5154K13548l4635p0103O2856j24461Q7171p5900O9258O9984
25403g442j9776M1295l3323J27744j64478k6489J51124l8084r7685P9192k6608
25392a4530j67768j7294J09579Q0685j72103J62278L4213j21222R7012k5535l6708
$$ y = [-62611, -75684, -82076, -155866, -161826, -64708, 89864, 25898, -85702, -50084, 13821, -11801, -28755, -46937, -228522, 51244, 11830, 106416, 123409, 59453, 105292, 29724, -122991, -177074, -97427, -45631, -1517, 13685, -178079, -286767, -266054, 54802, 70810, -26485, 164465, 95608, -95783, -319933, -162130, -40999, 51035, -82595, -96440, 34246, 32284, -35473, -13017, -116604, -174914, -66100, -98959, -104122, 130580, 55177, 97462, -4288, -107421, -120006, -205160, 8388, -26247, -96350, -33494, -157955, -70784, -146684, -77426, -7442, -27218, 14077, -19246, 108498, -55980, -82469, 68655, 30571, -67114, 12078, -14530, -182298, -199592, -90013, -9328, -181431, -19153, 15060, -106162, -9150, -34685, -71393]
25381g1393j42960p3538p0137J09520J02545j6255N2574L4504j76115K18030
25371c3225l090Q8074P6158K6807l0331l3925K9200r1172M068n8719q8584l711
25359a18450o2670J65343j50270j21321K56870J20333l1455J0531k0727j30444
25349h2260M6749J80772N7065j4629k22860n9638Q6685M4992l5053N2567j28928
25338g4538m0701J05022J47271J48462k19538q1945J063L6755O1262k09142M4780
25327h1249J43820j13717j32513Q6952n0389J33274J59787j86007J1176O0450
25317C1584k08824K3588Q2089l1171K47207O2463q1470k67232O0561J33357j3679
25306C8473n5433J46348P0445Q5368j6420q8667J95823J15042m0117J99706J51465
$$ y = [-71393, -214353, -287891, -358028, -248508, -145963, -162218, -109644, -75140, -251255, -33225, -36315, 51759, 127917, 154724, 124393, 90468, 119668, 28496, 32564, -26155, -114739, -118450, -181120, -15777, -166047, -287368, -30498, 89835, 58380, 68911, 48184, -82260, -35511, 145261, 202326, 187697, -35163, -94801, -8116, 36876, 1823, 54390, -74538, -115239, -10217, 137054, 285516, 65978, -15967, -14904, 21851, 83113, -126029, -81249, 62571, -51146, -183659, -96707, -147096, -13822, 145965, -40042, -28866, 31584, -177240, -153652, -71563, -102734, 144473, 206936, 125466, -141766, -81205, 52152, 38473, -16960, 129388, 199833, 285201, 268781, 180114, 375937, 490979, 450862, 650568, 802033]
25295H02033K31421J95834p3586K15647j9412l8137o6858j15868m35657k34925
25285D60492J5394j38132r7292J4262j76811J39872m2946k32321o4421J4770J93720
25274H6587m3803J4330n422J8989p4614K6472L2242J93117j00425J8088N1650
25263B17211N0238j78640K19568k66298j09525l9895j05803Q8222O8067P9541
25253B2686q8784P0884p1996N8361j31996J23180k1699j3691J06254R0273r3078
25242E0394k0147k1672o2644Q426J97346K1746j7022j87407m2176j12201R4924
25231i0433Q1193l5258M5480J07148p6556J15980k59k02282j14070O5417K04656
25220A01016j40474K6541l9530N5736J13426o6202j44766J54962q9997N2852n381
$$ y = [802033, 1033454, 1229288, 1155702, 1371349, 1351937, 1313800, 1246942, 1131074, 695417, 460492, 475886, 337754, 240462, 254724, 77913, 217785, 174839, -57482, -121903, -107133, 86587, 42784, 57114, 51692, 70681, -3933, 22539, 54781, 247898, 147473, 165561, 217211, 267449, 88809, 308377, 42079, -67446, -107341, -213144, -124922, -56855, 22686, -66098, 4786, -67210, -8849, -140845, -17665, -39364, -53055, 53199, 143472, 50394, 30247, 8575, -54069, -45643, 151703, 173449, 156427, -30980, -73156, -185357, -90433, -9240, -44498, 982, 108130, 31574, 147554, 147295, -54987, -169057, -103640, 101016, -39458, -12917, -52447, 3289, 116715, 50513, -94253, 60709, -29288, 23564, 18183]
25209A8183J26191j03742j0129o4344r6705K03751j7222L750J34346P0218l6681
25198B27616l6421L3424m3829J7092P9427J53797p3782r9554j10140l0902j39269
25187b2541Q2485J12038J04799l8668m0890Q9987Q7246r2n3671J0636J07861
25176D39190N1479j04853O8465J4989l6337K1874l9761J09265q005j35001m2396
25165C38909k40309J10059K57878k05340K0231P3119l3954O7000m3986Q104j45036
25154B06675j16616J48763M3953q5068o913J91255J97605k85J66542J30904J1142
25143H87957R5163j399j72471J51235m8938J62280J52996L0928m213r2977J6160
25132A176721J12279j75894j2346j46965K07090k03210k57285m5451n9395Q38m09
$$ y = [18183, 144374, 40632, 30503, -33841, -130546, 73205, 55983, 59733, 194079, 264297, 227616, 191195, 224619, 180790, 197882, 277309, 431106, 357324, 257770, 147630, 116728, -22541, 59944, 171982, 276781, 238113, 197223, 287210, 374456, 374364, 320693, 331329, 439190, 490669, 385816, 454281, 469270, 432933, 454807, 415046, 524311, 516306, 381305, 338909, 98600, 208659, 466537, 261197, 281428, 354547, 320593, 387593, 343607, 351711, 206675, 90059, 238822, 282775, 197707, 190794, 382049, 579654, 579369, 745911, 876815, 887957, 983120, 981721, 809250, 960485, 911547, 1073827, 1226823, 1257751, 1253538, 1160561, 1176721, 1289000, 1113106, 1100760, 953795, 1160885, 957675, 700390, 654939, 595544, 596382, 595973]
25121E95973q4747K6798J15525j3469n267k30809M9025J4108J02192m3251k23703
25110C02375p0601M8627K54236M9626k58708K53346K5151M7764J5431J6048L5159
25099G18454p9383O0103m2013L43090K38118K21947l03573P7922J68019J83996
25089A586680P0812q0056M0633n405m9240K100P9898j82673O7820j92708k71960
25078A065901n7359q4514M7477j25259j49806n6569l41527n2782J43295p8019
25068C10838n0571l2792J59931j03784N1133J07345J1000j13840r0864J13478
25058C61874K9972l9088j27412N1745J55171M9390n9595j57352p0594K47116
25048D41227j3369J06207J10536J03928m8204K87830j36042j41739j35004K25710
$$ y = [595973, 511226, 538024, 653549, 640080, 634813, 404004, 453029, 467137, 569329, 526078, 302375, 231774, 280401, 534637, 584263, 325555, 578901, 604052, 651816, 667247, 683295, 718454, 639071, 699174, 657161, 1000251, 1238369, 1460316, 1156743, 1234665, 1402684, 1586680, 1657492, 1577436, 1618069, 1612664, 1563424, 1565524, 1645422, 1462749, 1530569, 1337861, 1065901, 1008542, 924028, 971505, 846246, 696440, 639871, 298344, 245562, 388857, 310838, 260267, 227475, 387406, 283622, 334755, 442100, 453100, 339260, 248396, 361874, 391846, 352758, 225346, 277091, 432262, 481652, 422057, 264705, 194111, 441227, 427858, 534065, 644601, 748529, 700325, 988155, 852113, 710374, 575370, 801080]
25038H01080J61333q1660r0456q544q7069O9641n9559N8281O7937k77640r5050
25027D58294p6955j53630o680M8612L6619m7258J5818L4967j32333j81311l2222
25016c6079J99059J60785j22349L5481j01037O3735M455o3015j9223n3736J73031
25005B41107j09306k8926p0133j8599Q8075M2673j6061j96555J48264J9502j12610
24994a2569K15288p2391j56301K8714j186K1667J26792J51178o6121k25714J7831
24983B7188j8836J21488q3851L4227J37779j41205Q3832N5244j36111L821l1112
24972E2464j25235J34364j22329J77707K24477l05673j4307m7929J00168N8203
24962A31910j75486J22595J27959J1707j83211J08112O2056p9584n5529R518R2711
$$ y = [801080, 962413, 880753, 790297, 781753, 694684, 764325, 704766, 763047, 830984, 553344, 458294, 381339, 227709, 221029, 269641, 306260, 259002, 274820, 309787, 177454, -3857, -36079, 162980, 323765, 201416, 236897, 135860, 199595, 204050, 141035, 121812, 68076, 241107, 131801, 102875, 32742, 14143, 102218, 144891, 128830, -67725, 80539, 100041, -12569, 202719, 130328, -25973, 2741, 1555, 23222, 150014, 301192, 235071, 9357, 27188, 8352, 129840, 45989, 80216, 217995, 76790, 160622, 215866, 79755, 83576, 52464, -72771, 61593, -60736, 116971, 341448, 35775, 21468, -26461, 73707, 131910, -43576, 79019, 206978, 218685, 35474, 143586, 205642, 126058, 70529, 80047, 172758]
24951A72758K02917j90707j40794l2877m3203m1307Q30K5423J17941o1176O0410
24940G0215J07882n6635N2276j96856O2232j21737J27481K18241K9592j74765
24930A17926J67697m86Q8609J31502j43970r3184l2659o3052O4349J08028O8404
24919D13164r4720j05606L9027J9957n0855N6262Q6202j36486J34951L2004k07640
24908A86260K760K86724k600k45677J65845N3369q0849j65706Q682q5479q6038
24897C7291K25944K3807j58736r0025J57702Q2O8200P9573M0455Q6504j0994M175
24885D63978N5545J87036j34575K4915P0125j1294J0185l3888J2786n9606n7233
24874E27974k4922J27783M9772m5682Q6977J5367j74226O8274j15492O6122J25436
$$ y = [172758, 375675, 184968, 44174, 11297, -31906, -73213, -72383, -46960, 70981, 9805, 70215, 178097, 121462, 173738, -23118, 39114, -82623, 44858, 263099, 292691, 117926, 285623, 285137, 373746, 505248, 361278, 268094, 235435, 172383, 236732, 344760, 413164, 318444, 212838, 251865, 271822, 220967, 277229, 363431, 226945, 361896, 393900, 186260, 189020, 475744, 473144, 227467, 393312, 446681, 365832, 200126, 208808, 123329, 37291, 263235, 287042, 128306, 38281, 195983, 196065, 264265, 343838, 384293, 470797, 459803, 463978, 519523, 706559, 571984, 596899, 667024, 655730, 665915, 632027, 644813, 585207, 527974, 503052, 630835, 680607, 634925, 721902, 737269, 563043, 631317, 515825, 581947, 707383]
24863G07383j51713m7782k5753K30665l72671L3946m7683k1439M5518J55224
24853E05695o1327m2230P4589q5051J18322J93757j04709J25921k20830k52905
24843B51232M47955J17088R4585p0920j13173q5428J12223L00629J5499J3314
24833A083004R653K78434K5056J07749K57588l1830R1242K13304O3445J71962
24823B269607k189K9137L4275J8326k9609J24559j83495j34355P1712l89617
24813A808351k50190j57702j70798K44032j70079l08097n1395R0716p4993J12977
24803A072822j73585j45029n970j27073K59567L1349M9215k9047j20899J95670
24793A007020R3743k5413m2234k52299M9187J94929J39473J00858Q1884n6139
$$ y = [707383, 555670, 507888, 482135, 712800, 340129, 374075, 326392, 304953, 350471, 505695, 444368, 402138, 476727, 391676, 509998, 703755, 599046, 724967, 504137, 251232, 699187, 816275, 910860, 839940, 726767, 641339, 753562, 1054191, 1069690, 1083004, 1092657, 1371091, 1396147, 1503896, 1761484, 1729654, 1820896, 2034200, 2097645, 2269607, 2267418, 2296555, 2330830, 2349156, 2319547, 2444106, 2260611, 2126256, 2197968, 1808351, 1558161, 1400459, 1229661, 1473693, 1303614, 995517, 944122, 1034838, 959845, 1072822, 899237, 754208, 748238, 621165, 880732, 912081, 961296, 932249, 811350, 1007020, 1100763, 1075350, 1033116, 780817, 830004, 1024933, 1164406, 1265264, 1347148, 1291009]
24783A291009K37802R9675J71013M2814J95371J33560K78170j7783k2326K38679
24773B647984o9407l1029j58354J12566M3281j16407j76216j88530j67806j2862
24763A883220j47614k36762L560J8952K1284p3388j11884j26522O2928r3295O876
24752A207355J22044j14899p5650P4517o2442J20577N1991j60600J48599K64427
24742A575919l39615j38611O7983p9708R1825j97778K21493Q153K4686J47322
24732A381669n4043K32468j57178P0337j10400J00529o4071J2147N9824J0355
24722A481637n3864P9644Q1521N624r5341K82435L4400O2013J07433M5882p3863
24711A957521J74588J26266J61361j02180N027L40885P5710j37353J54896O9893
$$ y = [1291009, 1528811, 1628486, 1799499, 1842313, 2037684, 2171244, 2449414, 2431631, 2409305, 2647984, 2578577, 2547548, 2389194, 2501760, 2545041, 2428634, 2252418, 2063888, 1896082, 1883220, 1735606, 1498844, 1502404, 1521356, 1542640, 1469252, 1357368, 1230846, 1293774, 1200479, 1207355, 1329399, 1214500, 1138850, 1213367, 1150925, 1271502, 1323493, 1162893, 1311492, 1575919, 1236304, 1097693, 1165676, 1085968, 1177793, 980015, 1201508, 1209661, 1234347, 1381669, 1327626, 1560094, 1402916, 1473253, 1362853, 1463382, 1399311, 1411458, 1471282, 1481637, 1427773, 1507417, 1588938, 1594562, 1499221, 1781656, 1816056, 1878069, 1985502, 2031384, 1957521, 2132109, 2258375, 2419736, 2317556, 2322583, 2663468, 2739178, 2601825, 2756721, 2826614]
24701B826614J50868K63794K3507k0135K83719L3763j41970j8363L189K70451
24691C675437O8085J36178R9251L06155K3768L16544L93998M42912L19761L36031
24681F118120K72407L43405M68525K25090M06619M37484N67854L39460N90572
24672I769536L48262N71117N53471O18518N89375P52072Q20472O89241Q19848
24663A5531912Q49544R13550J034430J208678J593341J731447J777084K342885
24655B6982871K742830L396330L853503M855910N998411P661447R711662J1773921
24647G6976885J4507365J7859590K2781084K9296938L6121428L8176618M1536802
24640B77256710N0004596N5752916L9134302J2729286N15026r558677j2959847
$$ y = [2826614, 2977482, 3241276, 3264783, 3244648, 3528367, 3562130, 3420160, 3401797, 3404986, 3675437, 3743522, 3879700, 3978951, 4285106, 4308874, 4625418, 5019416, 5462328, 5782089, 6118120, 6390527, 6733932, 7202457, 7427547, 7834166, 8271650, 8839504, 9178964, 9769536, 10117798, 10688915, 11242386, 11860904, 12450279, 13202351, 14022823, 14712064, 15531912, 16381456, 17295006, 18329436, 19538114, 21131455, 22862902, 24639986, 26982871, 29725701, 33122031, 36975534, 41831444, 47829855, 55491302, 65202964, 76976885, 91484250, 109343840, 132124924, 161421862, 197543290, 235719908, 277256710, 327261306, 383014222, 422148524, 434877810, 435392836, 425834159, 412874312]
24633D12874312k2218889m0576757n3978485n3215983m2443302l3146514k8797509
24626A38496873k6231847k1912540j6478081j1846674q209766n673289l966252
24619D4178424k907394k001972j574245j215462o92588n83400k33721J20492
24611C5090134M63907R36674J398412K064298K764151L679420M461419N175131
24603E6033546O750218Q503427J1021204J3427585J6811132K1398734K6040734
24596A59986580K7857311K4839015K1459316K0709483K0728006J8159340J1798710
24589C05537761P003534M757689L403832q34385n437612q062672r131607j2031126
24581B85205414j9145287k5542190k8247211k7233506k5270892k4376003k4291672
$$ y = [412874312, 390655423, 350078666, 296100181, 242884198, 200440896, 167294382, 138496873, 112265026, 90352486, 73874405, 62027731, 53817965, 48144676, 44178424, 41271030, 39269058, 37694813, 36479351, 35786763, 35203363, 34969642, 35090134, 35554041, 36490715, 37889127, 39953425, 42717576, 46396996, 50858415, 56033546, 62783764, 71287191, 82308395, 95735980, 112547112, 133945846, 159986580, 187843891, 212682906, 234142222, 254851705, 275579711, 293739051, 305537761, 312541295, 317298984, 320702816, 319868431, 314430819, 306368147, 297236540, 285205414, 266060127, 240517937, 212270726, 185037220, 159766328, 135390325, 111098653]
24574A11098653k1833456j7181780j2719469r028040o546293m591282l214967
24567C5983366k021701j606725r36333k82316k25053k18076L61675L45625N77500
24558C1977962Q14348J225997J861395K215942K668014L401654M171648N494742
24550E3831702P128395R280056J1997553J5212004J8797161J9778927J5915890
24543A51941688R919681O296948L820923K956076J712104M05271L46816M92655
24535A77892162k154420o358578q932423j0701317j2241379j4779720j8815390
24528A03908935k1004452j8881760j4868972j0971186p835328n612473m146540
24521B0588224k738889k031004j685034j514800j047539o99345n85032n29018
$$ y = [111098653, 89265197, 72083417, 59363948, 50335908, 43789615, 39198333, 35983366, 33961665, 32354940, 31418607, 31136291, 30911238, 30693162, 31054837, 31400462, 31977962, 32792310, 34018307, 35879702, 38095644, 40763658, 44165312, 48336960, 53831702, 60960097, 70240153, 82237706, 97449710, 116246871, 136025798, 151941688, 161861369, 168158317, 171979240, 174935316, 176647420, 177052691, 177399507, 177892162, 175737742, 169379164, 160446741, 149745424, 137504045, 122724325, 103908935, 82904483, 64022723, 49153751, 38182565, 30347237, 24734764, 20588224, 17849335, 15818331, 14133297, 12618497, 11570958, 10871613, 10286581, 9757563]
24513I757563m70317l59997l98892l7281m04415N733J29547l6128q9735N887j50281
24502G951684k91619l42366l37846j11346m16592n04889J2555m18907l81694
24493E158980k35198j1622l79580m79823l14554l99559l20453k23421k14587
24484B580183k40900q6398k15852L1864N6331k17547p3282p489j49513Q8371j59186
24473A606582n1943K5466l7719N1837L7938j36412j10285O5853j764O360j75699
24462A280214l9414J75198K25780j09675j25576l485J31752J00996O5994j81193
24452A520591k4486o8930K8409J29314j45111J34541M7298L3568N6334N127M1191
24441A757846N0767j94531K5860P0627j38218k08885j45239N6101J88333p0349
$$ y = [9757563, 9287246, 8927249, 8528357, 8491076, 8086661, 8092394, 8221941, 8185813, 8096078, 8101965, 7951684, 7660065, 7317699, 6979853, 6868507, 6451915, 5947026, 5959581, 5540674, 5158980, 4923782, 4912160, 4532580, 4052757, 3738203, 3338644, 3018191, 2794770, 2580183, 2339283, 2252885, 2037033, 2068897, 2125228, 1907681, 1834399, 1826910, 1677397, 1765768, 1606582, 1554639, 1580105, 1542386, 1594223, 1632161, 1495749, 1385464, 1451317, 1449553, 1455913, 1280214, 1240800, 1415998, 1641778, 1532103, 1406527, 1403042, 1534794, 1635790, 1701784, 1520591, 1496105, 1427175, 1455584, 1584898, 1439787, 1574328, 1621626, 1655194, 1711528, 1716655, 1757846, 1808613, 1614082, 1639942, 1710569, 1572351, 1363466, 1218227, 1274328, 1462661, 1392312]
24431A392312K74606j4102P588j48320M0010j33335N1333M3628J54747j49507
24421A518960J73352j16736J15929L6524j3850Q3687k11159J98107L4306J4206
24411A833326j56298P5941K07650K05980k9316j0102k3286Q8373L857r3712L22378
24400B424791J35677O9315K5607J01152P095K34543K28014J30279K5502j10352
24390C271623K01430J88567N6169R8471O6833L6309Q7611L94656L88213j12985
24380D676897j29805J86844M99806L15064K93435J41912K41742J62261K69429
24371F657585L15119N15205K25625K96241L83418P26771M91045M51758M84253
24362A0547020P13918O15179P35141R34779R91645R70808R91388J061142J418290
$$ y = [1392312, 1666918, 1652816, 1660404, 1512084, 1552094, 1418759, 1470092, 1513720, 1668467, 1518960, 1692312, 1575576, 1691505, 1728029, 1714179, 1797866, 1586707, 1784814, 1819120, 1833326, 1677028, 1752969, 1960619, 2166599, 2137283, 2127181, 2103895, 2192268, 2196125, 2102413, 2424791, 2560468, 2629783, 2655390, 2756542, 2763637, 2998180, 3226194, 3356473, 3381975, 3271623, 3473053, 3661620, 3717789, 3816260, 3883093, 3919402, 4007013, 4401669, 4789882, 4676897, 4547092, 4733936, 5233742, 5548806, 5842241, 5984153, 6225895, 6388156, 6657585, 6972704, 7487909, 7713534, 8009775, 8393193, 9119964, 9611009, 10062767, 10547020, 11260938, 11876117, 12611258, 13546037, 14537682, 15508490, 16499878, 17561020, 18979310]
24353A8979310J171031J442210J643282K087279K396371K676972L320252L991312
24345C7708019M777769O034809P397118Q990434J1422870J3987810J6976660
24338A07295489J9225486K0155061K0092705J9375230J7404144J4809658J1490551
24331B29848324Q067126N280409L550183J355625j054136l174427n497939q179219
24323B30195946j1445909j5345485j8171724j9812787k0336288j9990200j8952144
24316A06141409j6836560j4088827j0664220p922235n375032l766546k599013
24309D4888976j358463p15908k45137K79674Q06096R37184J619632K229097
24301D8441151K937209L885251M939027N917407P263713R370739J1978810
$$ y = [18979310, 20150341, 21592551, 23235833, 25323112, 27719483, 30396455, 33716707, 37708019, 42485788, 48520597, 55917715, 64908149, 76331019, 90318829, 107295489, 126520975, 146676036, 166768741, 186143971, 203548115, 218357773, 229848324, 237915450, 243195859, 246746042, 248101667, 247047531, 243873104, 238375165, 230195946, 218750037, 203404552, 185232828, 165420041, 145083753, 125093553, 106141409, 89304849, 75216022, 64551802, 56629567, 51254535, 47487989, 44888976, 43530513, 42814605, 42569468, 42849142, 43655238, 44592422, 46212054, 48441151, 51378360, 55263611, 60202638, 66120045, 73383758, 82754497, 94733307]
24294I4733307J4437000J8267905K2962918K7309563L0753875L2448614L2167273
24287B73080455L0100063K6595179K1723505J5434682R090334L490526l88363
24280C79126381l856748p411244j0529912j3783611j6922210k0214681k4260780
24273B82147195k7896484k9934217l0734337k9790590k8121280k5418107k1510954
24266H8741226j7039581j3102271r957143p438111n587620m295616l252915
24259B8067969k724875k435135j820350j637323j300635j525596j044195j005924
24251A4573936q69680j180297p31772q15592p68502p72941o98685m37055r14609
24242G384803m23106l80899l88383m07740k47890l57209k08904l97140k30513
$$ y = [94733307, 109170307, 127438212, 150401130, 177710693, 208464568, 240913182, 273080455, 303180518, 329775697, 351499202, 366933884, 376024218, 379514744, 379126381, 375269633, 367858389, 357328477, 343544866, 326622656, 306407975, 282147195, 254250711, 224316494, 193582157, 163791567, 135670287, 110252180, 88741226, 71701645, 58599374, 48642231, 41204120, 35616500, 31320884, 28067969, 25343094, 22907959, 21087609, 19450286, 18149651, 16624055, 15579860, 14573936, 13704256, 12523959, 11792187, 10976595, 10208093, 9435152, 8736467, 8299412, 7384803, 6961697, 6580798, 6192415, 5784675, 5536785, 5179576, 4970672, 4573532, 4343019]
24233D343019J02971O1717j85339o219p8182k22078j81904l5467k07475p0866
24223C520177o5954K05152l21738j83630j76431K1182k05498k09158K35908O781
24213B826791l1739o0918L6601j14780r9163J30603k6773K56360k16523r8820
24203B601639K57520J36163J58974j4368Q607J36853J52338m0376j08549R1541
24193C380342j14114j06632J65756O3726M2797m6313J47450Q2787P8676p6315
24183C618160J35139J97950K32201J48110J43590L5021J02916K71424M65852
24174E350363J35786J99256K91177L22802L35797J67331M61791L82264K14932
24165G861499K79042J48490N72510O53164O61553O59809P78878R22392Q88987
$$ y = [4343019, 4445990, 4507707, 4322368, 4316149, 4237967, 4015889, 3833985, 3798518, 3591043, 3520177, 3454223, 3659375, 3337637, 3154007, 2977576, 2998758, 2793260, 2584102, 2820010, 2826791, 2795052, 2734134, 2770735, 2655955, 2556792, 2687395, 2660622, 2916982, 2700459, 2601639, 2859159, 2995322, 3154296, 3139928, 3148535, 3285388, 3437726, 3397350, 3288801, 3380342, 3266228, 3159596, 3325352, 3389078, 3431875, 3385562, 3533012, 3615799, 3694475, 3618160, 3753299, 3951249, 4183450, 4331560, 4475150, 4510171, 4613087, 4884511, 5350363, 5486149, 5685405, 5976582, 6299384, 6635181, 6802512, 7264303, 7646567, 7861499, 8140541, 8289031, 8861541, 9514705, 10176258, 10836067, 11614945, 12537337, 13426324]
24156A3426324O09001R34650J126673R37848J331083J267347J282141J593388
24148B2508455J724916K322880L030169L527606M319723N233091O226903Q034394
24140E6928137J0201618J3039242J6426956K0394570K4648075K6842435K4124412
24133A92605445J7805216J2860312J0510383J0195655R430579M713269m614666
24126B53506193j3443196j7054259j8072558j8130075j9574280k2970933k5077993
24119A19182899k3786850j9152447j3902594r726622o780718m597898l080490
24112C8155280j613110j210655m37360L2491J16623O74070Q42726J039611J153898
24103C8753574J221783J439303J933876K558158L027125M254616N120438O270944
$$ y = [13426324, 14035325, 14969975, 16096648, 17034496, 18365579, 19632926, 20915067, 22508455, 24233371, 26556251, 29586420, 33114026, 37433749, 42666840, 48893743, 56928137, 67129755, 80168997, 96595953, 116990523, 141638598, 168481033, 192605445, 210410661, 223270973, 233781356, 243977011, 253407590, 258120859, 253506193, 240062997, 223008738, 204936180, 186806105, 167231825, 144260892, 119182899, 95396049, 76243602, 62341008, 52614386, 45833668, 41235770, 38155280, 36542170, 35331515, 34894155, 34926646, 35043269, 35717339, 36560065, 37599676, 38753574, 39975357, 41414660, 43348536, 45906694, 48933819, 53188435, 58308873, 64579817]
24095F4579817P989512J0436475J3623843J7671119K2609384K8279245L4213297
24088A99402692L7650852L4688910K6901432J9785872J5491046J3645254J1761194
24081C59327252N714840n750851j7229894k4065933k6252335k7132729k8657733
24074B35952617l2130968l5288737l4280786k8992573k2275670j6061605j1388309
24067E5533969q064467n719672m083213l031695k251658j740376j462560j171639
24059B8008689r50427j098425m69401k48922k74908N8443K89068P60801J107319
24050B7182237J412491K469379K485128L210785M489553N951342P942878R933613
24042F5077406J2185438J4250185J4420983J0861949P567502N782370M555765
$$ y = [64579817, 72569329, 83005804, 96629647, 114300766, 136910150, 165189395, 199402692, 237053544, 271742454, 298643886, 318429758, 333920804, 347566058, 359327252, 365042092, 359291241, 342061347, 317995414, 291743079, 264610350, 235952617, 203821649, 168532912, 134252126, 105259553, 82983883, 66922278, 55533969, 47469502, 41749830, 37666617, 34634922, 32383264, 30642888, 29180328, 28008689, 27058262, 25959837, 25490436, 25241514, 24966606, 25025049, 25314117, 26074918, 27182237, 28594728, 31064107, 33549235, 36760020, 41249573, 47200915, 55143793, 65077406, 77262844, 91513029, 105934012, 116795961, 124363463, 130145833, 134701598]
24035A34701598M788162L303749p56430o066438r690884j0535147j0538528
24028A05206082j0762597j1972095j3702855j4252124j2372763r474835o805377
24021B5863436m897344l579471k409449j626223j056488r79309o85018n46007
24013A0084127l82440k16323q7166j65492k64634l75749m55325l05739n25532
24004G305727n14828l83230m24111m95290k96734m2780J35378K00878J86258
23995E671268J77992L58233K48053N3800J79708m4636J68991J57933m6250k54132
23985F670960j75975j62976n68880k55497m38933n53582m84604m91029l9458j96914
23975C303112k61597j44015j41560J73480m449R8350K68909M93127L82832N84382
$$ y = [134701598, 139489760, 142793509, 142037079, 135970641, 126279757, 115744610, 105206082, 94443485, 82471390, 68768535, 54516411, 42143648, 32668813, 25863436, 20966092, 17386621, 14977172, 13350949, 12294461, 11315152, 10630134, 10084127, 9701687, 9485364, 9398198, 9232706, 8968072, 8592323, 8136998, 7831259, 7305727, 6790899, 6407669, 5983558, 5488268, 5191534, 5148754, 5284132, 5485010, 5671268, 5849260, 6207493, 6455546, 6509346, 6689054, 6644418, 6813409, 6971342, 6925092, 6670960, 6494985, 6332009, 5763129, 5507632, 5068699, 4515117, 4030513, 3539484, 3500026, 3303112, 3041515, 2897500, 2755940, 2929420, 2924971, 3023321, 3292230, 3785357, 4168189, 4752571]
23965D752571N26819N35539N23673M41390J89803K15413k10938l24049j00147
23956F550074l51708o67901o09483n56265o58070l70553r0758j31644j61289
23947B952403K03253K21998J4065j31206Q888j5458j64923J25783K70549l01841
23937C183511j57165m3927j60638P9080n51987m73447j73441j19605j94440m8132
23927A339809J28671j54962k40367m2691k49782K55206J88200j59345l4452J44447
23917A174734K66408K06182L81732L85238J85993N25539M44210l0477q0924j84133
23907C274502k77017k24976l77560m60342m69058k41428k08583l58487j80807
23898D76244P3318o3055j01954o887J79792j12665j02820p3010R1929O2401k15599
$$ y = [4752571, 5279390, 5814929, 6338602, 6779992, 6969795, 7185208, 6974270, 6650221, 6550074, 6198366, 5530465, 4920982, 4364717, 3706647, 3336094, 3245336, 3113692, 2952403, 3155656, 3377654, 3391719, 3260513, 3269401, 3253943, 3089020, 3214803, 3485352, 3183511, 3026346, 2982419, 2821781, 2900861, 2348874, 1875427, 1701986, 1582381, 1387941, 1339809, 1468480, 1313518, 1073151, 1030460, 780678, 1035884, 1224084, 1064739, 1030287, 1174734, 1441142, 1647324, 2029056, 2414294, 2600287, 3125826, 3570036, 3539559, 3458635, 3274502, 2997485, 2772509, 2394949, 1934607, 1465549, 1224121, 1015538, 657051, 476244, 549562, 486507, 384553, 377666, 557458, 444793, 341973, 268963, 360892, 423293, 207694]
23887B07694Q4932J48657r4539J25699r805j97279O6175N9471j50800N9735j60205
23876A39735j15952N510J34643p6633j16153K57863L1989j59778M4374J0608O0461
23865B16667R640j07065J9860P2192q9061j00208P8091N7827K1368J37293o955
23854C09649k1709j24023n4512J0214Q1570J22265l6339J10214j33237j86981
23844G7111R3944j52325J52658m815j14223K6767J81131j76661k3627J67753
23834B27713Q3144p5927K33498n5479L3536L09106J60929L970m6021J94395L36984
23823A405848Q6794J38944J59381R155J87317j9617L1176o2613q1623p1038j34103
23812A649621o0958k05691j45126k7261k78167n0177j69884n6388k11968M1005
$$ y = [207694, 292626, 441283, 346744, 472443, 462638, 265359, 331534, 391005, 240205, 299940, 139735, 23783, 29293, 163936, 87303, -28850, 229013, 261002, 101224, 145598, 156206, 216667, 226307, 119242, 139102, 211294, 122233, 22025, 100116, 157943, 179311, 316604, 309649, 287940, 163917, 109405, 119619, 201189, 323454, 287115, 397329, 264092, 77111, 171055, 18730, 171388, 166573, 52350, 79117, 260248, 83587, 59960, 227713, 310857, 234930, 468428, 412949, 446485, 755591, 916520, 920490, 874469, 1068864, 1405848, 1492642, 1631586, 1790967, 1800122, 1987439, 1967822, 1998998, 1936385, 1854762, 1783724, 1649621, 1588663, 1382972, 1237846, 1210585, 932418, 882241, 712357, 655969, 444001, 485006]
23802D85006m1759l6997j36395J9706j04594N155k11130K10974M6433k0050N9158
23791B75507J43570j29930J31197k09590K215r6184J35861O7064J39575k21230
23781B38055K89790K13746Q7658J02500J28856n7618l0000K89009o7390J26549
23771A321155L733l728n4848k1392o5493j22973Q2479O8100j09306j48598j20254
23760H28875j73268j41839o6698j36305l756o854m4491J2056L6029j97972M4126
23749A49903J295K1568j71851p1686K33131j61329N7148R5307L0500j5368r4140
23738G4478j32966J66742j79565j29570J51036q7339l0002p593M8217Q8110j23674
23727a62126K296j0598M0160M2449J5385j10940J70951k36982n7352N0426k6723
$$ y = [485006, 443247, 406250, 269855, 289561, 184967, 190122, -21008, 189966, 236399, 216349, 275507, 419077, 289147, 420344, 210754, 212969, 116785, 252646, 319710, 459285, 238055, 527845, 741591, 829249, 931749, 1060605, 1002987, 972987, 1261996, 1194606, 1321155, 1324888, 1321160, 1266312, 1244920, 1179427, 1056454, 1138933, 1207033, 1097727, 949129, 828875, 655607, 513768, 447070, 310765, 307009, 300155, 255664, 267720, 303749, 105777, 149903, 151198, 172766, 915, -70771, 162360, 1031, 58179, 153486, 183986, 168618, 74478, -58488, 108254, -71311, -200881, -49845, -137184, -167186, -174779, -126562, -38452, -162126, -159830, -170428, -130268, -87819, -72434, -183374, -12423, -249405, -306757, -256331, -283054]
23716b83054J19946r907l1891J06850n4761O0632L07080j37477j16870P2946j4817
23705A8677j28643L5931j19516L3415p709J57574P292K2950j2984K3652n8833
23694b8194J41038k88093J26900j4758m4107k5837K3895J14741j91468J527K09533
23683B5177q6193J50950j55721l8153J10698j23935P8801O3719o3918l5685Q5632
23672A1372J4461j34074Q0006J20646j6313j42723j07172J43771l765o3962J57527
23661E9774j5572M5088J38898p0178m0632k16319q1143J2485J92177J5482M9615
23650H9675j05307n1727Q7945M397Q8524Q1560l8993k512l9046Q1876J04064
23639C00456j14136j89134N4685J31703q0291J25128j64641L5545Q6994J35778
$$ y = [-283054, -163108, -173015, -204906, -98056, -152817, -92185, 214895, 77418, -39452, 33494, 18677, -109966, -74035, -193551, -160136, -167845, -10271, -2979, 19971, 6987, 30639, -28194, 112844, -175249, -48349, -63107, -107214, -133051, -109156, 5585, -185883, -184356, 25177, -61016, 89934, -65787, -103940, 6758, -117177, -38376, 25343, -38575, -74260, 11372, 25833, -108241, -28235, 92411, 76098, -66625, -173797, -30026, -33791, -97753, 59774, 44202, 89290, 228188, 158010, 117378, -98941, -180084, -167599, 24578, 40060, 89675, -15632, -67359, 20586, 24983, 113507, 195067, 156074, 153562, 114516, 196392, 300456, 186320, -2814, 51871, 183574, 103283, 228411, 63770, 99315, 186309, 322087]
23629C22087m4970m3268J49033J61688L9785p1273J42757Q6297J76889n1969N0449
23618I17505J52939P779P4881O2849k18211q6346r2978l0976j03937k4836k15228
23607D43441J14753j00898k03019J46948j05286k67664M8987L06150j56474k94124
23597f7186j4680Q4403J69318K9164n4605J64375l3910o9136k91870j78466L44561
23586H1968N2210L8090m902j26579J78833J37235K2222j9587Q9538L12588M23910
23575A185526J53586m9423J29102J46408r3709J6576K6356J47033q1546N7693
23565A637602O3622j23144j39559R078q0618l54031j21907n7782k81239q7156
23555D64866p5628l7605l4712k28836r8898j13981J43720K2277o1020J42130
$$ y = [322087, 277117, 233849, 382882, 544570, 584355, 513082, 655839, 742136, 919025, 867056, 917505, 1070444, 1078223, 1153104, 1215953, 997742, 911396, 818418, 787442, 683505, 658669, 443441, 558194, 457296, 254277, 401225, 295939, 28275, 77262, 383412, 226938, -67186, -81866, 2537, 171855, 201019, 146414, 310789, 276879, 207743, -84127, -262593, 81968, 134178, 172268, 167366, 40787, 219620, 356855, 379077, 359490, 449028, 761616, 1185526, 1339112, 1289689, 1418791, 1565199, 1471490, 1488066, 1514422, 1661455, 1579909, 1637602, 1701224, 1578080, 1438521, 1447599, 1366981, 1012950, 891043, 833261, 552022, 464866, 389238, 351633, 316921, 88085, -10813, -124794, 18926, 41203, -19817, 122313]
23545A22313j74385N3934J48409m9790j66672L0580O3058M5822p9397J72948
23535A66820P8980j615L8794J5737j27854k4941O4330J44693Q7005o6605J94883
23524E70227K24840j00393p7164P9887l7950R381k4153j68122p3849Q0529o467
23513D76766k15368j02731J6717n39k53403j42161K55831J66721j52010p5869
23503b6046j31203n5171J26067K58053J586n8781l49541k3720J88921N1190L2806
23492A4161k7891j85544n0556o555R4272O7302O803j2645p9216N3834P6181J59364
23480A09510j63895j12922j82287J42291R9207N035N5815P5528O0240K1787m1828
23469F8481j25837J28106q6619K0834j26550l1156M8592o4380K86691l8164j93570
$$ y = [122313, -52072, 1862, 150271, 100481, -66191, -35611, 27447, 73269, -6128, 166820, 245800, 244185, 282979, 298716, 170862, 145921, 210251, 354944, 441949, 375344, 570227, 795067, 694674, 617510, 697397, 659447, 668828, 644675, 476553, 402704, 483233, 476766, 261398, 158667, 175384, 174845, -78558, -220719, 35112, 201833, 49823, -26046, -157249, -212420, -86353, 171700, 173286, 114505, -235036, -258756, -69835, -18645, 14161, -13730, -199274, -249830, -256385, -162113, -94811, -88008, -100653, -179869, -126035, -49854, 109510, -54385, -167307, -349594, -207303, -108096, -103061, -47246, 28282, 88522, 110309, 68481, -57356, 70750, -15869, 4965, -121585, -152741, -104149, -168529, 118162, 79998, -113572]
23458a13572J39910J3154l7086l0315k0213j2380k53706R0216K30261K041k09199
23447b00889n4653q8664J44207K19363j83094J9710N8058m0042J24661L2908J9699
23436E1264P4213M7459k40884j04762P8816K1532K4982p04j51391K0747J89858
23425A1130j7125j91964K89793J8065j46279m7871j21059J25102j04568J15377
23415f9399q3908n9173J56009J37625J13596j72929q0479M6435j07504j95253
23405c14980j5107R1690Q5162j02536l4709o4302J10495N3339M3492J89475J2251
23394E4270K7181j2530j98721j54008L11100j78110n5541Q5006o62o2569r505J9355
23382a74734k187l4667m4894K73053J60875k29875L8141N4325k31533L1502L9231
$$ y = [-113572, 26338, 39492, 2406, -27909, -48122, -60502, -314208, -223992, 6269, 8310, -200889, -255542, -344206, -199999, 19364, -163730, -144020, -85962, -126004, -1343, 31565, 51264, 125477, 172936, -67948, -172710, -93894, -72362, -47380, -48084, -199475, -178728, 11130, -5995, -197959, 91834, 109899, -36380, -84251, -205310, -80208, -184776, -69399, -153307, -212480, -56471, 81154, 194750, 21821, -58658, -12223, -119727, -314980, -330087, -238397, -153235, -255771, -290480, -354782, -244287, -190948, -147456, 42019, 54270, 81451, 68921, -129800, -283808, 27292, -150818, -206359, -121353, -122015, -184584, -194089, -174734, -176921, -211588, -256482, 16571, 177446, -52429, -14288, 40037, -191496, -159994, -120763]
23371a20763J16629j02477M4928j0908J20201M3152n0060J9207p0438P544k50915
23360b53900J52351P7040n4877J17966J39659m195r2322j50835Q104j1433K6072
23349d6370J01300j65927o5529J29292J91651l1789o1374j13496k135j12918
23339a77295P431m3422J32491O7154M2066j37171l490j23496R2007o4723j8239
23328b26687K28382l4507K4067M533P5904J14420j56318m6672J52288O5335j41996
23317E8749Q3716j44514l8625N9405m8997O2863O484N2573J23737j76315P980K01223
23305B48279J1736k42654r0105K30172K24422Q634q640R8289R8239J20222k4554
23294F74040J01716n907J45622M26075K53507J93806K67032N67053J40083M48915
$$ y = [-120763, -4134, -106611, -61683, -72591, 47610, 90762, 40702, 59909, -10529, -2985, -253900, -101549, -24509, -79386, 38580, 178239, 174044, 81722, -69113, -61009, -72442, -46370, 54930, -110997, -176526, -47234, 144417, 112628, 51254, -62242, -64377, -177295, -169864, -213286, -80795, -13641, 28425, -108746, -112236, -235732, -143725, -208448, -226687, 1695, -32812, -8745, -4212, 71692, 186112, 29794, -16878, 135410, 200745, 58749, 142465, -2049, -40674, 18731, -30266, 32597, 39081, 91654, 215391, 39076, 47056, 248279, 260015, 17361, -72744, 157428, 381850, 390484, 381844, 480133, 578372, 698594, 674040, 775756, 769849, 915471, 1341546, 1595053, 1788859, 2055891, 2622944, 2763027, 3211942]
23284C211942M81070N10490K45512O8959l7885j4684L2468O5211k21343m27782
23274C913958l62853k45856l52642l54343l34545n03989m81468j84361l51841
23265G42060k86419o0170r5004K0584l3899J5476K1577k66944l5242K47270K1794
23254B91083O4728k9097o7937j439O0558J93068O7693o3833N6853r0803K67633
23243G48507r4361k3928J51210J81173K25250L06167K59238K87258M60561K78716
23233B779791L54637J45912j7034L24911M4873K263L9718L1945j68105m56146
23223C082765j36137k81622k09074l89273k71760m36547l84220k04122j26535
23214F43475j90592l7791l0811j36815m9767q3257J73518k00496n4125J41721
$$ y = [3211942, 3693012, 4203502, 4449014, 4517973, 4480088, 4465404, 4497872, 4563083, 4341740, 3913958, 3551105, 3305249, 2952607, 2598264, 2263719, 1759730, 1278262, 1093901, 742060, 455641, 395471, 300467, 321051, 287152, 302628, 324205, 57261, 22019, 269289, 291083, 355811, 326714, 258777, 257338, 317896, 510964, 578657, 514824, 571677, 480874, 748507, 654146, 630218, 781428, 962601, 1187851, 1494018, 1753256, 2040514, 2501075, 2779791, 3134428, 3280340, 3263306, 3588217, 3633090, 3635353, 3675071, 3707016, 3538911, 3082765, 2946628, 2665006, 2455932, 2066659, 1794899, 1358352, 974132, 770010, 643475, 452883, 415092, 384281, 247466, 197699, 114442, 287960, 87464, 33339, 175060]
23204A75060R1601o7785p9626r4987R4198o0539J13353j96922j8039j3164J34518
23193G7668k7655N7047m2187j34768L8694J05561k5633p5099o1140q3473l17120
23182d88105K18620J60118J43849j8016j40306l5981J0395j5307N4070q7009K6991
23171a70681J60473j63193J53980q6701j27980N7693j7190J50489J07603K6888
23161I1381j36402k8528J79458K2925j95050k4723J8781m2526J03257k11003
23151b22430J45765k536M4421J53666j07506O6848K2697M2884k73873q4652o0234
23140b74950K0106K13759J88691j91108J16447K4974p8118j47377J25903N1710
23130E0037q9706j86725q7303M6437j5914O9183P6660L9755j06975l2601k2959
$$ y = [175060, 266661, 198876, 119250, 24263, 118461, 57922, 171275, -25647, -43686, -56850, 77668, 50013, 107060, 64873, -69895, -31201, 74360, 48727, -26372, -87512, -170985, -488105, -269485, -109367, 34482, 16466, -123840, -159821, -149426, -164733, -110663, -197672, -170681, -10208, -173401, -19421, -106122, -234102, -176409, -193599, -43110, 64493, 91381, -45021, -73549, 105909, 128834, -66216, -90939, -72158, -114684, -11427, -222430, -76665, -79201, -34780, 118886, 11380, 78228, 100925, 143809, -130064, -214716, -274950, -254844, -41085, 147606, -43502, 72945, 97919, 19801, -127576, -1673, 50037, -39669, -226394, -313697, -267260, -283174, -213991, -137331, -97576, -204551, -237152, -260111]
23119b60111j6636K35342j22581k9124J85541k822o2340k6683j47005r7880n375
23108c49674L025P4092L6174J64419j11699n3962o5910K78805M8071j47578J54644
23097C0407j83693m637O2514j40792J1791L3088R8216J4551k9022K8695J02038
23086B3156R3948N4921k26815l46099N4447K19309o7228l6013J54952p4480k2739
23075a72641J22065O2517J1638n1954k4508J0375J09618j67545j7434k10797
23065c28666J7286Q6310J11194J47456O3250k52604o8459K54886K2391p0422q0186
23054i7564p2024P5429R093j40174K08594j17256j81463N7945J07447J97683
23044D7710J4316J40588R2152j70021r9542K22760p5879k47793K7782M6827M7615
$$ y = [-260111, -276747, -41405, -163986, -193110, -7569, -10391, -72731, -99414, -246419, -344299, -349674, -346649, -272557, -236383, -71964, -183663, -237625, -303535, -24730, 23341, -124237, 30407, -153286, -157923, -95409, -236201, -224410, -191322, -93106, -78555, -107577, -78882, 23156, 117104, 172025, -54790, -400889, -346442, -127133, -194361, -230374, -75422, -149902, -172641, -50576, 11941, 23579, -28375, -52883, -42508, 67110, -100435, -117869, -328666, -311380, -225070, -113876, 33580, 96830, -155774, -224233, 30653, 53044, -17378, -97564, -169588, -94159, -85066, -225240, -16646, -133902, -315365, -257420, -149973, 47710, 62026, 202614, 294766, 124745, 25203, 247963, 172084, -75709, -47927, -1100, 46515]
23033D6515j98175K6368J97504J37031j58434j71520n8681l1161J40586k4246
23023i4213p1272J87739j31834l352K14136o6080k55733J3347K93847j67063
23013h0478m1502O552L2884M4337k206N1038K3657q52j34062r3973J78356N150
23001a1099M4687j09702m6903m0067j06543j38167J37454N2052l8568r696J74259
22990i2293l4797K56921n4696j55983j5085P3059N8522l9416M8915k2002N4761
22979G7906r8218O305o8867j03582J19904Q2538k00709q447J08233m2124o8151
22968a95212J53195K4629j62976o5994n3268J94031k8952r4637J22737j7010L3655
22957h9802J4659q1127n0987k2928K98924l0517k19967K4600Q525Q4574J67304
$$ y = [46515, -151660, -125292, 72212, 209243, 50809, -120711, -179392, -210553, -69967, -94213, -165485, 22254, -109580, -112932, 101204, 35124, -220609, -207262, 86585, -80478, -121980, -115428, -82544, -38207, -40413, 10625, 34282, 33430, -100632, -194605, -16249, -11099, 33588, -76114, -123017, -163084, -269627, -407794, -270340, -218288, -256856, -266552, -92293, -127090, 129831, 75135, -80848, -95933, -22874, 35648, -3768, 45147, 23145, 77906, -20312, -14007, -82874, -186456, -66552, 15986, -184723, -193170, -84937, -127061, -195212, -42017, -17388, -180364, -246358, -299626, -105595, -134547, -229184, -106447, -123457, -89802, -75143, -156270, -207257, -230185, 68739, 38222, -181745, -157145, -148620, -64046, 103258]
22946A03258k51272r730J75889j79666j9389M4931N1423N433m3168P6241l3201
22935g9251p6462K8617o5028J62505M0143j82564Q0496K3753J09771q3895j51262
22924a93177k2265j32544R9239J93417j4366Q1981r4928j72829M677k931P3063
22913a80663M0253j06239p161R675l7033Q6694L45874k3006k0677k56047J7000
22902a31330P740j9090K88849j79847q4021Q46J81651J1173m1584J9682j95921
22891a41852R1883Q1402p953k8610j72657L2031n8487l3064O5653N1383m9358
22880a69629J96203k1738O1000M8723j67795j21902J05658j54464J05714k1671
22870a39901k6528N520N8940l0567r379j07023J1578J82642j42816M8094J87224
$$ y = [103258, -148014, -157744, 18145, -161521, -180910, -135979, -84556, -79123, -122291, -46050, -79251, -155713, -127096, -192124, -29619, 10524, -172040, -91544, -67791, 41980, -41915, -193177, -215442, -347986, -248747, -55330, -69696, 12285, -82643, -255472, -250795, -253726, -180663, -140410, -246649, -253810, -244135, -281168, -194474, 151400, 128394, 107717, -148330, -131330, -123590, -142680, 146169, -33678, -117699, -116853, 64798, 75971, 34387, 54069, -141852, -49969, 31433, 23480, -5130, -177787, -145756, -204243, -237307, -171654, -120271, -169629, 26574, 4836, 65836, 114559, -53236, -175138, -69480, -223944, -118230, -139901, -166429, -160909, -101969, -132536, -141915, -248938, -237360, -54718, -197534, -149440, 37784]
22859C7784n6110n0979p5304J43755r4491L7902J55246L7388j34018l1730j90596
22848b21153J86599M8383j23789P6859M4241j29223j7223O7714M3850l5156j28037
22837a86935K27294m0189r6548p999j9213p9352L3981R5121P3406K0738Q6922
22826A07226j06398j37073J38078P487L2076j3577Q8082n4071j00953Q6696l80348
22815c32775L8030P74J4048K57421j57854l3013R1346o1157J3086P9187J62211
22804G1304j62198P4413N1303J7407m3393J17951n3853j51160o5J49089Q7511
22793A58309J01532j8044N4180j68657k0428M0195K07545J35240n5025j16496
22783C18351J92949j72805j7980L64417J10767N7083n5617j40941n1754j24609
$$ y = [37784, -18326, -69305, -144609, -854, -95345, -57443, 97803, 135191, 1173, -30557, -221153, -34554, 13829, -109960, -33101, 11140, -118083, -135306, -67592, -23742, -58898, -186935, 40359, 170, -96378, -104377, -123590, -202942, -168961, -73840, -434, 20304, 107226, 828, -136245, 1833, 9320, 41396, 27819, 115901, 61830, -39123, 47573, -332775, -294745, -293971, -279923, -22502, -180356, -213369, -122023, -183180, -170094, -90907, 71304, -90894, -16481, 34822, 52229, 8836, 126787, 72934, -78226, -78291, 70798, 158309, 259841, 241797, 295977, 127320, 106892, 147087, 354632, 489872, 434847, 318351, 511300, 338495, 320515, 684932, 795699, 852782, 797165, 656224, 604470, 479861]
22773D79861L79376L27439Q1902L18189K75236K08192L75760K05755L96991P69253
22763C817954Q30602Q55650J112231J212178J300512J245899J103938J069417
22755A2548381L62314l6992l47949p04515j215018j427992j388396j377873
22747F411960j319032j128834q67004l99315l48888l84425k06543l80846j90960
22738A186113o5985k95484l4106M6103J22757k59265O8741O301j2176p5692M2802
22727G30109r522J05000N9364J4488J51149J10387J79633J60724J4655J08837
22717A624824R8088J40593J59250M4684J78157L04246J09964J01700K58360J48504
22707C168370J16872O6978O3633j26106l5195J57306J57614k57753k56018k01035
$$ y = [479861, 859237, 1186676, 1268578, 1586767, 1862003, 2070195, 2445955, 2651710, 3048701, 3817954, 4648556, 5504206, 6616437, 7828615, 9129127, 10375026, 11478964, 12548381, 12910695, 12873703, 12525754, 11821239, 10606221, 9178229, 7789833, 6411960, 5092928, 3964094, 3097090, 2697775, 2348887, 1964462, 1757919, 1377073, 1186113, 1120128, 824644, 790538, 836641, 959398, 700133, 768874, 775175, 762999, 687307, 730109, 720587, 825587, 884951, 899439, 1050588, 1160975, 1340608, 1501332, 1515987, 1624824, 1722912, 1863505, 2022755, 2067439, 2245596, 2549842, 2659806, 2761506, 3019866, 3168370, 3285242, 3352220, 3415853, 3289747, 3254552, 3411858, 3569472, 3311719, 3055701, 2854666]
22697B854666j75079j24273l32817k70391n36530k48805k13198j29509q5137K002
22687G40929l7183j95276O121m7815j87292R2466n769K76673J30561P8402J1951
22676H63768N8523j9161J91553r0462K96333m2283J61119K55048r1050j4368L06187
22665A875207O6641K57897L17289o8738L09893J52555J36255j43895J25260N3063
22655C081427Q4999o6608l7227j46753j29210l61878k18250j03600k63457k53108
22645A586335m10724k03108m2855k40874l80885N5343K14888r7513r5002r3750
22635B91855N3227o2576k08876J21527l2351m1850j94841O2999O5126k15362
22625a61122J94022R0464k13966k1477k3862p9005M7170L5423Q7199J22481p5582
$$ y = [2854666, 2679587, 2555314, 2222497, 1952106, 1415576, 1166771, 953573, 824064, 738927, 740929, 703746, 508470, 514591, 466776, 279484, 371950, 366181, 642854, 773415, 851817, 863768, 922291, 903130, 1094683, 1004221, 1300554, 1258271, 1419390, 1674438, 1583388, 1569020, 1875207, 1941848, 2199745, 2517034, 2448296, 2758189, 2910744, 3046999, 2903104, 3028364, 3081427, 3166426, 3099818, 3062591, 2915838, 2786628, 2424750, 2206500, 2102900, 1839443, 1586335, 1175611, 972503, 929648, 688774, 307889, 363232, 578120, 480607, 385605, 291855, 345082, 282506, 73630, 195157, 162806, 120956, -73885, -10886, 54240, -161122, 32900, 123364, -90602, -112079, -135941, -214946, -167776, -132353, -45154, 77327, 1745]
22614A745j49132o5204n1345J04559L7166j51792L6636J23489K066j2671Q2173
22603d2310j68667J4713Q5046K01887l1966j23715O3532o0703j3207j47350K10656
22592a2084p3757O5817j43954L3142r5457Q3253r5805N6791J84411j25621j44646
22581b67910O9790r7554R5944L1244M4738O2382o6417o9630O469J42994J9803
22570b8147l7525q2909q8107r1155L03369R888k892o7192j54390q954L27908
22559G9894o127j52186l6249j45220J05615R3346j41020j26542j61410J55716
22549c34183K08517L404r9491k3093K5099O4218M5991j3695R658n5651R275Q2760
22537g7191o9648J9432R1209M0706K721j37930n8p7210R2533L2011j09790L8090
$$ y = [1745, -147387, -212591, -263936, -159377, -122211, -274003, -237367, -113878, -111812, -124483, -42310, -210977, -196264, -111218, 90669, 58703, -65012, -1480, -62183, -75390, -222740, -12084, -85841, -20024, -163978, -130836, -226293, -143040, -238845, -182054, 2357, -123264, -267910, -198120, -295674, -199730, -168486, -123748, -61366, -127783, -197413, -190944, -47950, -28147, -65672, -148581, -236688, -327843, -24474, -14586, -17478, -84670, -239060, -248014, 79894, 73767, -78419, -114668, -259888, -154273, -60927, -201947, -328489, -489899, -334183, -125666, -122262, -221753, -244846, -219747, -155529, -109538, -123233, -113575, -169226, -159951, -77191, -146839, -127407, -36198, 4508, 7229, -130701, -130759, -207969, -115436, -83425, -193215, -155125]
22525a55125M2490k50884J08152n5320J33774J12060N828j30296M6111K12468
22515F9258k31374l44J20230O4461O291j02529k09910J66760K4918r7074J54259
22504c5054J35148J6915j50131j32956o0210q3423j0485K0624O7147P5052j31571
22493b88944J88903J88854l1209r462o9628k18606q1059K6169o6084K07305M5663
22482a08098p571M6664j07859J42176J7116J67012j89816j16755r1727j1133r6139
22471c56130L2685J12682r8488p266L74201M6088k87366o2747J31919j39736
22461b54158J70387j8716Q6342q0775O5675o1016L053n5925m3389J1081j09061
22450b86502j22326L50718J60587j31886R5793l8344j99829K01934P7614j65432
$$ y = [-155125, -112635, -363519, -255367, -310687, -176913, -64853, -59025, -189321, -143210, 69258, -162116, -162460, -42230, 22231, 28522, -74007, -283917, -117157, -92239, -189313, -35054, 100094, 117009, -33122, -166078, -226288, -309711, -320196, -299572, -232425, -157373, -288944, -100041, 88813, 57604, 48142, -21486, -240092, -321151, -294982, -361066, -153761, -108098, -115669, -69005, -176864, -34688, -17572, 149440, -40376, -157131, -248858, -259991, -356130, -323445, -210763, -309251, -316517, 57684, 103772, -183594, -246341, -114422, -254158, -83771, -102487, -16145, -96920, -31245, -92261, -89208, -145133, -188522, -177441, -286502, -408828, -58110, 102477, -29409, 66384, 28040, -171789, 30145, 107759, -57673]
22440e7673J2739k49781K13170m6230q6960O3232j60o7004J08555R8379J8247
22429F514p6960L4800p807j15591j74906P7786j19006M0630J05932K13789l0404
22418d5223j57375j8359j16280J03743N3359p4032R0868p6613K4840N2515K18168
22407E5611q8485p8094k05191j0485K52089q847m1690K8584n4427j06326J7485
22396b39776J80634j66658K01287P0573l8319q1482Q4083p2959q4026l15448
22386d62091J05955J50726j3402J49548Q3029k4617L8912n5077q3167J15738
22376E554j6086l0244O9715m9259m1013j57804Q5568Q0091J13649m8800P4930
22365H6301L5215j24119l0526r6289K4587k67998J66655n9177J7894J1691K04706
$$ y = [-57673, -44934, -294715, -81545, -127775, -214735, -151503, -151663, -218667, -110112, -11733, 6514, -70446, -35646, -43453, -159044, -333950, -256164, -375170, -334540, -228608, -14819, -45223, -202598, -220957, -337237, -233494, -180135, -254167, -163299, -239912, -215072, -162557, 55611, -32874, -110968, -316159, -326644, -74555, -83402, -125092, -96508, -150935, -257261, -239776, -59142, -225800, -24513, 46060, 7741, -73741, 10342, -62617, -146643, -462091, -356136, -205410, -218812, -69264, 13765, -10852, 28060, -27017, -110184, 5554, -10532, -40776, 28939, -20320, -61333, -219137, -133569, -53478, 60171, 11371, 86301, 121516, -2603, -33129, -129418, -104831, -372829, -206174, -265351, -247457, -235766, -31060]
22354c1060M3864p2338o55J2752M1485r7827L6192j7786p3642n0837K25127N3735
22342F9010j75969q2806l4487R6792k37972N6874K53364j30353J09528N0407k45722
22331b71334k2398K7438N7812J26679p2263o0260N5513j5875J56536J5449j26260
22320a28963l197J5445j35147J72860K50507l12257J26283R7144j54835j60770
22310b32930R0249n0998k158J47837M5093j82751J03938q437n5495J09728K2495
22299a3429m7166j22063J42655m6524k12786J2368P8526N3420O3038M1025j00559
22288a51495j52310r2965M4784p1362O1187L2417Q228O1957O8347J29889p5981
22277a37304k51398J75048m0095M4113R9709p4709R5712l2678o798r5691M1903
$$ y = [-31060, 12804, -59534, -60189, -47437, -5952, -103779, -67587, -85373, -159015, -209852, 15275, 69010, -106959, -189765, -224252, -127460, -365432, -308558, -55194, -185547, -76019, -25612, -271334, -293732, -266294, -208482, -81803, -154066, -214326, -158813, -174688, -18152, -2703, -128963, -132160, -116715, -251862, -79002, 171505, -140752, -14469, 82675, -72160, -232930, -142681, -193679, -195837, -48000, -2907, -185658, -81720, -90157, -145652, -35924, -13429, -60595, -182658, -40003, -86527, -299313, -286945, -208419, -154999, -91961, -50936, -151495, -303805, -396770, -351986, -423348, -362161, -329744, -321516, -259559, -191212, -61323, -137304, -388702, -213654, -253749, -209636, -109927, -184636, -88924, -121602, -128400, -224091, -182188]
22266a82188n0976M317k9352M7853N8882j2414k17160N1389Q5626J39697J15872
22255A1546m6088j71725K91252q6655m5084K9218n2336J07460j92983r1044J2197
22244b34242J46460J71215p6272Q5260j21390r9422j18012Q982J29966L9632p789
22233g5612l5572q8624K20361o6490j49422r104j888j46567J5562L1118R3889
22222b12349l3060j25824J62929J2784R0290p430k6839N1644q8707n5868P7322
22211a55108k56570j2199J18331k2713J31353K8237N9340J1360Q5866k929m5718
22200f0750J83774M7867p3182j69262p0804M4650J22563l0020j06989l4168K14676
22189F8355n4569J86205j14011k05656J31512k84661J3035K01164k55335l3422
$$ y = [-182188, -233164, -228847, -258199, -210346, -151464, -163878, -381038, -329649, -244023, -104326, 11546, -34542, -206267, 84985, -1670, -46754, -17536, -69872, 37588, -155395, -246439, -234242, -87782, 83433, 7161, 92421, -28969, -128391, -246403, -237421, -107455, -67823, -75612, -111184, -199808, 20553, -45937, -195359, -204463, -206351, -352918, -337356, -306238, -212349, -245409, -371233, -208304, -195520, -105230, -112660, -139499, -87855, -176562, -232430, -155108, -411678, -423877, -305546, -328259, -196906, -168669, -109329, -97969, -12103, -15032, -60750, 123024, 170891, 97709, -71553, -142357, -97707, 24856, -5164, -112153, -146321, 68355, 13786, 199991, 85980, -119676, 11836, -272825, -259790, -58626, -313961, -347383]
22179c47383P0142O5287N6417J6101Q7715O2121M758j75111K00063j82548l7795
22168a80233M4674j67644l8273J61484J63863l3981r0261j9020p2326N2743R695
22157a69279n7085J38960M0369j11348k3918K4458l2964N4942n1672j88475J71268
22146b04744j2377J40435r3440J71732k01732j96176K43488Q6665j04488o1927
22136b32564J33623j40161K24901k88811k166K9075L3822l5265r2458K06651
22126a63353r1040k3401J42465k7387J0924l8778R2718q9063n153r524j10653
22115c12245Q2260J60579J07958l2984k05696l2430o0193M6743J8873n5191j8744
22104c01070L04606J22731j57074o4455j75248K08868J23012O6487O7829j69988
$$ y = [-347383, -277241, -211954, -155537, -139436, -51721, 10400, 15158, -159953, 40110, -142438, -180233, -135559, -303203, -341476, -179992, -16129, -50110, -140371, -159391, -231717, -178974, -169279, -226364, -87404, -47035, -158383, -182301, -157843, -190807, -135865, -187537, -376012, -204744, -217121, -76686, -170126, 1606, -200126, -396302, -152814, -66149, -170637, -232564, -98941, -239102, -14201, -303012, -305178, -276103, -242281, -277546, -370004, -163353, -254393, -277794, -135329, -162716, -151792, -190570, -97852, -186915, -192068, -201592, -312245, -229985, -69406, 38552, 5568, -200128, -232558, -292751, -246008, -227135, -282326, -301070, 3536, 126267, -30807, -95262, -270510, -61642, 61370, 127857, 195686, 25698]
22094B5698j12361J27068o070P2616p5451n3680J21271q5471j77202k17376l3526
22083d14484n2502K57965M0218q3322n9507j55425J95508J21751J14036j2027
22073d7789J27067L9605j89828J99564J31233r8400k68019L1960l220p8643Q1548
22062g4922O8730m1579Q9952j32632r1496L8520j33002L3248J00894n642n3303
22051b01232K09277j20690j1506R5708m2437o2352J1201j71532M3233K56978
22041F648j11770j2036k5563J11342R99L7852j00236j8294j89078J36058J58996
22030e082k53324O758P8396n0470J11757k5841l930j38475m8923J31322P8682
22019a19130Q2217n0515j24626j13826j4592K10649J10561K977j58214o217r3950
$$ y = [25698, -86663, 40405, 34335, 106951, 31500, -22180, 99091, 13620, -163582, -380958, -414484, -466986, -209021, -168803, -252125, -311632, -467057, -271549, -149798, -35762, -47789, 79278, 118883, -70945, 128619, 259852, 161452, -106567, -74607, -77827, -156470, -74922, -6192, -47771, 42181, -90451, -181947, -143427, -276429, -243181, -142287, -147929, -201232, 8045, -112645, -124151, -28443, -70880, -133232, -122031, -293563, -250330, 6648, -105122, -117158, -142721, -31379, -30380, 7472, -92764, -111058, -300136, -164078, -5082, -258406, -251648, -173252, -223722, -111965, -137806, -141736, -280211, -329134, -197812, -119130, -36913, -87428, -212054, -325880, -340472, -129823, -19262, -16285, -174499, -180716, -274666]
22008b74666M5004J17877J17402k33066R822P3556R329J93856j73529K09587
21998I5172j67367M3634q851j62108O1815J28855k7305j6133m203P3042l1360
21987a4809r8436o1914M2278l6158J9627m3799M4268N3118N541k6002q947k1907
21975a47140K531j42144j92191J69562J94650l6681J12978K7088j70558j62019
21965c43924O7835M1115l1226L0644O5436J83096o7016j03187K52939j4870j21834
21954d0992j04789j41974M1023M8114m9834k2007K07105j4670j40168O3646J22751
21943c1795o8849l6893J6786Q3677M6878l58995K10209L7905l5385L1912J8528
21932h6022N2406n1199n289j260m8365p4604J22383M1760j56294O7123N800J1159
$$ y = [-274666, -229662, -111785, 5617, -227449, -217627, -144071, -134742, 59114, -114415, 95172, -72195, -28561, -37412, -199520, -137705, -8850, -36155, -52288, -56491, 16551, -14809, -113245, -175159, -132881, -169039, -149412, -193211, -148943, -95825, -90284, -116286, -125233, -147140, -144609, -286753, -478944, -309382, -114732, -151413, -38435, -11347, -181905, -343924, -276089, -234974, -266200, -235556, -170120, 12976, -54040, -157227, 95712, 80842, -40992, -145781, -287755, -246732, -198618, -248452, -270459, -63354, -78024, -218192, -154546, -31795, -100644, -137537, -120751, -37074, 9804, -349191, -138982, -101077, -136462, -104550, -86022, -33616, -84815, -90104, -91364, -139729, -214333, -91950, -50190, -206484, -139361, -133561, -122402]
21920a22402m4649N4749J01669m4756O5234k1461o6938j42822R2666K07291J72783
21909B51364O4262l6035j64503m04507M7082K07031j61366r0386O7068P685J56397
21898e5908J48412j87567k64542J47247R3143j64049R876o4632P587K32071J61504
21887F3142p2995j19329j33584j6921J60237l1659r106M2158K4899l3493l6519
21876a63170J47555j48594k1P6844k13921j10547m0243L97879J16142j62278
21866a00354q7742M0068J66859j64564M4847L7747L9210M2014l4546k5934j41097
21855a83492P6953k7480J6838J48454j49543j7805j16015K17277j29488J7364
21845a46937m412J02188J09859j11558K0890o7914r8513m0662Q9378o5833K0688
$$ y = [-122402, -167051, -112302, -10633, -55389, 9845, -11616, -78554, -221376, -128710, 78581, 251364, 315626, 279591, 115088, -289419, -242337, -35306, -196672, -287058, -219990, -212305, -55908, 92504, -95063, -359605, -212358, -119215, -283264, -273388, -338020, -330433, -98362, 63142, -9853, -129182, -262766, -279687, -119450, -151109, -160215, -118057, -93158, -126651, -163170, -15615, -164209, -164230, -87386, -301307, -411854, -452097, -54218, 61924, -100354, -188096, -148028, 18831, -145733, -100886, -63139, -23929, 18085, -16461, -42395, -183492, -106539, -134019, -117181, 31273, -118270, -136075, -252090, -34813, -164301, -146937, -151349, -49161, 60698, -50860, -29970, -97884, -196397, -237059, -147681, -213514, -192826]
21834a92826n6085N6150J6003Q7115j23951J36558r512N3304P3410q3720o9813
21823a13367j01439k2967j2254j6255J9570l8225O7060K03424l0275r3912k00334
21812c38974Q6985J26185K5984j20309m7659K31648O6197j49653m941J09484
21802a5053R8975k9371k17790p3804J03274J46878n3310j23346j07523J04487
21792a66583l7078J7907o3972R4779R5648K2805P6687o1553k19416k15858L34795
21781a21839M4147K0424q1283m0428k6623K05776m0089j35387j4221j11926J17900
21770a83549M0575j34361J58525N2256O7232k82415J85985j32522J96556n1053
21760h2771j57996L4435N6213K52618j7475r4756k49995Q9362n0330K45377q3970
$$ y = [-192826, -248911, -192761, -176758, -89643, -213594, -77036, -86548, -33244, 40166, -43554, -113367, -214806, -237773, -250027, -266282, -246712, -284937, -217877, -14453, -44728, -138640, -338974, -251989, -125804, -99820, -220129, -267788, -36140, 30057, -119596, -124537, -15053, 83922, 54551, -163239, -237043, -133769, 13109, -40201, -163547, -271070, -166583, -203661, -185754, -249726, -154947, -59299, -36494, 40193, -21360, -240776, -456634, -121839, -77692, -57268, -138551, -178979, -205602, 174, -39915, -175302, -189523, -301449, -183549, -142974, -277335, -118810, -66554, 678, -281737, -95752, -228274, -31718, -82771, -240767, -206332, -150119, 102499, 85024, -9732, -259727, -170365, -220695, 24682, -59288]
21749e9288l0414L5195l6039n1672Q7803M0421j41835k2893O8455L9642j70782
21738b41407k9251J98091j12398m8537J36128p6374J4724r4463J70747n4462r0116
21727b27318q177R9061m8976P2462J61960k07065p2905J13318l0691n8224j07041
21716c13596N5708k4328R4037l6559J2258P6975M9694K56900l49300k08914N8748
21705c28377J75390p2363J01977L4351r8178m5720P9130J04558j23769p2137k1463
21694b66601N7409J08066K9898L6000p1357J09060q8199n3023K4431l4248J24665
21683b3899J0363m8363J05285L5960r4271P154j6634Q3209j17712j05671p337L4270
21671a37646J13215J02477J03790j31343j80173J30208k1594J5358q7704N3643
$$ y = [-59288, -89702, -54507, -90546, -142218, -54415, -13994, -155829, -178722, -110267, -70625, -241407, -270658, -72567, -184965, -233502, -97374, -173748, -159024, -253487, -82740, -137202, -227318, -235495, -136434, -185410, -112948, 49012, -158053, -230958, -117640, -148331, -206555, -313596, -257888, -282216, -188179, -224738, -212480, -135505, -85811, 171089, -178211, -387125, -328377, -152987, -225350, -123373, -89022, -187200, -232920, -153790, -49232, -173001, -245138, -266601, -209192, -101126, -71228, -35228, -106585, 2475, -85724, -138747, -114316, -148564, -23899, -13536, -61899, 43386, 79346, -14925, -7771, -24405, 58804, -58908, -164579, -171916, -137646, -24431, 78046, 181836, 50493, -129680, 528, -21066, -5708, -93412, -39769]
21661c9769J1792N0359m5384M8717P9228j24841L3238J67033N473j17499n1923
21650A6424j03734l0726r0890J68989J06882L4054j03493K04730m8311n398j19710
21639B8817r9820J7015O2265Q7588m5977N4694J06516j8783j88247j95J77767
21628A81640j10899l0570m2886Q1273l5747L8308J60204n4331N843o7017Q6429
21617B12247L0542P560o6917j90824J87658J16409j37019Q3413k03232l3848J00548
21606A06537N9385j14090j67478K00447P6617j42121K6647K05144k05871k91255
21596b46038J9298K44538q3572j41157L26851p7880l8333q7475J82115q1562J01401
21585A18186O02m2489P5811o1672J3279l3059L3734K2699N0831j90547Q3360N2760
$$ y = [-39769, -27977, 22382, -23002, 25715, 104943, -19898, 13340, 180373, 185846, 68347, 16424, -87310, -118036, -208926, -39937, 66945, 100999, -2494, 202236, 153925, 148527, 28817, -71003, -53988, 8277, 95865, 49888, 104582, 211098, 192315, 4068, 3873, 181640, 70741, 40171, -2715, 78558, 42811, 81119, 241323, 186992, 192835, 125818, 212247, 242789, 250349, 183432, -7392, 180266, 296675, 159656, 243069, 39837, 5989, 106537, 165922, 51832, -115646, 84801, 161418, 19297, 45944, 251088, 45217, -246038, -226740, 17798, -65774, -206931, 119920, 42040, 3707, -83768, 98347, 16785, 118186, 118788, 76299, 152110, 90438, 103717, 70658, 104392, 127091, 177922, -12625, 70735, 123495]
21573A23495r0459Q440n4308J1863Q0981p5703K46677q4868j1199J15801k71042
21562c22K5874K6807K6476n7097O21O5277r0311J33247o2008r3611P622J69257
21550A51832j37857j50924J84111K5946j63183K03372m4101m1481n999k15407
21540a93691O3903N7519l0786j82937J9422J69203J2870J1709k91219J6017J55392
21529a92598J71479J03899j35635j93164j53867K10811J47298k21372J22181
21520a40968M4845m1915L4868J30890J13878j56278k2042M4299j11133j2789K2866
21509i3479m4958j6067J26943j20368j0076O7877m8002J1916p0967j24610J54627
21498a67164j14503J5328O6124J38116L9404m5933j09694M458J9293p556L3952
$$ y = [123495, 33036, 41476, -12832, -969, 80012, 4309, 250986, 166118, 154919, 270720, -322, 25552, 52359, 78835, 21738, 22359, 87636, -2675, 130572, 68564, -25047, -17425, 151832, 13975, -136949, 47162, 73108, -90075, 113297, 69196, 27715, 21716, -193691, -129788, -72269, -103055, -285992, -266570, -97367, -84497, -72788, -364007, -347990, -192598, -21119, 82780, -52855, -246019, -399886, -189075, -41777, -263149, -140968, -96123, -138038, -103170, 27720, 141598, -14680, -36722, 7577, -103556, -116345, -93479, -138437, -154504, -27561, -147929, -158005, -90128, -138130, -126214, -197181, -321791, -167164, -281667, -266339, -200215, -62099, -22695, -68628, -178322, -173864, -154571, -162127, -128175]
21487a28175N9396p5990j02283O0459r3118P3432N7320K18161k9306r5386Q862
21476d6628J36313j41728p902j25200J30852o6836j34629J53509p5928N8679R9176
21465b0322n4086N5304j89267m0400J1071M8266J98645O0536m9899j81030R7259
21454f3923j45923O9191l5338J07169o1662j87630J13952K0366J20413O346r3472
21443a50511j7234j15924K6162L19573q9118j40818j13707n6802K15334M8387
21433g4658L4144j46724n9306K20749K0649j12363M9568K65266o3475p6649n5083
21422B118P3404j44604j20132P2601k8138j8004P3110J25309n7744O7089j77788
21411a32779J7272P5869j09290p4913k5130m9589R478L4710j7009Q2127J1738
$$ y = [-128175, -68779, -144769, -247052, -186593, -279711, -206279, -148959, 69202, 39896, -55490, -46628, 89685, -52043, -59945, -185145, -54293, -121129, -255758, -102249, -178177, -119498, -20322, -74408, -19104, -208371, -248771, -237700, -189434, 9211, 69747, 19848, -161182, -63923, -209846, -140655, -175993, -68824, -130486, -318116, -204164, -183798, -63385, -57039, -150511, -167745, -283669, -257507, 62066, -27052, -167870, -281577, -338379, -123045, -74658, -40514, -187238, -246544, -25795, -5146, -117509, -67941, 197325, 133850, 57201, 2118, 75522, -69082, -189214, -116613, -144751, -162755, -89645, 35664, -22080, 45009, -132779, -115507, -39638, -148928, -223841, -248971, -298560, -289082, -254372, -271381, -189254, -177516]
21400a77516L21438k21643q6539J50289p2726j31749k6812J39314n1739O8179
21390h9504n314q4743L0139R2819k1673k07025j07492Q9796P388J24088K47792
21379G6271o2023j29149j4369q0818j8631J02228o7644N9899P5476r2251q0601
21368b31612Q554J29942J69261q7609j06109j38653J27528J29186Q2615j28399
21358d5296q8226R7263N1931j47237j14961J86057J7662j28121l0989j3432J40219
21347g5130j0949j49175j14207J70475L9398J34728k14837P7390J97604j38037
21337h2740j94226M1864J21365Q9213j63170J98641l9091j19952M027j0886M1596
21326a13359o0364j36354J66232J00654K49357j65072o1297r3394J08840n1540
$$ y = [-177516, 143922, -77721, -164260, -13971, -86697, -218446, -245258, -105944, -157683, -89504, -94818, -179561, -149422, -56603, -78276, -285301, -392793, -302997, -295609, -171521, 76271, 14248, -114901, -129270, -210088, -228719, -126491, -194135, -134236, -58760, -151011, -231612, -223058, -93116, 76145, -11464, -117573, -256226, -128698, 488, 83103, -45296, -133522, -36259, 15672, -131565, -246526, -60469, -42807, -170928, -201917, -215349, -75130, -86079, -235254, -349461, -178986, -139588, -4860, -219697, -142307, 55297, -82740, -276966, -235102, -113737, -24524, -187694, 10947, -28144, -148096, -144069, -154955, -113359, -173723, -310077, -143845, -43191, 206166, 41094, -20203, -113597, -4757, -56297]
21316e6297j02894N2417Q5458j30101j4217J56135j05433r9285j89384R1549J15753
21305a96299N0688J89686j63564n637j79229K66675J04887k6475J18407j14119
21295D5020J6268k16412J14926k87333O0410P4409R0815L2313P281o6564K06839
21284G7972j2454m2189k32444J52482J50122j22465o1522P5529j38856O6773k4488
21273a11540j12763p6894J80502K8408M733M1873J37010r3384J57937n2796j18913
21262a5827q2868j70697o2704J00795Q3110R6367m3891r1432n02M4445r8352K07061
21250c4495L8208n016j63935j57475J88517O5056J47442Q6298k23921M9713j08756
21239a18364j15751P3636j41524P481K6269P1844R8869r2265L4991l1527M8656
$$ y = [-56297, -159191, -106774, -21316, -151417, -165634, -9499, -114932, -214217, -403601, -312052, -196299, -145611, 44075, -119489, -125126, -304355, -37680, 67207, 40732, 159139, 45020, 61288, -155124, -40198, -327531, -267121, -192712, -101897, -69584, -62303, -128867, 77972, 65518, 23329, -209115, -56633, 93489, -28976, -90498, -14969, -153825, -87052, -111540, -224303, -301197, -120695, -92287, -87554, -45681, 91329, -2055, 155882, 103086, -15827, -98695, -269392, -332096, -231301, -148191, -51824, -95715, -187147, -187649, -143204, -241556, -34495, 3713, -1303, -165238, -322713, -134196, -69140, 78302, 164600, -59321, -9608, -118364, -234115, -160479, -302003, -294522, -268253, -196409, -97540, -189805, -154814, -186341, -137685]
21228a37685l8932J75337n1635q1379J96538k08320j6753m5294L2187J47728
21218b8208j03661j98863J38875J93760l85803J22060J30726l8653m7674k9194
21208b46635j1874L6537p1066J65199L4518o572r8279k560J22962q7261O1943
21197a03088m6548K515q7927O4859L6009J18525P1958k063k36744J44986R7976
21186F0458k7412j49751j84749J89166K17928p3951k7138j60750j06321j40486
21176d03006K47009o2775K39470M4501P98j44050m7144L4144k8993J57191p285
21165B9860M2814J46837k6145l10464O9470L3073k9684m5021J01127k5129j07945
21154a21207M3563k5793r1562O8112J9847q5768J14574P2633j26159j04780J15409
$$ y = [-137685, -176617, -1280, -52915, -134294, 62244, -146076, -162829, -208123, -175936, -28208, -131869, -330732, -191857, 1903, -383900, -261840, -131114, -169767, -217441, -246635, -258509, -221972, -293038, -127839, -93321, -99893, -198172, -200732, -77770, -165031, -103088, -149636, -147121, -235048, -170189, -134180, -15655, 56303, 54240, -182504, -37518, 60458, 33046, -116705, -301454, -112288, 105640, 31689, 4551, -156199, -262520, -403006, -155997, -218772, 20698, 65199, 65997, -78053, -125197, -91053, -120046, 37145, 29860, 72674, 219511, 193366, -117098, -47628, -14555, -44239, -89260, 11867, -13262, -121207, -77644, -103437, -194999, -126887, -107040, -192808, -78234, -5601, -131760, -236540, -121131]
21143a21131l5127J01658J82461k14867l824L2112J29455K4676j57717l5575K2709
21132g5170J4910j4122J30979M202j93312J06065j41505j6255P4199N5914k1439
21121g5534J13490J78511m4184j22044M8703k93475J21099j5537J435L65996
21111B78460K01931j08622k81604K4570P7664j71943J16062K76416j70235j18714
21101A23985m2947J90776o6608j49232j76889J36681r4602J07073J27099R3822
21091B49158l621k49586J17899N9442j67318R8799m6242j3276J52519k07577
21081i803j3480J74940J9567K3163O9360L4040K3330L1765O931k06167R3960l317
21069B44289r9747J26595K6560m3491k72741L26637P1490p6372j09406n4024l2875
$$ y = [-121131, -156258, -54600, 127861, -87006, -90830, -58718, 70737, 95413, -62304, -97879, -75170, -60260, -74382, 56597, 60799, -132513, -26448, -167953, -184208, -110009, -54095, -75534, 37956, 216467, 172283, 50239, 98942, -194533, -73434, -88971, -87536, 278460, 480391, 371769, 90165, 114735, 192399, 20456, 136518, 412934, 242699, 123985, 81038, 271814, 205206, 55974, -120915, 15766, -78836, 28237, 155336, 249158, 245537, -4049, 113850, 173292, 5974, 104773, 58531, 45255, 197774, -9803, -23283, 151657, 171224, 194387, 263747, 297787, 321117, 352882, 359813, 153646, 247606, 244289, 144542, 271137, 297697, 254206, -18535, 308102, 379592, 303220, 193814, 139790, 106915]
21058A06915P5747J06044q3185k41495O1038N4131J4010j43743J59967J0041J6080
21047A35550O916N8597J95328k83038J27780k22023M4589M3305j10110K6076P9056
21036A02026N6798N4798p8375J4982q3322J15066o6460j3399l8870L9891k37355
21025a34220q2615J07236J49966l4090K5310K5760L8261l9054j2376j08917k4172
21014h8911J8901J90505J62337j89743l8000j17343m8931O701J40651n8008R2601
21003G0760m0955k09782j3466J38592o3889R0861j07077j8122o9350J98126r3033
20992a17335L1834K2034R4515N2444j10196p0014j50411P6266N800J0231K0138
20981a34694M21j44511K51244j95690p5903J70849J0587l9421m7964J72138j61725
$$ y = [106915, 182662, 288706, 205521, -35974, 25064, 79195, 93205, -50538, 109429, 119470, 135550, 142466, 201063, 396391, 113353, 241133, 19110, 63699, 107004, -3106, 22970, 102026, 158824, 213622, 135247, 150229, 66907, 181973, 115513, 102114, 63244, 103135, -134220, -216835, -109599, 40367, 6277, 31587, 57347, 95608, 56554, 44178, -64739, -88911, -70010, 120495, 282832, 93089, 55089, -62254, -111185, -104484, 36167, -21841, 70760, 29805, -179977, -193443, -54851, -118740, -27879, -134956, -153078, -222428, -24302, -117335, -85501, -63467, 31048, 83492, -26704, -96718, -247129, -170863, -165063, -154832, -134694, -134273, -278784, -27540, -223230, -299133, -128284, -117697, -157118, -205082, -32944, -194669]
20970a94669J49384j54953K8098P1107O5894L2272j04460p3049K5142J87642
20960C2408j17759m3797K62562J25863l5804k37191K7035Q4494l7922P0712j38851
20949h250j32536N9912j312R8237j20031J5203J50717N2224j86806m293J00175
20938B3240m5532J27439j61590j2981N3317o3372K04812p5459L1388j1194q1716
20927a1648P8567k83275J06046J67197p1598O5634K4744P0436M7307r7563m1531
20916E4316m6782L8016R69Q0017J28628O2035q4486q1642n7352O1942J1618o7268
20904A00011J6448N3429J56913j8471j71126K1249J29767j54804J04686O1380
20894B99482j44238J1468J91887Q4212l96727k2354J24764j31063J94775J08030
$$ y = [-194669, -45285, -200238, -172140, -101033, -35139, -2867, -107327, -180376, -155234, 32408, -85351, -129148, 133414, 259277, 223473, -13718, 13317, 97811, 59889, 130601, -8250, -140786, -80874, -82186, 16051, -103980, -88777, 61940, 114164, -72642, -76935, 23240, -22292, 105147, -56443, -69424, -16107, -79479, 125333, 49874, 81262, 70068, -11648, 66919, -216356, -110310, 56887, -14711, 50923, 75667, 146103, 193410, 95847, 54316, 7534, 45550, 46519, 126536, 255164, 317199, 232713, 151071, 93719, 155661, 167279, 100011, 116459, 169888, 326801, 308330, 137204, 158453, 288220, 133416, 238102, 299482, 155244, 166712, 358599, 442811, 46084, 23730, 148494, 17431, 212206, 320236]
20884C20236j86174N8144P0499o1538k8625J7333p686K11779j38382J03111J64948
20873E23645j38757J33882M8604j4984j11063N9062o449j21942P2731P8749Q2807
20862F06285n6807Q5749r4985n3381J36532L5208l7195R899j19410P1829P6390
20851F60114l1614m8445Q3118n248M4089Q3640p0096J01598J47887j24611r222
20840H31210o9256Q9448p6672K04K09978K1366R8327l3836n0492j24418k9317
20829H66542Q1193J18481M8716J866n5332j24243p180j42601k8739r4535o2612
20818F01556J2531N7583Q0605J63842q8879j12292q9804q7111l2509K17863q8208
20807F35177j56913J35060n9019o2214m2858P8541j36631J47381o0044l1201O6687
$$ y = [320236, 134062, 192206, 262705, 201167, 172542, 189875, 182189, 393968, 255586, 358697, 523645, 384888, 518770, 567374, 552390, 441327, 500389, 493940, 371998, 444729, 523478, 606285, 549478, 635227, 540242, 486861, 623393, 658601, 621406, 631305, 511895, 583724, 660114, 628500, 580055, 663173, 657925, 702014, 785654, 715558, 817156, 965043, 840432, 831210, 761954, 851402, 774730, 774934, 984912, 1006278, 1104605, 1070769, 1020277, 895859, 866542, 947735, 1066216, 1114932, 1116798, 1061466, 937223, 930043, 787442, 758703, 664168, 601556, 614087, 671670, 752275, 916117, 827238, 714946, 625142, 538031, 505522, 723385, 635177, 478264, 613324, 554305, 492091, 449233, 527774, 391143, 538524, 478480, 447279, 513966]
20796E13966j16955P727P7440q2600Q5264j31684j01368L6142O5744l1753J29557
20785D51480Q27R853j07478j57232J23924n9331J49635r9374L1789J48744l8972
20774D53865J84320j52058p3632r3965j12337M25j12377N1530K10014k28232
20764A27553k13525k1428J37548j44306q5816J35681N121n1810j33394M2669K03074
20753A367m9621N4408N8294m5553O9051l3312P6145j05864k96291J04037J12926
20742e4413L15435k39684j80265K99000l1206n2026K3537J17020o1013k857j33282
20731B46M8750j06311J48406M7851j04343K7617J02182n8651Q9534j48898R2504
20720A38887K6541j00013j8114k75473R5471n6734m9142L84531J5771j05809
$$ y = [513966, 397011, 404738, 482178, 399578, 484842, 353158, 251790, 287932, 353676, 321923, 451480, 452307, 462160, 354682, 197450, 321374, 262043, 411678, 312304, 344093, 492837, 453865, 638185, 486127, 412495, 318530, 206193, 206618, 94241, 145771, 355785, 127553, -85972, -107400, 30148, -114158, -199974, -64293, -59172, -110982, -244376, -201707, 1367, -48254, 6154, 64448, 18895, 87946, 54634, 130779, 24915, -271376, -167339, -54413, 261022, 21338, -158927, 140073, 108867, 56841, 80378, 197398, 136385, 133528, 246, 48996, -57315, 91091, 138942, 34599, 62216, 164398, 105747, 195281, 46383, 138887, 165428, 65415, 47301, -228172, -132701, -189435, -238577, 145954, 161725, 55916]
20710E5916p2759M6154j38337P1612K103N6347R143j40255J35977o7076P7199
20699C6024J5688j35033n83J25036L4820o3945j14662K15588J10112j73852k098
20688D7095L2724l9892l5687K43789j53410J6671l1803N898M5682N6898j29778
20677E8187r8618K78344j15480K2124p4831j38807M7452k3198Q4978J16679K72294
20666D29124k48913k03404m4789N8866K7897O7822J61111j23946k17124N4392
20656c8964O7582K15361n2051j51773K10982l8355q9553n9991M6196n1995Q0552
20645A37991k10192j16753L06580K30410k70502l7969J10606Q8123L2446m3554
20635B27186O9193l9439l58064k7476K09745K15031L1001j76188n799R0561K978
$$ y = [55916, -16843, 29311, -109026, -37414, -35311, 21036, 30179, -110076, 25901, -41175, 36024, 51712, -83321, -83904, 41132, 75952, 12007, -102655, 112933, 223045, 49193, 47095, 79819, 39927, 4240, 248029, 94619, 111290, 79487, 85385, 131067, 187965, 58187, -40431, 237913, 122433, 144557, 69726, -69081, -21629, -44827, 40151, 156830, 429124, 180211, -23193, -67982, -9116, 18781, 86603, 247714, 123768, -93356, -38964, 28618, 243979, 191928, 40155, 251137, 212782, 123229, 63238, 109434, 57439, 137991, -72201, -188954, 117626, 348036, 77534, 39565, 150171, 238294, 270740, 227186, 296379, 256940, -101124, -128600, 81145, 296176, 327177, 150989, 145190, 235751, 238729]
20624B38729j52019J14482N8536k63340J31050n8636N0597J0229j931r9665J25475
20613A53507J0491k0249p4136j1814O3926N7743n9646J09242J86375o4005r4485
20602B56949k0877R5364Q7207K0105L9099j68235J03754l8874k39815j04854
20592B9823r4086L88110L9279N7044o5210O7712p6518j1625M0443P034L9254j18325
20580C02935J8644J37793q3269j24998P7958R6499k9443j29857r7138J97965
20570C67089j35994O87J99705l6337k5206N1364p506O1373m7097q8301R5081m0008
20558C94850Q8907j14096k1339J11678J27838o3309Q1975K298j54149J6052M1883
20547E12588L6332J25660J42292j61201q5449L0854n0184M9223n7115j20089
$$ y = [238729, 86710, 201192, 259728, -3612, 127438, 68802, 119399, 129628, 127697, 28032, 153507, 163998, 143749, 69613, 57799, 121725, 179468, 119822, 229064, 415439, 351434, 256949, 236072, 331436, 418643, 438748, 477847, 309612, 413366, 374492, 134677, 29823, -64263, 323847, 363126, 420170, 354960, 422672, 346154, 334529, 374972, 382006, 421260, 302935, 321579, 459372, 376103, 251105, 329063, 425562, 396119, 266262, 169124, 367089, 231095, 231782, 431487, 395150, 369944, 421308, 413802, 475175, 428078, 339777, 434858, 394850, 483757, 369661, 348322, 460000, 587838, 524529, 606504, 608802, 454653, 470705, 512588, 548920, 674580, 816872, 655671, 570222, 601076, 550892, 600115, 543000, 422911]
20537D22911l8936J59657J51663J07204j42636J3568m489M3132O7630j47261
20527F32443p8588J26940K1365M4124j25349p702j37137J61361j11129q9622o2955
20516C73751J61384J45475K8318P171l7254m4625j85942J58062J05031j58595
20506E52776K27684L7944k02743P1087j0417j916P4681p1348j15484L3228j0481
20495E85011K05756o9433J17994J1803J5354N5470p4335j9689M6432N6883k22595
20484G08651R4322J99678n6608J00521P7127k49984J6939N8796J46308j03j9114
20473A076533J9401m2757r7563J27622J25056m3614J8488n51M7417r4365J42221
20462A277888O6305R2128r1270K13017j40448P2694P9890L31343N8007j03189
$$ y = [422911, 383975, 543632, 695295, 802499, 659863, 673431, 668942, 712074, 779704, 632443, 553855, 680795, 702160, 746284, 620935, 613233, 476096, 637457, 526328, 436706, 373751, 535135, 680610, 708928, 716099, 678845, 634220, 448278, 606340, 711371, 552776, 780460, 818404, 615661, 686748, 676331, 674415, 749096, 677748, 562264, 595492, 585011, 790767, 721334, 839328, 851131, 866485, 921955, 847620, 827931, 874363, 931246, 708651, 802973, 1002651, 946043, 1046564, 1123691, 873707, 890646, 949442, 1095750, 1095647, 1076533, 1095934, 1053177, 955614, 1083236, 1208292, 1164678, 1183166, 1182615, 1230032, 1135667, 1277888, 1344193, 1436321, 1345051, 1558068, 1417620, 1490314, 1570204, 1901547, 1959554, 1856365]
20452A856365Q1887O8713O455L63n3244O8147R1238q287M3031K36316K46248
20441B637232J96446j78266J71329L24281j38854m6675M63873k0429L23451L59679
20431D092067l8257J90047J79747m5454L05129M61138M37804M39604L62378K93575
20421F677778N21950N28062L72317K52427L94725N36321N52523N52760O94982
20412A1083845O02758N03356R22738P92281P86732J239985J328054J230098
20404A8489847J397291J801263K288702K547925K752589L046949L653756M208940
20396D0187262M559215M400469N005467M796749M614492M408664M259929L902494
20388G6134741L589034L237223K580938K299462K142052J901234J775127J740286
$$ y = [1856365, 1938252, 2006965, 2013420, 2013783, 1960539, 2028686, 2119924, 2111637, 2154668, 2390984, 2637232, 2833678, 2655412, 2826741, 3151022, 3012168, 2965493, 3429366, 3408937, 3732388, 4092067, 4053810, 4243857, 4423604, 4378150, 4683279, 5144417, 5582221, 6021825, 6384203, 6677778, 7199728, 7727790, 8100107, 8352534, 8747259, 9283580, 9836103, 10388863, 11083845, 11686603, 12189959, 13112697, 13904978, 14691710, 15931695, 17259749, 18489847, 19887138, 21688401, 23977103, 26525028, 29277617, 32324566, 35978322, 40187262, 44746477, 49146946, 54152413, 58949162, 63563654, 67972318, 72232247, 76134741, 79723775, 82960998, 85541936, 87841398, 89983450, 91884684, 93659811, 95400097]
20380I5400097J697753J377024R30909J072801J071680P83233M49059L47015
20372A03129571L36900J40545L28988P1468k3611K90605J83642K19856J29326
20363A04807290K59774L94211L78815Q98463J331402J784689K454481L147955
20355A15457080L686931M498761M932203N546232O010403O052604N832015N499421
20347A57515650N221572M698935M103785L734163L278167K747955K205770J765331
20339A85271328J704100J209140R03985P72328L45979k02594p00835q36802j319743
20330A87146886j637666j941696k360996k726692l105004l305959l849786m462972
20322A63756115m874884n320723n659179o012749o245578o113088n911943n291025
$$ y = [95400097, 97097850, 98474874, 99405783, 100478584, 101550264, 102333497, 102782556, 103129571, 103466471, 103607016, 103936004, 104007472, 103983861, 104274466, 104458108, 104677964, 104807290, 105067064, 105461275, 105840090, 106738553, 108069955, 109854644, 112309125, 115457080, 119144011, 123642772, 128574975, 134121207, 140131610, 146184214, 152016229, 157515650, 162737222, 167436157, 171539942, 175274105, 178552272, 181300227, 183505997, 185271328, 186975428, 188184568, 189088553, 189860881, 190206860, 190004266, 189303431, 188466629, 187146886, 185509220, 183567524, 181206528, 178479836, 175374832, 172068873, 168219087, 163756115, 158881231, 153560508, 147901329, 141888580, 135643002, 129529914, 123617971, 118326946]
20314A18326946m433773l816149l364474k387495j731546j083980n27712n86423
20306A00395394k16924J17454j5527j80357n3129K751M6498r4622l7751j18728
20296I9845059m34168m75448l41350p80226j062355j143374j256729j517209
20288I2834200j670037j768522k082225k091321k391732k654621k994452l069643
20280G4111647l065536l851008m130160m517166m798626m959340m895369m979556
20272C8914886m617942m115383l887249l428168k973138k172338k052766j743967
20264A3923935j443384r40669r01893j037837p82544n48965o20780n90059l89271
20255F668533m47592m73408l13999j78873k54262l84938m37982l17597j63496
$$ y = [118326946, 113893173, 110077024, 106712550, 104325055, 102593509, 101509529, 100981817, 100395394, 100178470, 100295924, 100280397, 100100040, 100046911, 100049662, 100096160, 100001538, 99963787, 99845059, 99410891, 98935443, 98594093, 97813867, 96751512, 95608138, 94351409, 92834200, 91164163, 89395641, 87313416, 85222095, 82830363, 80175742, 77181290, 74111647, 71046111, 67195103, 63064943, 58547777, 53749151, 48789811, 43894442, 38914886, 34296944, 30181561, 26294312, 22866144, 19893006, 17720668, 15667902, 13923935, 12480551, 11539882, 10637989, 9600152, 8817608, 8268643, 7647863, 7057804, 6668533, 6220941, 5747533, 5433534, 5254661, 5000399, 4615461, 4177479, 3859882, 3696386]
20246C696386m37389k96052j20029j37016k8503k83217j78028m5820k27069j28851
20236A814412j64352o1616P5992j29136n4940m6517j19217n1416l8587p3022p6898
20225A074703m3013J19924j33606j32017J4701J2383J07304R5021J1419j43456
20215I83363m4307j8422l407k42883q9320J58953j58967M6389r9169o8300P893
20204D71823N9886j1581N6740M5941j41505n0805j64007p4605J90246m6364j58143
20193A77626J91969J0047J00761k309j23621o8186m3810J67P4373K6736q555j29378
20181B05820j54813j14456J35952L47277K0505j94770Q7234J144r0564J43967
20171C87296k1309q6677L5351m8471n3554L9374j39289N7839J6118N5423M250j69249
$$ y = [3696386, 3258997, 2962945, 2842916, 2705900, 2677397, 2394180, 2216152, 2170332, 1943263, 1814412, 1650060, 1588444, 1664436, 1535300, 1480360, 1433843, 1314626, 1263210, 1224623, 1151601, 1074703, 1031690, 1151614, 1018008, 885991, 900692, 913075, 1020379, 1115400, 1126819, 983363, 939056, 920634, 917227, 674344, 585024, 743977, 585010, 631399, 532230, 463930, 471823, 531709, 520128, 576868, 622809, 481304, 430499, 266492, 191887, 382133, 335769, 177626, 369595, 379642, 480403, 478094, 354473, 286287, 242477, 242644, 317017, 343753, 335198, 205820, 51007, -63449, 72503, 419780, 440285, 245515, 332749, 333893, 243329, 387296, 365987, 279310, 314661, 266190, 212636, 252010, 112721, 170560, 186678, 242101, 246351, 77102]
20159G7102K13246M3014j84536q7960j81216K29817n1366o1534J17859j24724
20149a0298n872J21086r8653O1981J12017j20955m4733q4277j0877j7793L66315
20138B67941j91105O8648m0005N5748J14472p4191n8277J47062o92j28560j61862
20127h21l4781p2826j00377L59531K2389j02356j35605J19502j10486P1510M1417
20116E7097m4854J35389J10261j91774k17041J99572J03909N3600j57812m6260
20106B087k8857n0987Q4616n5425m4018J6372j20109J33546Q7637j97061Q3182
20095h9017L7801q3717j25792K22644n2429r061J2377m1709K1115O8227j30186
20084a69747K65120n6476j78915J03792K8305j32885o4052J25806M9876O5207
$$ y = [77102, 290348, 333362, 148826, 60866, -120350, 109467, 58101, -3433, 114426, -10298, -16170, 104916, 6263, 68244, 180261, 59306, 14573, -69704, -80581, -98374, 267941, 76836, 145484, 105479, 161227, 275699, 201508, 143231, 290293, 289601, 161041, -821, -35602, -108428, -208805, 150726, 173115, 70759, -64846, 54656, -55830, 15680, 57097, 12243, 147632, 257893, 66119, -150922, 48650, 152559, 206159, 48347, 2087, -26770, -77757, 6859, -48566, -92584, -76212, -196321, -62775, 24862, -172199, -89017, -51216, -134933, -260725, -38081, -90510, -99571, -87194, -128903, -107788, -39561, -169747, 95373, 38897, -140018, -36226, -7921, -140806, -204858, -79052, -29176, 36031]
20074C6031j97402Q1195K33394J02550j91007j50057O2072L0205l7314j89594
20064b19927p378o4225J65709O2694j16044J21072j5740L8306j92562J38661
20054h9434N2407q715q7622j20611J98461M7100k18830M396k4587K44673j13089
20043a15851L977L1232k5795N6028r5015Q7807p4166q3496k0492J41990J14807
20032B1026j0974m0635k0179R5492j31496J43757J5009j44481Q8147J43345R7369
20021B56380j10926K4728j75524j67706k21538J56313K37403J09972j2580n5657
20011D0865R0725o7580p5641J62228l19332J34621J03577j1358k9984p3434j71439
20000b16752J3713O3346j9818p290P1725J9749N7776j03971p8969J82558r8573
$$ y = [36031, -161371, -80176, 153218, 255768, 64761, -85296, -23224, 6981, -30333, -219927, -227305, -291530, -125821, -63127, -179171, -58099, -73839, -35533, -228095, -89434, -37027, -45742, -133364, -253975, -55514, -8414, -227244, -222848, -247435, -2762, -115851, -111874, -80642, -106437, -50409, -145424, -57617, -131783, -215279, -235771, -93781, 21026, 10052, -30583, -50762, 44730, -86766, 56991, 72000, -72481, 15666, 159011, 256380, 145454, 170182, -5342, -173048, -394586, -238273, -870, 109102, 96522, 40865, 131590, 64010, -11631, 150597, -168735, -34114, 69463, 58105, 28121, -45313, -216752, -203039, -139693, -159511, -166801, -95076, -75327, -17551, -121522, -200491, -17933, -116506]
19989a16506P6068P3672R6891j00472j98575J75500N1449q8338P758j19020J69643
19978B8070P6987k73228j65716L8637J81274j93348Q533J38181P1590k139q3245
19967a74404j2705l5994K20557p016J49401l07501k17708K05788k0555K11873
19957A1736J8450r3048k0011p1066R9137Q0962j56771n1525J34004j63983r916
19946b22031j73872J97379K32166n6554M8774j07241k4909M4268k18654j62186
19936d42860K72578K84377j47012k37611J44666J95050j41148o3864J4332J13725
19926g767j41695L0511J34936p3050L7166j44532j31291l0339K06644j23980
19916b43397J48380J28774k24886K9313J12190q0455J53487j39699j12997n11j84902
$$ y = [-116506, -40438, 33234, 130125, 29653, -168922, 6578, 58027, -30311, -22553, -141573, 28070, 105057, -168171, -333887, -295250, -113976, -307324, -298791, -160610, -89020, -91159, -174404, -187109, -223103, -2546, -9562, 139839, -167662, -385370, -179582, -200137, 11736, 30186, -62862, -82873, -153939, -54802, 26160, -130611, -182136, -48132, -212115, -222031, -395903, -198524, 33642, -22912, 25862, -81379, -106288, -62020, -280674, -442860, -170282, 114095, -32917, -270528, -125862, 69188, -71960, -135824, -121492, -7767, -149462, -118951, 15985, -57065, -19899, -164431, -295722, -326061, -119417, -243397, -95017, 33757, -191129, -161816, -49626, -130081, 23406, -116293, -229290, -229801, -414703]
19905d14703l0335L51768Q5112k11711J47210q005N2197j30367k44J6175M6544
19894i6359o3854K8901O542P4734l0997K1119J81979j58882r4407J25572R247K45100
19882B48695J05052N3013p9103q8134r5174J68250P5754j36695k74727K15475
19872A92406J06787j53884J05553K7344p0526K7199J52892k135k00564m3150k3320
19861A18602o110J42185Q1871k9954L7814M5077j5550J18572K1407l3350j679j87847
19849B91038j4971R870J05789L7138N6460q2575o0927K45741r5585L8792J28687
19838F59457k4489M5740L748l6202K7295J66130O2992j07614l1869j35646K22472
19827H52014J06708m1284o829m4445r5427N4229n6029J0223q4381K24934j9148
$$ y = [-414703, -445038, -93270, -8158, -219869, -72659, -80664, -28467, -158834, -159078, -142903, -96359, -160213, -131312, -124770, -50036, -81033, -59914, 122065, -36817, -131224, -5652, 3595, 248695, 353747, 406760, 327657, 239523, 144349, 312599, 388353, 251658, -23069, 192406, 299193, 145309, 250862, 278206, 207680, 234879, 387771, 385636, 185072, 141922, 118602, 112492, 254677, 336548, 306594, 344408, 389485, 373935, 492507, 513914, 480564, 478885, 291038, 276067, 285937, 391726, 428864, 485324, 402749, 341822, 587563, 491978, 530770, 659457, 634968, 680708, 684456, 648254, 675549, 841679, 904671, 797057, 765188, 629542, 852014, 958722, 917438, 910609, 866164, 770737, 824966, 768937, 779160, 694779, 919713, 900565]
19816I00565o1520j92438o6164J39831k8323m1539n2245j20174O1364j11549
19806D27808j29898K30110R3536k39485J2246j6962j7518M7862O9317L9926k0849
19795D96093O920N208j37774R878k04887p1979Q5308J34594Q2146J02473J3163
19784E21143r8205J64833k49582k47943K03195n1266r6211J15038K9206m8368
19774B41840O2738P869n8435j17347j7933Q226j23876k0151R3812L6691k082l0516
19762H0836j16051R1768j9259j29229j66092O5569N5894j16029J74326P1377j06938
19751a13828P6167q6540k0062R1044P882J3552j68341L746j36099j07987K04487
19740b35979n561j8177k1922o9753J35705K19641o2660k53k9868J6801j13854
$$ y = [900565, 839045, 646607, 580443, 720274, 691951, 650412, 598167, 477993, 539357, 427808, 297910, 528020, 621556, 382071, 394317, 377355, 359837, 407699, 477016, 516942, 496093, 503013, 508221, 370447, 380325, 175438, 103459, 188767, 323361, 405507, 507980, 521143, 422938, 587771, 338189, 90246, 293441, 242175, 145964, 261002, 290208, 241840, 304578, 312447, 254012, 136665, 118732, 126958, 3082, -17069, 76743, 113434, 111352, 80836, -35215, 56553, 37294, -91935, -258027, -192458, -136564, -252593, -78267, -6890, -113828, -37661, -124201, -144263, -53219, -45337, -31785, -200126, -196380, -332479, -440466, -235979, -241540, -259717, -281639, -351392, -215687, 3954, -58706, -58959, -88827, -72026, -185880]
19729a85880m4356j11735K06490J13952j11666j06338M5312K776M7429n5248j01377
19718c00641q2169J46832Q7194K0944M4194q4676j17865J76586k5900j36478
19708b71979m7691n2618J55682L7437R4823o9926j30203j35592J42654P7326K2655
19697a77432J9115J1736P3749L909r028L2844j22732J17113j69536N8956q8311
19686b49617J25558K62833j4486j13188r0053j12994m8825J44757j03229r500J10613
19675i8131r6002K45314L1816o9620j49106j2780n4356k94740K53012J30692
19665a13901l9722n146N1188m1081p2456J00209J84914p9500J3612m7036j4403
19654f3322k54337J10451M7283L8801j08398J74589J10393j24228j73132q6782
$$ y = [-185880, -230236, -341971, -135481, -21529, -133195, -239533, -194221, -191445, -144016, -199264, -300641, -382810, -235978, -148784, -127840, -83646, -168322, -286187, -109601, -135501, -271979, -319670, -372288, -216606, -179169, -84346, -154272, -284475, -420067, -277413, -200087, -177432, -158317, -146581, -72832, -68923, -77951, -45107, -167839, -50726, -220262, -161306, -249617, -124059, 138774, 124288, 11100, -78953, -191947, -240772, -96015, -199244, -208744, -98131, -194133, 51181, 82997, 13377, -135729, -148509, -202865, -497605, -244593, -113901, -153623, -158769, -107581, -148662, -221118, -120909, 64005, -15495, -1883, -48919, -63322, -317659, -207208, -159925, -121124, -229522, -54933, 55460, -68768, -241900, -328682]
19644c28682J00993O9655P3776j84539P115J21486J98368j8026K6479j09434
19634d2809j03842L9615p1857l4810k7428K81158p5095j20951M7005J7199r7993
19623a89808J84495K1596q4165k64874M1755J82642K4044q2916k2865k8234n2113
19612b70443M0059k569m1888M4220M6328J03190J7891j64423l3018j8227J1993
19601b66887k1114L6478q2687J37386j12930m6401J53028J03577p0887K2264L0417
19590a17756Q9592O7342k20010k10289J40134K04486Q751m1081j39789J06572
19580a12048o8461P4819M2337j54616J03978j08554L8151J98800K8467j96807
19570a53934J27417q4870n2255J31418P5725m1611k13604J51395j5655k49138
$$ y = [-328682, -227689, -158034, -84258, -268797, -261682, -140196, 58172, 40146, 66625, -42809, -146651, -107036, -178893, -213703, -241131, 40027, -35068, -156019, -109014, -91815, -189808, -5313, 16283, -67882, -332756, -291001, -108359, -84315, -167231, -190096, -218330, -270443, -230384, -232953, -274841, -230621, -184293, -81103, -63212, -227635, -260653, -278880, -266887, -288001, -251523, -334210, -196824, -309754, -356155, -203127, -99550, -170437, -148173, -117756, -28164, 39178, -180832, -391121, -250987, -46501, -37750, -78831, -218620, -112048, -180509, -105690, -63353, -217969, -113991, -222545, -184394, 14406, 42873, -153934, -26517, -111387, -163642, -32224, 43501, 1890, -211714, -60319, -75974, -325112]
19560c25112K07351J13429j98565K7559R7200j57220j15069J79363n0275j0400
19550b31739J49339J8907m7859r7001k7290j36157R5891J47626M0962l4503k5090
19539a46914j5729m3440r984M680P3060j50069M2645J14527J09606N1003k41651
19528b12266j76008q649K39468j31099J652l4342J48653j22271J97735k4536o3532
19517a85195J31877k4133P0329j14477j62386q028J25179P7387j42334n354O5270
19506a71865J14303q6444j19546J75811N667J0897k06741N3515J24238j59750
19496b59915k9942J23946K26158N6015j07836n8032Q321p2386j41192L1882R4601
19485a28380k6388o188j9252M0894P7514k20692j32271Q2481P0292m8910P4358
$$ y = [-325112, -117761, -4332, -202897, -175338, -78138, -235358, -350427, -171064, -221339, -231739, -82400, -63493, -111352, -208353, -235643, -371800, -275909, -128283, -87321, -121824, -146914, -162643, -206083, -216067, -211387, -138327, -288396, -245751, -131224, -21618, 29385, -212266, -388274, -396923, -157455, -288554, -286902, -321244, -172591, -294862, -97127, -121663, -185195, -53318, -77451, -7122, -121599, -283985, -292013, -166834, -89447, -231781, -237135, -171865, -57562, -144006, -263552, -87741, -82074, -71177, -277918, -224403, -100165, -259915, -289857, -165911, 60247, 116262, 8426, -49606, -41285, -113671, -254863, -222981, -128380, -154768, -160956, -180208, -139314, -61800, -282492, -414763, -332282, -261990, -310900, -236542]
19474b36542j78580R2903M914M8668Q9589l027r7440K1267J36782o1205J0033
$$ y = [-236542, -415122, -322219, -317305, -268637, -179048, -182075, -279515, -258248, -121466, -182671, -172638]
$$ [...]
0G2857          $$ checkpoint
##END=
