##TITLE=$$ Begin of the data block
##JCAMP-DX=5.00 $$ ACD/SpecManager v 12.01
##DATE=20 Mar 2009 10:21:02
##DATA TYPE=INFRARED SPECTRUM
##DATA CLASS=XYDATA
##ORIGIN=
##OWNER=
##NPOINTS=881
##FIRSTX=210.00000000
##LASTX=650.00000000
##MAXX=650.00000000
##MINX=210.00000000
##MAXY=3.07599998
##MINY=0.00300000
##XFACTOR=1.0000000000
##YFACTOR=0.000000010000000
##FIRSTY=2.92499995
##DELTAX=0.50000000
##XUNITS=1/CM
##YUNITS=ARBITRARY UNITS
##XYDATA=(X++(Y..Y))
210B92499995J200009J699996J200008N99980K000022K199984R99999J100016L00002
214.5C03800011J199984J800013P99990%p99990k500010n999994j0299993j3900017
219B74099994j7199993j9300008j9099999j7599988j6000008j5199995j3999999j2300002
223A43400002j0500002r200001q399999p099998o200004n599999m699999l899998l100002
227.5H4700000l000003k800000k199995j700002j400000Tj300001r99999r00000r99999
232.5F8000001j099998j000005j199997j399999j400000j500005j599997j700002j699996
237E5400002j500005j699996j700001j699999j400000Tj500002j299998j200002j299998
242D0700001j300002j299998j400000j500001j499999j400000j400002j499999j400000
$$ plain form
210 292499995 293700004 295400000 296600008 297199988 299200010 301399994 302399993 303500009 303800011
214.5 303800011 304999995 306800008 307599998 307599998 306800008 304299998 298300004 288000011 274099994
219 274099994 256900001 237599993 218499994 200900006 184899998 169700003 155700004 143400002
223 143400002 132900000 123699999 115300000 108200002 101999998 96399999 91700000 87800002 84700000
227.5 84700000 81699997 78899997 76700002 75000000 73600000 72200000 70899999 69900000 69000000 68000001
232.5 68000001 66900003 65899998 64700001 63300002 61900002 60399997 58800000 57099998 55400002
237 55400002 53899997 52200001 50500000 48800001 47400001 46000001 44499999 43200001 41999999 40700001
242 40700001 39399999 38100001 36700001 35200000 33700001 32300001 30899999 29400000 28000000
246.5B8000000j300001j299998j300001j200000j000000r00001q99998q00001p00000
251A8600000n99999o00002m99999l99999m00001k99999m00001l00001k99999k00000
256A4600000k99999l00001Tj99998l00001Tj99999k00000Wj00000k00000j00000V%
265.5A1000000j00000T%j00000T%j00000T%j00000%j00000%Tj00000%j00000%j00000
275I900000%Tj00000%Tj00000%Tj00000%j00000%j00000%j00000%j00000U%j00000
285.5H900000%j00000T%j00000T%j00000T%j00000%j00000%j00000U%j00000%j00000
296G600000%Tj00000%Tj00000%Tj00000%Tj00000%Tj00000%j00000%j00000%Uj00000
307.5F800000%Tj00000T%Tj00000%Tj00000%Uj00000T%j00000%j00000%Tj00000%Tj00000
$$ plain form
246.5 28000000 26699999 25400001 24100000 22900000 21900000 20999999 20100001 19300000 18600000
251 18600000 18000001 17399999 16900000 16500001 16100000 15800001 15400000 15099999 14800000 14600000
256 14600000 14300001 14000000 13699999 13500001 13200000 12899999 12700000 12500000 12300000 12100000 11900000 11700000 11600000 11400000 11300000 11200000 11100000 11000000 11000000
265.5 11000000 10900000 10800000 10800000 10700000 10600000 10600000 10500000 10400000 10400000 10300000 10300000 10200000 10200000 10200000 10100000 10100000 10000000 10000000 9900000
275 9900000 9900000 9900000 9800000 9800000 9800000 9700000 9700000 9700000 9600000 9600000 9500000 9500000 9400000 9400000 9300000 9300000 9200000 9100000 9000000 9000000 8900000
285.5 8900000 8900000 8800000 8700000 8700000 8600000 8500000 8500000 8400000 8300000 8300000 8200000 8200000 8100000 8100000 8000000 7900000 7800000 7800000 7700000 7700000 7600000
296 7600000 7600000 7600000 7500000 7500000 7500000 7400000 7400000 7400000 7300000 7300000 7300000 7200000 7200000 7200000 7100000 7100000 7000000 7000000 6900000 6900000 6900000 6900000 6800000
307.5 6800000 6800000 6800000 6700000 6600000 6600000 6600000 6500000 6500000 6500000 6400000 6400000 6400000 6400000 6300000 6200000 6200000 6100000 6100000 6000000 6000000 6000000 5900000 5900000 5900000 5800000
320E800000%j00000%j00000%j00000%j00000%j00000%j00000T%Tj00000%Tj00000T%
330.5D800000j00000%j00000%j00000%j00000%Tj00000%j00000%j00000%Tj00000%
339.5D000000%j00000%j00000%j00000%j00000%j00000%Tj00000%j00000%Tj00000
348.5C200000%j00000%j00000%Uj00000T%Tj00000%Vj00000T%Tj00000%j00000%Vj00000
362.5B200000%Tj00000%j00000%Uj00000J00000j00000%j00000J00000j00000T%J00000
371.5A800000%j00000%Tj00000%Uj00000%Yj00000%Xj00000%Wj00000%Zj00000J00000
391.5A200000j00000%Zj00000%S3j00000%J00000j00000%S8j00000%J00000%j00000
416.5H00000%T1j00000J00000%j00000J00000%j00000%U2j00000%J00000%j00000J00000
$$ plain form
320 5800000 5800000 5700000 5700000 5600000 5600000 5500000 5500000 5400000 5400000 5300000 5300000 5200000 5100000 5100000 5100000 5000000 5000000 5000000 4900000 4800000 4800000
330.5 4800000 4700000 4700000 4600000 4600000 4500000 4500000 4400000 4400000 4400000 4300000 4300000 4200000 4200000 4100000 4100000 4100000 4000000 4000000
339.5 4000000 4000000 3900000 3900000 3800000 3800000 3700000 3700000 3600000 3600000 3500000 3500000 3500000 3400000 3400000 3300000 3300000 3300000 3200000
348.5 3200000 3200000 3100000 3100000 3000000 3000000 3000000 3000000 2900000 2800000 2800000 2800000 2700000 2700000 2700000 2700000 2700000 2600000 2500000 2500000 2500000 2400000 2400000 2300000 2300000 2300000 2300000 2300000 2200000
362.5 2200000 2200000 2200000 2100000 2100000 2000000 2000000 2000000 2000000 1900000 2000000 1900000 1900000 1800000 1900000 1800000 1700000 1700000 1800000
371.5 1800000 1800000 1700000 1700000 1700000 1600000 1600000 1600000 1600000 1500000 1500000 1500000 1500000 1500000 1500000 1500000 1500000 1400000 1400000 1400000 1400000 1400000 1400000 1400000 1300000 1300000 1300000 1300000 1300000 1300000 1200000 1200000 1200000 1200000 1200000 1200000 1200000 1200000 1200000 1100000 1200000
391.5 1200000 1100000 1100000 1100000 1100000 1100000 1100000 1100000 1100000 1100000 1000000 1000000 1000000 1000000 1000000 1000000 1000000 1000000 1000000 1000000 1000000 1000000 1000000 1000000 900000 900000 1000000 900000 900000 900000 900000 900000 900000 900000 900000 900000 900000 900000 900000 900000 900000 900000 900000 900000 900000 900000 800000 800000 900000 900000 800000
416.5 800000 800000 800000 800000 800000 800000 800000 800000 800000 800000 800000 800000 800000 800000 800000 800000 800000 800000 800000 800000 800000 800000 700000 800000 800000 700000 800000 800000 700000 700000 700000 700000 700000 700000 700000 700000 700000 700000 700000 700000 700000 700000 700000 700000 700000 700000 700000 700000 700000 700000 700000 700000 700000 700000 700000 700000 700000 700000 700000 700000 700000 600000 600000 700000 700000 600000 700000
449.5G00000%j00000%J00000j00000%W9j00000%ZJ00000%j00000%J00000j00000%TJ00000
490.5F00000j00000%TJ00000j00000%Y6j00000%J00000%Xj00000%J00000%j00000%
$$ plain form
449.5 700000 700000 600000 600000 700000 600000 600000 600000 600000 600000 600000 600000 600000 600000 600000 600000 600000 600000 600000 600000 600000 600000 600000 600000 600000 600000 600000 600000 600000 600000 600000 600000 600000 600000 600000 600000 600000 600000 600000 600000 600000 600000 600000 600000 600000 600000 600000 600000 600000 600000 600000 600000 600000 600000 600000 600000 600000 600000 600000 600000 600000 600000 600000 600000 600000 500000 500000 500000 500000 500000 500000 500000 500000 500000 600000 600000 500000 500000 600000 500000 500000 500000 600000
490.5 600000 500000 500000 500000 600000 500000 500000 500000 500000 500000 500000 500000 500000 500000 500000 500000 500000 500000 500000 500000 500000 500000 500000 500000 500000 500000 500000 500000 500000 500000 500000 500000 500000 500000 500000 500000 500000 500000 500000 500000 500000 500000 500000 500000 500000 500000 500000 500000 500000 500000 500000 500000 500000 500000 500000 500000 500000 500000 500000 500000 500000 500000 500000 500000 500000 500000 500000 500000 500000 500000 500000 500000 500000 500000 500000 500000 500000 500000 500000 500000 500000 500000 400000 400000 500000 500000 500000 500000 500000 500000 500000 400000 400000 500000 500000 400000 400000
538.5D00000%VJ00000j00000%S50j00000J00000%Uj00000%TJ00000%T2j00000%S3J00000
639.5D00000%j00000%UJ00000%Wj00000%s
650C00000
$$ plain form
639.5 400000 400000 300000 300000 300000 300000 400000 400000 400000 400000 400000 400000 300000 300000 300000 300000 300000 300000 300000 300000 300000 300000
650 300000
##END=$$ End of the data block
